beam-commits mailing list archives

Site index · List index
Message view « Date » · « Thread »
Top « Date » · « Thread »
From Apache Jenkins Server <jenk...@builds.apache.org>
Subject Build failed in Jenkins: beam_PostCommit_Java_ValidatesRunner_Spark #2574
Date Fri, 07 Jul 2017 12:18:46 GMT
See <https://builds.apache.org/job/beam_PostCommit_Java_ValidatesRunner_Spark/2574/display/redirect>

------------------------------------------
[...truncated 493.72 KB...]
2017-07-07T12:10:03.887 [INFO] Tests run: 2, Failures: 0, Errors: 0, Skipped: 0, Time elapsed:
0.507 s - in org.apache.beam.sdk.io.FileBasedSourceTest
2017-07-07T12:10:03.887 [INFO] Running org.apache.beam.sdk.io.TFRecordIOTest
2017-07-07T12:10:08.693 [INFO] Tests run: 16, Failures: 0, Errors: 0, Skipped: 0, Time elapsed:
4.804 s - in org.apache.beam.sdk.io.TFRecordIOTest
2017-07-07T12:10:08.693 [INFO] Running org.apache.beam.sdk.testing.GatherAllPanesTest
2017-07-07T12:10:12.126 [INFO] Tests run: 2, Failures: 0, Errors: 0, Skipped: 0, Time elapsed:
3.431 s - in org.apache.beam.sdk.testing.GatherAllPanesTest
2017-07-07T12:10:12.126 [INFO] Running org.apache.beam.sdk.coders.CoderRegistryTest
2017-07-07T12:10:12.357 [INFO] Tests run: 2, Failures: 0, Errors: 0, Skipped: 0, Time elapsed:
0.229 s - in org.apache.beam.sdk.coders.CoderRegistryTest
2017-07-07T12:10:12.357 [INFO] Running org.apache.beam.sdk.transforms.CountTest
2017-07-07T12:10:12.773 [INFO] Tests run: 4, Failures: 0, Errors: 0, Skipped: 0, Time elapsed:
0.414 s - in org.apache.beam.sdk.transforms.CountTest
2017-07-07T12:10:12.773 [INFO] Running org.apache.beam.sdk.transforms.KeysTest
2017-07-07T12:10:12.941 [INFO] Tests run: 2, Failures: 0, Errors: 0, Skipped: 0, Time elapsed:
0.166 s - in org.apache.beam.sdk.transforms.KeysTest
2017-07-07T12:10:12.941 [INFO] Running org.apache.beam.sdk.transforms.ToStringTest
2017-07-07T12:10:13.573 [INFO] Tests run: 5, Failures: 0, Errors: 0, Skipped: 0, Time elapsed:
0.63 s - in org.apache.beam.sdk.transforms.ToStringTest
2017-07-07T12:10:13.573 [INFO] Running org.apache.beam.sdk.transforms.FlatMapElementsTest
2017-07-07T12:10:13.768 [INFO] Tests run: 3, Failures: 0, Errors: 0, Skipped: 0, Time elapsed:
0.193 s - in org.apache.beam.sdk.transforms.FlatMapElementsTest
2017-07-07T12:10:13.768 [INFO] Running org.apache.beam.sdk.transforms.CombineFnsTest
2017-07-07T12:10:14.401 [INFO] Tests run: 3, Failures: 0, Errors: 0, Skipped: 0, Time elapsed:
0.631 s - in org.apache.beam.sdk.transforms.CombineFnsTest
2017-07-07T12:10:14.401 [INFO] Running org.apache.beam.sdk.transforms.windowing.WindowingTest
2017-07-07T12:10:15.120 [INFO] Tests run: 6, Failures: 0, Errors: 0, Skipped: 0, Time elapsed:
0.717 s - in org.apache.beam.sdk.transforms.windowing.WindowingTest
2017-07-07T12:10:15.121 [INFO] Running org.apache.beam.sdk.transforms.RegexTest
2017-07-07T12:10:18.333 [INFO] Tests run: 27, Failures: 0, Errors: 0, Skipped: 0, Time elapsed:
3.209 s - in org.apache.beam.sdk.transforms.RegexTest
2017-07-07T12:10:18.865 [INFO] 
2017-07-07T12:10:18.865 [INFO] Results:
2017-07-07T12:10:18.865 [INFO] 
2017-07-07T12:10:18.865 [WARNING] Tests run: 489, Failures: 0, Errors: 0, Skipped: 1
2017-07-07T12:10:18.865 [INFO] 
[JENKINS] Recording test results
2017-07-07T12:10:23.068 [INFO] 
2017-07-07T12:10:23.068 [INFO] --- maven-dependency-plugin:3.0.1:analyze-only (default) @
beam-runners-direct-java ---
2017-07-07T12:10:23.228 [INFO] No dependency problems found
[JENKINS] Archiving disabled
2017-07-07T12:10:26.919 [INFO]                                                           
             
2017-07-07T12:10:26.920 [INFO] ------------------------------------------------------------------------
2017-07-07T12:10:26.920 [INFO] Building Apache Beam :: SDKs :: Java :: IO 2.2.0-SNAPSHOT
2017-07-07T12:10:26.920 [INFO] ------------------------------------------------------------------------
2017-07-07T12:10:26.923 [INFO] 
2017-07-07T12:10:26.923 [INFO] --- maven-clean-plugin:3.0.0:clean (default-clean) @ beam-sdks-java-io-parent
---
2017-07-07T12:10:26.925 [INFO] Deleting <https://builds.apache.org/job/beam_PostCommit_Java_ValidatesRunner_Spark/ws/sdks/java/io>
(includes = [**/*.pyc, **/*.egg-info/, **/sdks/python/LICENSE, **/sdks/python/NOTICE, **/sdks/python/README.md],
excludes = [])
2017-07-07T12:10:27.013 [INFO] 
2017-07-07T12:10:27.014 [INFO] --- maven-enforcer-plugin:1.4.1:enforce (enforce) @ beam-sdks-java-io-parent
---
2017-07-07T12:10:27.066 [INFO] 
2017-07-07T12:10:27.066 [INFO] --- maven-enforcer-plugin:1.4.1:enforce (enforce-banned-dependencies)
@ beam-sdks-java-io-parent ---
2017-07-07T12:10:27.141 [INFO] 
2017-07-07T12:10:27.141 [INFO] --- maven-remote-resources-plugin:1.5:process (process-resource-bundles)
@ beam-sdks-java-io-parent ---
2017-07-07T12:10:27.203 [INFO] 
2017-07-07T12:10:27.203 [INFO] --- maven-checkstyle-plugin:2.17:check (default) @ beam-sdks-java-io-parent
---
2017-07-07T12:10:27.830 [INFO] Starting audit...
Audit done.
2017-07-07T12:10:28.610 [INFO] 
2017-07-07T12:10:28.610 [INFO] --- build-helper-maven-plugin:3.0.0:regex-properties (render-artifact-id)
@ beam-sdks-java-io-parent ---
2017-07-07T12:10:28.665 [INFO] 
2017-07-07T12:10:28.665 [INFO] --- maven-site-plugin:3.5.1:attach-descriptor (attach-descriptor)
@ beam-sdks-java-io-parent ---
2017-07-07T12:10:28.774 [INFO] 
2017-07-07T12:10:28.775 [INFO] --- maven-jar-plugin:3.0.2:jar (default-jar) @ beam-sdks-java-io-parent
---
2017-07-07T12:10:28.776 [INFO] Skipping packaging of the jar
2017-07-07T12:10:30.322 [INFO] 
2017-07-07T12:10:30.322 [INFO] --- maven-jar-plugin:3.0.2:test-jar (default-test-jar) @ beam-sdks-java-io-parent
---
2017-07-07T12:10:30.323 [INFO] Skipping packaging of the test-jar
2017-07-07T12:10:30.418 [INFO] 
2017-07-07T12:10:30.418 [INFO] --- maven-shade-plugin:3.0.0:shade (bundle-and-repackage) @
beam-sdks-java-io-parent ---
2017-07-07T12:10:30.422 [INFO] Replacing original artifact with shaded artifact.
2017-07-07T12:10:30.474 [INFO] 
2017-07-07T12:10:30.474 [INFO] --- maven-dependency-plugin:3.0.1:analyze-only (default) @
beam-sdks-java-io-parent ---
2017-07-07T12:10:30.475 [INFO] Skipping pom project
[JENKINS] Archiving disabled
2017-07-07T12:10:39.039 [INFO]                                                           
             
2017-07-07T12:10:39.039 [INFO] ------------------------------------------------------------------------
2017-07-07T12:10:39.039 [INFO] Building Apache Beam :: SDKs :: Java :: IO :: Kafka 2.2.0-SNAPSHOT
2017-07-07T12:10:39.039 [INFO] ------------------------------------------------------------------------
2017-07-07T12:10:39.044 [INFO] Downloading: https://repo.maven.apache.org/maven2/org/apache/kafka/kafka-clients/0.10.1.0/kafka-clients-0.10.1.0.pom
[INFO] I/O exception (java.net.SocketException) caught when processing request to {s}->https://repo.maven.apache.org:443:
Connection reset
[INFO] Retrying request to {s}->https://repo.maven.apache.org:443
[INFO] I/O exception (java.net.SocketException) caught when processing request to {s}->https://repo.maven.apache.org:443:
Connection reset
[INFO] Retrying request to {s}->https://repo.maven.apache.org:443
[INFO] I/O exception (java.net.SocketException) caught when processing request to {s}->https://repo.maven.apache.org:443:
Connection reset
[INFO] Retrying request to {s}->https://repo.maven.apache.org:443
2017-07-07T12:10:39.103 [INFO] Downloading: https://repo.maven.apache.org/maven2/org/springframework/spring-expression/4.3.5.RELEASE/spring-expression-4.3.5.RELEASE.pom
2017-07-07T12:10:39.130 [INFO] Downloaded: https://repo.maven.apache.org/maven2/org/springframework/spring-expression/4.3.5.RELEASE/spring-expression-4.3.5.RELEASE.pom
(2 KB at 62.3 KB/sec)
2017-07-07T12:10:39.133 [INFO] Downloading: https://repo.maven.apache.org/maven2/org/springframework/spring-core/4.3.5.RELEASE/spring-core-4.3.5.RELEASE.pom
2017-07-07T12:10:39.160 [INFO] Downloaded: https://repo.maven.apache.org/maven2/org/springframework/spring-core/4.3.5.RELEASE/spring-core-4.3.5.RELEASE.pom
(3 KB at 90.1 KB/sec)
2017-07-07T12:10:39.163 [INFO] Downloading: https://repo.maven.apache.org/maven2/commons-logging/commons-logging/1.2/commons-logging-1.2.pom
2017-07-07T12:10:39.189 [INFO] Downloaded: https://repo.maven.apache.org/maven2/commons-logging/commons-logging/1.2/commons-logging-1.2.pom
(19 KB at 721.4 KB/sec)
[JENKINS] Archiving disabled
[JENKINS] Archiving disabled
[JENKINS] Archiving disabled
[JENKINS] Archiving disabled
[JENKINS] Archiving disabled
[JENKINS] Archiving disabled
[JENKINS] Archiving disabled
[JENKINS] Archiving disabled
[JENKINS] Archiving disabled
[JENKINS] Archiving disabled
[JENKINS] Archiving disabled
[JENKINS] Archiving disabled
[JENKINS] Archiving disabled
[JENKINS] Archiving disabled
[JENKINS] Archiving disabled
2017-07-07T12:10:52.805 [INFO] ------------------------------------------------------------------------
2017-07-07T12:10:52.805 [INFO] Reactor Summary:
2017-07-07T12:10:52.805 [INFO] 
2017-07-07T12:10:52.805 [INFO] Apache Beam :: Parent .............................. SUCCESS
[ 24.611 s]
2017-07-07T12:10:52.805 [INFO] Apache Beam :: SDKs :: Java :: Build Tools ......... SUCCESS
[  8.171 s]
2017-07-07T12:10:52.805 [INFO] Apache Beam :: SDKs ................................ SUCCESS
[  4.339 s]
2017-07-07T12:10:52.805 [INFO] Apache Beam :: SDKs :: Common ...................... SUCCESS
[  3.461 s]
2017-07-07T12:10:52.805 [INFO] Apache Beam :: SDKs :: Common :: Runner API ........ SUCCESS
[ 11.838 s]
2017-07-07T12:10:52.805 [INFO] Apache Beam :: SDKs :: Common :: Fn API ............ SUCCESS
[ 14.960 s]
2017-07-07T12:10:52.805 [INFO] Apache Beam :: SDKs :: Java ........................ SUCCESS
[  2.237 s]
2017-07-07T12:10:52.806 [INFO] Apache Beam :: SDKs :: Java :: Core ................ SUCCESS
[02:04 min]
2017-07-07T12:10:52.806 [INFO] Apache Beam :: Runners ............................. SUCCESS
[  1.330 s]
2017-07-07T12:10:52.806 [INFO] Apache Beam :: Runners :: Core Construction Java ... SUCCESS
[ 20.708 s]
2017-07-07T12:10:52.806 [INFO] Apache Beam :: Runners :: Core Java ................ SUCCESS
[ 33.250 s]
2017-07-07T12:10:52.806 [INFO] Apache Beam :: Runners :: Direct Java .............. SUCCESS
[03:54 min]
2017-07-07T12:10:52.806 [INFO] Apache Beam :: SDKs :: Java :: IO .................. SUCCESS
[  4.226 s]
2017-07-07T12:10:52.806 [INFO] Apache Beam :: SDKs :: Java :: IO :: Kafka ......... FAILURE
[  1.422 s]
2017-07-07T12:10:52.806 [INFO] Apache Beam :: Runners :: Spark .................... SKIPPED
2017-07-07T12:10:52.806 [INFO] ------------------------------------------------------------------------
2017-07-07T12:10:52.806 [INFO] BUILD FAILURE
2017-07-07T12:10:52.806 [INFO] ------------------------------------------------------------------------
2017-07-07T12:10:52.806 [INFO] Total time: 09:14 min
2017-07-07T12:10:52.806 [INFO] Finished at: 2017-07-07T12:10:52+00:00
[JENKINS] Archiving disabled
2017-07-07T12:10:54.141 [INFO] Final Memory: 122M/1457M
2017-07-07T12:10:54.141 [INFO] ------------------------------------------------------------------------
2017-07-07T12:10:54.141 [WARNING] The requested profile "validates-runner-tests" could not
be activated because it does not exist.
Waiting for Jenkins to finish collecting data
2017-07-07T12:18:25.473 [ERROR] Failed to execute goal on project beam-sdks-java-io-kafka:
Could not resolve dependencies for project org.apache.beam:beam-sdks-java-io-kafka:jar:2.2.0-SNAPSHOT:
Failed to collect dependencies at org.apache.kafka:kafka-clients:jar:0.10.1.0: Failed to read
artifact descriptor for org.apache.kafka:kafka-clients:jar:0.10.1.0: Could not transfer artifact
org.apache.kafka:kafka-clients:pom:0.10.1.0 from/to central (https://repo.maven.apache.org/maven2):
Connection reset -> [Help 1]
org.apache.maven.lifecycle.LifecycleExecutionException: Failed to execute goal on project
beam-sdks-java-io-kafka: Could not resolve dependencies for project org.apache.beam:beam-sdks-java-io-kafka:jar:2.2.0-SNAPSHOT:
Failed to collect dependencies at org.apache.kafka:kafka-clients:jar:0.10.1.0
	at org.apache.maven.lifecycle.internal.LifecycleDependencyResolver.getDependencies(LifecycleDependencyResolver.java:221)
	at org.apache.maven.lifecycle.internal.LifecycleDependencyResolver.resolveProjectDependencies(LifecycleDependencyResolver.java:127)
	at org.apache.maven.lifecycle.internal.MojoExecutor.ensureDependenciesAreResolved(MojoExecutor.java:257)
	at org.apache.maven.lifecycle.internal.MojoExecutor.execute(MojoExecutor.java:200)
	at org.apache.maven.lifecycle.internal.MojoExecutor.execute(MojoExecutor.java:153)
	at org.apache.maven.lifecycle.internal.MojoExecutor.execute(MojoExecutor.java:145)
	at org.apache.maven.lifecycle.internal.LifecycleModuleBuilder.buildProject(LifecycleModuleBuilder.java:116)
	at org.apache.maven.lifecycle.internal.LifecycleModuleBuilder.buildProject(LifecycleModuleBuilder.java:80)
	at org.apache.maven.lifecycle.internal.builder.singlethreaded.SingleThreadedBuilder.build(SingleThreadedBuilder.java:51)
	at org.apache.maven.lifecycle.internal.LifecycleStarter.execute(LifecycleStarter.java:128)
	at org.apache.maven.DefaultMaven.doExecute(DefaultMaven.java:307)
	at org.apache.maven.DefaultMaven.doExecute(DefaultMaven.java:193)
	at org.apache.maven.DefaultMaven.execute(DefaultMaven.java:106)
	at org.jvnet.hudson.maven3.launcher.Maven33Launcher.main(Maven33Launcher.java:129)
	at sun.reflect.NativeMethodAccessorImpl.invoke0(Native Method)
	at sun.reflect.NativeMethodAccessorImpl.invoke(NativeMethodAccessorImpl.java:62)
	at sun.reflect.DelegatingMethodAccessorImpl.invoke(DelegatingMethodAccessorImpl.java:43)
	at java.lang.reflect.Method.invoke(Method.java:498)
	at org.codehaus.plexus.classworlds.launcher.Launcher.launchStandard(Launcher.java:330)
	at org.codehaus.plexus.classworlds.launcher.Launcher.launch(Launcher.java:238)
	at jenkins.maven3.agent.Maven33Main.launch(Maven33Main.java:176)
	at sun.reflect.NativeMethodAccessorImpl.invoke0(Native Method)
	at sun.reflect.NativeMethodAccessorImpl.invoke(NativeMethodAccessorImpl.java:62)
	at sun.reflect.DelegatingMethodAccessorImpl.invoke(DelegatingMethodAccessorImpl.java:43)
	at java.lang.reflect.Method.invoke(Method.java:498)
	at hudson.maven.Maven3Builder.call(Maven3Builder.java:139)
	at hudson.maven.Maven3Builder.call(Maven3Builder.java:70)
	at hudson.remoting.UserRequest.perform(UserRequest.java:153)
	at hudson.remoting.UserRequest.perform(UserRequest.java:50)
	at hudson.remoting.Request$2.run(Request.java:336)
	at hudson.remoting.InterceptingExecutorService$1.call(InterceptingExecutorService.java:68)
	at java.util.concurrent.FutureTask.run(FutureTask.java:266)
	at java.util.concurrent.ThreadPoolExecutor.runWorker(ThreadPoolExecutor.java:1142)
	at java.util.concurrent.ThreadPoolExecutor$Worker.run(ThreadPoolExecutor.java:617)
	at java.lang.Thread.run(Thread.java:748)
Caused by: org.apache.maven.project.DependencyResolutionException: Could not resolve dependencies
for project org.apache.beam:beam-sdks-java-io-kafka:jar:2.2.0-SNAPSHOT: Failed to collect
dependencies at org.apache.kafka:kafka-clients:jar:0.10.1.0
	at org.apache.maven.project.DefaultProjectDependenciesResolver.resolve(DefaultProjectDependenciesResolver.java:180)
	at org.apache.maven.lifecycle.internal.LifecycleDependencyResolver.getDependencies(LifecycleDependencyResolver.java:195)
	... 34 more
Caused by: org.eclipse.aether.collection.DependencyCollectionException: Failed to collect
dependencies at org.apache.kafka:kafka-clients:jar:0.10.1.0
	at org.eclipse.aether.internal.impl.DefaultDependencyCollector.collectDependencies(DefaultDependencyCollector.java:291)
	at org.eclipse.aether.internal.impl.DefaultRepositorySystem.collectDependencies(DefaultRepositorySystem.java:316)
	at org.apache.maven.project.DefaultProjectDependenciesResolver.resolve(DefaultProjectDependenciesResolver.java:172)
	... 35 more
Caused by: org.eclipse.aether.resolution.ArtifactDescriptorException: Failed to read artifact
descriptor for org.apache.kafka:kafka-clients:jar:0.10.1.0
	at org.apache.maven.repository.internal.DefaultArtifactDescriptorReader.loadPom(DefaultArtifactDescriptorReader.java:302)
	at org.apache.maven.repository.internal.DefaultArtifactDescriptorReader.readArtifactDescriptor(DefaultArtifactDescriptorReader.java:218)
	at org.eclipse.aether.internal.impl.DefaultDependencyCollector.resolveCachedArtifactDescriptor(DefaultDependencyCollector.java:535)
	at org.eclipse.aether.internal.impl.DefaultDependencyCollector.getArtifactDescriptorResult(DefaultDependencyCollector.java:519)
	at org.eclipse.aether.internal.impl.DefaultDependencyCollector.processDependency(DefaultDependencyCollector.java:409)
	at org.eclipse.aether.internal.impl.DefaultDependencyCollector.processDependency(DefaultDependencyCollector.java:363)
	at org.eclipse.aether.internal.impl.DefaultDependencyCollector.process(DefaultDependencyCollector.java:351)
	at org.eclipse.aether.internal.impl.DefaultDependencyCollector.collectDependencies(DefaultDependencyCollector.java:254)
	... 37 more
Caused by: org.eclipse.aether.resolution.ArtifactResolutionException: Could not transfer artifact
org.apache.kafka:kafka-clients:pom:0.10.1.0 from/to central (https://repo.maven.apache.org/maven2):
Connection reset
	at org.eclipse.aether.internal.impl.DefaultArtifactResolver.resolve(DefaultArtifactResolver.java:444)
	at org.eclipse.aether.internal.impl.DefaultArtifactResolver.resolveArtifacts(DefaultArtifactResolver.java:246)
	at org.eclipse.aether.internal.impl.DefaultArtifactResolver.resolveArtifact(DefaultArtifactResolver.java:223)
	at org.apache.maven.repository.internal.DefaultArtifactDescriptorReader.loadPom(DefaultArtifactDescriptorReader.java:287)
	... 44 more
Caused by: org.eclipse.aether.transfer.ArtifactTransferException: Could not transfer artifact
org.apache.kafka:kafka-clients:pom:0.10.1.0 from/to central (https://repo.maven.apache.org/maven2):
Connection reset
	at org.eclipse.aether.connector.basic.ArtifactTransportListener.transferFailed(ArtifactTransportListener.java:43)
	at org.eclipse.aether.connector.basic.BasicRepositoryConnector$TaskRunner.run(BasicRepositoryConnector.java:355)
	at org.eclipse.aether.util.concurrency.RunnableErrorForwarder$1.run(RunnableErrorForwarder.java:67)
	at org.eclipse.aether.connector.basic.BasicRepositoryConnector$DirectExecutor.execute(BasicRepositoryConnector.java:581)
	at org.eclipse.aether.connector.basic.BasicRepositoryConnector.get(BasicRepositoryConnector.java:249)
	at org.eclipse.aether.internal.impl.DefaultArtifactResolver.performDownloads(DefaultArtifactResolver.java:520)
	at org.eclipse.aether.internal.impl.DefaultArtifactResolver.resolve(DefaultArtifactResolver.java:421)
	... 47 more
Caused by: org.apache.maven.wagon.TransferFailedException: Connection reset
	at org.apache.maven.wagon.providers.http.AbstractHttpClientWagon.fillInputData(AbstractHttpClientWagon.java:1066)
	at org.apache.maven.wagon.providers.http.AbstractHttpClientWagon.fillInputData(AbstractHttpClientWagon.java:960)
	at org.apache.maven.wagon.StreamWagon.getInputStream(StreamWagon.java:116)
	at org.apache.maven.wagon.StreamWagon.getIfNewer(StreamWagon.java:88)
	at org.apache.maven.wagon.StreamWagon.get(StreamWagon.java:61)
	at org.eclipse.aether.transport.wagon.WagonTransporter$GetTaskRunner.run(WagonTransporter.java:560)
	at org.eclipse.aether.transport.wagon.WagonTransporter.execute(WagonTransporter.java:427)
	at org.eclipse.aether.transport.wagon.WagonTransporter.get(WagonTransporter.java:404)
	at org.eclipse.aether.connector.basic.BasicRepositoryConnector$GetTaskRunner.runTask(BasicRepositoryConnector.java:447)
	at org.eclipse.aether.connector.basic.BasicRepositoryConnector$TaskRunner.run(BasicRepositoryConnector.java:350)
	... 52 more
Caused by: java.net.SocketException: Connection reset
	at java.net.SocketInputStream.read(SocketInputStream.java:210)
	at java.net.SocketInputStream.read(SocketInputStream.java:141)
	at sun.security.ssl.InputRecord.readFully(InputRecord.java:465)
	at sun.security.ssl.InputRecord.read(InputRecord.java:503)
	at sun.security.ssl.SSLSocketImpl.readRecord(SSLSocketImpl.java:973)
	at sun.security.ssl.SSLSocketImpl.readDataRecord(SSLSocketImpl.java:930)
	at sun.security.ssl.AppInputStream.read(AppInputStream.java:105)
	at org.apache.maven.wagon.providers.http.httpclient.impl.io.SessionInputBufferImpl.streamRead(SessionInputBufferImpl.java:136)
	at org.apache.maven.wagon.providers.http.httpclient.impl.io.SessionInputBufferImpl.fillBuffer(SessionInputBufferImpl.java:152)
	at org.apache.maven.wagon.providers.http.httpclient.impl.io.SessionInputBufferImpl.readLine(SessionInputBufferImpl.java:270)
	at org.apache.maven.wagon.providers.http.httpclient.impl.conn.DefaultHttpResponseParser.parseHead(DefaultHttpResponseParser.java:140)
	at org.apache.maven.wagon.providers.http.httpclient.impl.conn.DefaultHttpResponseParser.parseHead(DefaultHttpResponseParser.java:57)
	at org.apache.maven.wagon.providers.http.httpclient.impl.io.AbstractMessageParser.parse(AbstractMessageParser.java:260)
	at org.apache.maven.wagon.providers.http.httpclient.impl.DefaultBHttpClientConnection.receiveResponseHeader(DefaultBHttpClientConnection.java:161)
	at org.apache.maven.wagon.providers.http.httpclient.impl.conn.CPoolProxy.receiveResponseHeader(CPoolProxy.java:153)
	at org.apache.maven.wagon.providers.http.httpclient.protocol.HttpRequestExecutor.doReceiveResponse(HttpRequestExecutor.java:271)
	at org.apache.maven.wagon.providers.http.httpclient.protocol.HttpRequestExecutor.execute(HttpRequestExecutor.java:123)
	at org.apache.maven.wagon.providers.http.httpclient.impl.execchain.MainClientExec.execute(MainClientExec.java:254)
	at org.apache.maven.wagon.providers.http.httpclient.impl.execchain.ProtocolExec.execute(ProtocolExec.java:195)
	at org.apache.maven.wagon.providers.http.httpclient.impl.execchain.RetryExec.execute(RetryExec.java:86)
	at org.apache.maven.wagon.providers.http.httpclient.impl.execchain.RedirectExec.execute(RedirectExec.java:108)
	at org.apache.maven.wagon.providers.http.httpclient.impl.client.InternalHttpClient.doExecute(InternalHttpClient.java:184)
	at org.apache.maven.wagon.providers.http.httpclient.impl.client.CloseableHttpClient.execute(CloseableHttpClient.java:82)
	at org.apache.maven.wagon.providers.http.AbstractHttpClientWagon.execute(AbstractHttpClientWagon.java:832)
	at org.apache.maven.wagon.providers.http.AbstractHttpClientWagon.fillInputData(AbstractHttpClientWagon.java:983)
	... 61 more
2017-07-07T12:18:25.475 [ERROR] 
2017-07-07T12:18:25.475 [ERROR] Re-run Maven using the -X switch to enable full debug logging.
2017-07-07T12:18:25.475 [ERROR] 
2017-07-07T12:18:25.475 [ERROR] For more information about the errors and possible solutions,
please read the following articles:
2017-07-07T12:18:25.475 [ERROR] [Help 1] http://cwiki.apache.org/confluence/display/MAVEN/DependencyResolutionException
2017-07-07T12:18:25.475 [ERROR] 
2017-07-07T12:18:25.476 [ERROR] After correcting the problems, you can resume the build with
the command
2017-07-07T12:18:25.476 [ERROR]   mvn <goals> -rf :beam-sdks-java-io-kafka
channel stopped
Not sending mail to unregistered user mairbek@google.com
Not sending mail to unregistered user klk@google.com
Not sending mail to unregistered user sisk@google.com
Not sending mail to unregistered user ccy@google.com
Not sending mail to unregistered user kirpichov@google.com

Mime
View raw message