beam-commits mailing list archives

Site index · List index
Message view « Date » · « Thread »
Top « Date » · « Thread »
From Apache Jenkins Server <jenk...@builds.apache.org>
Subject Build failed in Jenkins: beam_PostCommit_Java_ValidatesRunner_Apex #2035
Date Fri, 21 Jul 2017 17:06:34 GMT
See <https://builds.apache.org/job/beam_PostCommit_Java_ValidatesRunner_Apex/2035/display/redirect?page=changes>

Changes:

[tgroh] Register a PTransformTranslator for Combine

------------------------------------------
[...truncated 53.91 KB...]
2017-07-21T17:06:14.763 [INFO] Downloaded: https://repo.maven.apache.org/maven2/org/apache/maven/doxia/doxia-logging-api/1.1/doxia-logging-api-1.1.pom
(2 KB at 57.0 KB/sec)
2017-07-21T17:06:14.766 [INFO] Downloading: https://repo.maven.apache.org/maven2/org/codehaus/plexus/plexus-container-default/1.0-alpha-30/plexus-container-default-1.0-alpha-30.pom
2017-07-21T17:06:14.793 [INFO] Downloaded: https://repo.maven.apache.org/maven2/org/codehaus/plexus/plexus-container-default/1.0-alpha-30/plexus-container-default-1.0-alpha-30.pom
(4 KB at 125.8 KB/sec)
2017-07-21T17:06:14.795 [INFO] Downloading: https://repo.maven.apache.org/maven2/org/codehaus/plexus/plexus-containers/1.0-alpha-30/plexus-containers-1.0-alpha-30.pom
2017-07-21T17:06:14.834 [INFO] Downloaded: https://repo.maven.apache.org/maven2/org/codehaus/plexus/plexus-containers/1.0-alpha-30/plexus-containers-1.0-alpha-30.pom
(2 KB at 46.2 KB/sec)
2017-07-21T17:06:14.835 [INFO] Downloading: https://repo.maven.apache.org/maven2/org/codehaus/plexus/plexus/1.0.11/plexus-1.0.11.pom
2017-07-21T17:06:14.862 [INFO] Downloaded: https://repo.maven.apache.org/maven2/org/codehaus/plexus/plexus/1.0.11/plexus-1.0.11.pom
(9 KB at 324.4 KB/sec)
2017-07-21T17:06:14.864 [INFO] Downloading: https://repo.maven.apache.org/maven2/org/codehaus/plexus/plexus-classworlds/1.2-alpha-9/plexus-classworlds-1.2-alpha-9.pom
2017-07-21T17:06:14.901 [INFO] Downloaded: https://repo.maven.apache.org/maven2/org/codehaus/plexus/plexus-classworlds/1.2-alpha-9/plexus-classworlds-1.2-alpha-9.pom
(4 KB at 85.1 KB/sec)
2017-07-21T17:06:14.903 [INFO] Downloading: https://repo.maven.apache.org/maven2/org/codehaus/plexus/plexus/1.0.10/plexus-1.0.10.pom
2017-07-21T17:06:14.931 [INFO] Downloaded: https://repo.maven.apache.org/maven2/org/codehaus/plexus/plexus/1.0.10/plexus-1.0.10.pom
(9 KB at 287.7 KB/sec)
2017-07-21T17:06:14.934 [INFO] Downloading: https://repo.maven.apache.org/maven2/org/apache/maven/maven-error-diagnostics/2.2.1/maven-error-diagnostics-2.2.1.pom
2017-07-21T17:06:14.961 [INFO] Downloaded: https://repo.maven.apache.org/maven2/org/apache/maven/maven-error-diagnostics/2.2.1/maven-error-diagnostics-2.2.1.pom
(2 KB at 61.8 KB/sec)
2017-07-21T17:06:14.965 [INFO] Downloading: https://repo.maven.apache.org/maven2/commons-cli/commons-cli/1.2/commons-cli-1.2.pom
2017-07-21T17:06:14.994 [INFO] Downloaded: https://repo.maven.apache.org/maven2/commons-cli/commons-cli/1.2/commons-cli-1.2.pom
(8 KB at 268.7 KB/sec)
2017-07-21T17:06:14.996 [INFO] Downloading: https://repo.maven.apache.org/maven2/org/apache/commons/commons-parent/11/commons-parent-11.pom
2017-07-21T17:06:15.024 [INFO] Downloaded: https://repo.maven.apache.org/maven2/org/apache/commons/commons-parent/11/commons-parent-11.pom
(25 KB at 859.7 KB/sec)
2017-07-21T17:06:15.027 [INFO] Downloading: https://repo.maven.apache.org/maven2/org/apache/apache/4/apache-4.pom
2017-07-21T17:06:15.054 [INFO] Downloaded: https://repo.maven.apache.org/maven2/org/apache/apache/4/apache-4.pom
(5 KB at 162.6 KB/sec)
2017-07-21T17:06:15.057 [INFO] Downloading: https://repo.maven.apache.org/maven2/org/apache/maven/maven-plugin-descriptor/2.2.1/maven-plugin-descriptor-2.2.1.pom
2017-07-21T17:06:15.083 [INFO] Downloaded: https://repo.maven.apache.org/maven2/org/apache/maven/maven-plugin-descriptor/2.2.1/maven-plugin-descriptor-2.2.1.pom
(3 KB at 77.5 KB/sec)
2017-07-21T17:06:15.086 [INFO] Downloading: https://repo.maven.apache.org/maven2/org/codehaus/plexus/plexus-interactivity-api/1.0-alpha-4/plexus-interactivity-api-1.0-alpha-4.pom
2017-07-21T17:06:15.137 [INFO] Downloaded: https://repo.maven.apache.org/maven2/org/codehaus/plexus/plexus-interactivity-api/1.0-alpha-4/plexus-interactivity-api-1.0-alpha-4.pom
(7 KB at 135.8 KB/sec)
2017-07-21T17:06:15.140 [INFO] Downloading: https://repo.maven.apache.org/maven2/org/apache/maven/maven-monitor/2.2.1/maven-monitor-2.2.1.pom
2017-07-21T17:06:15.167 [INFO] Downloaded: https://repo.maven.apache.org/maven2/org/apache/maven/maven-monitor/2.2.1/maven-monitor-2.2.1.pom
(2 KB at 45.5 KB/sec)
2017-07-21T17:06:15.171 [INFO] Downloading: https://repo.maven.apache.org/maven2/classworlds/classworlds/1.1/classworlds-1.1.pom
2017-07-21T17:06:15.199 [INFO] Downloaded: https://repo.maven.apache.org/maven2/classworlds/classworlds/1.1/classworlds-1.1.pom
(4 KB at 115.9 KB/sec)
2017-07-21T17:06:15.201 [INFO] Downloading: https://repo.maven.apache.org/maven2/org/sonatype/plexus/plexus-sec-dispatcher/1.3/plexus-sec-dispatcher-1.3.pom
2017-07-21T17:06:15.228 [INFO] Downloaded: https://repo.maven.apache.org/maven2/org/sonatype/plexus/plexus-sec-dispatcher/1.3/plexus-sec-dispatcher-1.3.pom
(3 KB at 107.1 KB/sec)
2017-07-21T17:06:15.230 [INFO] Downloading: https://repo.maven.apache.org/maven2/org/sonatype/spice/spice-parent/12/spice-parent-12.pom
2017-07-21T17:06:15.261 [INFO] Downloaded: https://repo.maven.apache.org/maven2/org/sonatype/spice/spice-parent/12/spice-parent-12.pom
(7 KB at 214.2 KB/sec)
2017-07-21T17:06:15.263 [INFO] Downloading: https://repo.maven.apache.org/maven2/org/sonatype/forge/forge-parent/4/forge-parent-4.pom
2017-07-21T17:06:15.290 [INFO] Downloaded: https://repo.maven.apache.org/maven2/org/sonatype/forge/forge-parent/4/forge-parent-4.pom
(9 KB at 303.7 KB/sec)
2017-07-21T17:06:15.292 [INFO] Downloading: https://repo.maven.apache.org/maven2/org/sonatype/plexus/plexus-cipher/1.4/plexus-cipher-1.4.pom
2017-07-21T17:06:15.319 [INFO] Downloaded: https://repo.maven.apache.org/maven2/org/sonatype/plexus/plexus-cipher/1.4/plexus-cipher-1.4.pom
(3 KB at 74.7 KB/sec)
2017-07-21T17:06:15.322 [INFO] Downloading: https://repo.maven.apache.org/maven2/org/apache/maven/maven-model/2.0.9/maven-model-2.0.9.pom
2017-07-21T17:06:15.349 [INFO] Downloaded: https://repo.maven.apache.org/maven2/org/apache/maven/maven-model/2.0.9/maven-model-2.0.9.pom
(4 KB at 109.5 KB/sec)
2017-07-21T17:06:15.351 [INFO] Downloading: https://repo.maven.apache.org/maven2/org/apache/maven/maven/2.0.9/maven-2.0.9.pom
2017-07-21T17:06:15.378 [INFO] Downloaded: https://repo.maven.apache.org/maven2/org/apache/maven/maven/2.0.9/maven-2.0.9.pom
(19 KB at 659.4 KB/sec)
2017-07-21T17:06:15.380 [INFO] Downloading: https://repo.maven.apache.org/maven2/org/apache/maven/maven-parent/8/maven-parent-8.pom
2017-07-21T17:06:15.410 [INFO] Downloaded: https://repo.maven.apache.org/maven2/org/apache/maven/maven-parent/8/maven-parent-8.pom
(24 KB at 785.6 KB/sec)
2017-07-21T17:06:15.414 [INFO] Downloading: https://repo.maven.apache.org/maven2/org/apache/maven/shared/maven-dependency-tree/2.2/maven-dependency-tree-2.2.pom
2017-07-21T17:06:15.445 [INFO] Downloaded: https://repo.maven.apache.org/maven2/org/apache/maven/shared/maven-dependency-tree/2.2/maven-dependency-tree-2.2.pom
(8 KB at 228.8 KB/sec)
2017-07-21T17:06:15.446 [INFO] Downloading: https://repo.maven.apache.org/maven2/org/apache/maven/shared/maven-shared-components/20/maven-shared-components-20.pom
2017-07-21T17:06:15.475 [INFO] Downloaded: https://repo.maven.apache.org/maven2/org/apache/maven/shared/maven-shared-components/20/maven-shared-components-20.pom
(5 KB at 171.9 KB/sec)
2017-07-21T17:06:15.477 [INFO] Downloading: https://repo.maven.apache.org/maven2/org/apache/maven/maven-parent/24/maven-parent-24.pom
2017-07-21T17:06:15.508 [INFO] Downloaded: https://repo.maven.apache.org/maven2/org/apache/maven/maven-parent/24/maven-parent-24.pom
(37 KB at 1201.1 KB/sec)
2017-07-21T17:06:15.510 [INFO] Downloading: https://repo.maven.apache.org/maven2/org/apache/apache/14/apache-14.pom
2017-07-21T17:06:15.538 [INFO] Downloaded: https://repo.maven.apache.org/maven2/org/apache/apache/14/apache-14.pom
(15 KB at 512.2 KB/sec)
2017-07-21T17:06:15.542 [INFO] Downloading: https://repo.maven.apache.org/maven2/org/eclipse/aether/aether-util/0.9.0.M2/aether-util-0.9.0.M2.pom
2017-07-21T17:06:15.568 [INFO] Downloaded: https://repo.maven.apache.org/maven2/org/eclipse/aether/aether-util/0.9.0.M2/aether-util-0.9.0.M2.pom
(2 KB at 76.4 KB/sec)
2017-07-21T17:06:15.570 [INFO] Downloading: https://repo.maven.apache.org/maven2/org/eclipse/aether/aether/0.9.0.M2/aether-0.9.0.M2.pom
2017-07-21T17:06:15.600 [INFO] Downloaded: https://repo.maven.apache.org/maven2/org/eclipse/aether/aether/0.9.0.M2/aether-0.9.0.M2.pom
(28 KB at 907.2 KB/sec)
2017-07-21T17:06:15.604 [INFO] Downloading: https://repo.maven.apache.org/maven2/org/apache/maven/shared/maven-common-artifact-filters/1.4/maven-common-artifact-filters-1.4.pom
2017-07-21T17:06:15.632 [INFO] Downloaded: https://repo.maven.apache.org/maven2/org/apache/maven/shared/maven-common-artifact-filters/1.4/maven-common-artifact-filters-1.4.pom
(4 KB at 131.1 KB/sec)
2017-07-21T17:06:15.634 [INFO] Downloading: https://repo.maven.apache.org/maven2/org/apache/maven/shared/maven-shared-components/17/maven-shared-components-17.pom
2017-07-21T17:06:15.661 [INFO] Downloaded: https://repo.maven.apache.org/maven2/org/apache/maven/shared/maven-shared-components/17/maven-shared-components-17.pom
(9 KB at 314.7 KB/sec)
2017-07-21T17:06:15.663 [INFO] Downloading: https://repo.maven.apache.org/maven2/org/apache/maven/maven-parent/21/maven-parent-21.pom
2017-07-21T17:06:15.691 [INFO] Downloaded: https://repo.maven.apache.org/maven2/org/apache/maven/maven-parent/21/maven-parent-21.pom
(26 KB at 887.6 KB/sec)
2017-07-21T17:06:15.693 [INFO] Downloading: https://repo.maven.apache.org/maven2/org/apache/apache/10/apache-10.pom
2017-07-21T17:06:15.721 [INFO] Downloaded: https://repo.maven.apache.org/maven2/org/apache/apache/10/apache-10.pom
(15 KB at 516.1 KB/sec)
2017-07-21T17:06:15.726 [INFO] Downloading: https://repo.maven.apache.org/maven2/org/apache/maven/maven-model/2.0.8/maven-model-2.0.8.pom
2017-07-21T17:06:15.754 [INFO] Downloaded: https://repo.maven.apache.org/maven2/org/apache/maven/maven-model/2.0.8/maven-model-2.0.8.pom
(4 KB at 109.5 KB/sec)
2017-07-21T17:06:15.756 [INFO] Downloading: https://repo.maven.apache.org/maven2/org/apache/maven/maven/2.0.8/maven-2.0.8.pom
2017-07-21T17:06:15.800 [INFO] Downloaded: https://repo.maven.apache.org/maven2/org/apache/maven/maven/2.0.8/maven-2.0.8.pom
(12 KB at 268.4 KB/sec)
2017-07-21T17:06:15.802 [INFO] Downloading: https://repo.maven.apache.org/maven2/org/apache/maven/maven-parent/6/maven-parent-6.pom
2017-07-21T17:06:15.833 [INFO] Downloaded: https://repo.maven.apache.org/maven2/org/apache/maven/maven-parent/6/maven-parent-6.pom
(20 KB at 631.5 KB/sec)
2017-07-21T17:06:15.836 [INFO] Downloading: https://repo.maven.apache.org/maven2/org/codehaus/plexus/plexus-container-default/1.5.5/plexus-container-default-1.5.5.pom
2017-07-21T17:06:15.877 [INFO] Downloaded: https://repo.maven.apache.org/maven2/org/codehaus/plexus/plexus-container-default/1.5.5/plexus-container-default-1.5.5.pom
(3 KB at 65.6 KB/sec)
2017-07-21T17:06:15.880 [INFO] Downloading: https://repo.maven.apache.org/maven2/org/codehaus/plexus/plexus-classworlds/2.2.2/plexus-classworlds-2.2.2.pom
2017-07-21T17:06:15.908 [INFO] Downloaded: https://repo.maven.apache.org/maven2/org/codehaus/plexus/plexus-classworlds/2.2.2/plexus-classworlds-2.2.2.pom
(4 KB at 140.7 KB/sec)
2017-07-21T17:06:15.910 [INFO] Downloading: https://repo.maven.apache.org/maven2/org/codehaus/plexus/plexus/2.0.3/plexus-2.0.3.pom
2017-07-21T17:06:15.939 [INFO] Downloaded: https://repo.maven.apache.org/maven2/org/codehaus/plexus/plexus/2.0.3/plexus-2.0.3.pom
(16 KB at 520.6 KB/sec)
2017-07-21T17:06:15.942 [INFO] Downloading: https://repo.maven.apache.org/maven2/org/apache/xbean/xbean-reflect/3.4/xbean-reflect-3.4.pom
2017-07-21T17:06:15.969 [INFO] Downloaded: https://repo.maven.apache.org/maven2/org/apache/xbean/xbean-reflect/3.4/xbean-reflect-3.4.pom
(3 KB at 101.6 KB/sec)
2017-07-21T17:06:15.971 [INFO] Downloading: https://repo.maven.apache.org/maven2/org/apache/xbean/xbean/3.4/xbean-3.4.pom
2017-07-21T17:06:15.998 [INFO] Downloaded: https://repo.maven.apache.org/maven2/org/apache/xbean/xbean/3.4/xbean-3.4.pom
(19 KB at 670.3 KB/sec)
2017-07-21T17:06:16.001 [INFO] Downloading: https://repo.maven.apache.org/maven2/log4j/log4j/1.2.12/log4j-1.2.12.pom
2017-07-21T17:06:16.027 [INFO] Downloaded: https://repo.maven.apache.org/maven2/log4j/log4j/1.2.12/log4j-1.2.12.pom
(145 B at 5.4 KB/sec)
2017-07-21T17:06:16.029 [INFO] Downloading: https://repo.maven.apache.org/maven2/commons-logging/commons-logging-api/1.1/commons-logging-api-1.1.pom
2017-07-21T17:06:16.056 [INFO] Downloaded: https://repo.maven.apache.org/maven2/commons-logging/commons-logging-api/1.1/commons-logging-api-1.1.pom
(6 KB at 193.4 KB/sec)
2017-07-21T17:06:16.058 [INFO] Downloading: https://repo.maven.apache.org/maven2/com/google/collections/google-collections/1.0/google-collections-1.0.pom
2017-07-21T17:06:16.085 [INFO] Downloaded: https://repo.maven.apache.org/maven2/com/google/collections/google-collections/1.0/google-collections-1.0.pom
(3 KB at 89.6 KB/sec)
2017-07-21T17:06:16.087 [INFO] Downloading: https://repo.maven.apache.org/maven2/com/google/google/1/google-1.pom
2017-07-21T17:06:16.113 [INFO] Downloaded: https://repo.maven.apache.org/maven2/com/google/google/1/google-1.pom
(2 KB at 58.4 KB/sec)
2017-07-21T17:06:16.115 [INFO] Downloading: https://repo.maven.apache.org/maven2/com/ibm/icu/icu4j/56.1/icu4j-56.1.pom
2017-07-21T17:06:16.142 [INFO] Downloaded: https://repo.maven.apache.org/maven2/com/ibm/icu/icu4j/56.1/icu4j-56.1.pom
(5 KB at 174.5 KB/sec)
2017-07-21T17:06:16.148 [INFO] Downloading: https://repo.maven.apache.org/maven2/commons-lang/commons-lang/2.3/commons-lang-2.3.pom
2017-07-21T17:06:16.176 [INFO] Downloaded: https://repo.maven.apache.org/maven2/commons-lang/commons-lang/2.3/commons-lang-2.3.pom
(11 KB at 387.7 KB/sec)
2017-07-21T17:06:16.179 [INFO] Downloading: https://repo.maven.apache.org/maven2/org/apache/maven/enforcer/enforcer-rules/1.4.1/enforcer-rules-1.4.1.pom
2017-07-21T17:06:16.207 [INFO] Downloaded: https://repo.maven.apache.org/maven2/org/apache/maven/enforcer/enforcer-rules/1.4.1/enforcer-rules-1.4.1.pom
(4 KB at 129.3 KB/sec)
2017-07-21T17:06:16.211 [INFO] Downloading: https://repo.maven.apache.org/maven2/org/beanshell/bsh/2.0b4/bsh-2.0b4.pom
2017-07-21T17:06:16.239 [INFO] Downloaded: https://repo.maven.apache.org/maven2/org/beanshell/bsh/2.0b4/bsh-2.0b4.pom
(2 KB at 41.7 KB/sec)
2017-07-21T17:06:16.240 [INFO] Downloading: https://repo.maven.apache.org/maven2/org/beanshell/beanshell/2.0b4/beanshell-2.0b4.pom
2017-07-21T17:06:16.267 [INFO] Downloaded: https://repo.maven.apache.org/maven2/org/beanshell/beanshell/2.0b4/beanshell-2.0b4.pom
(2 KB at 51.1 KB/sec)
2017-07-21T17:06:16.269 [INFO] Downloading: https://repo.maven.apache.org/maven2/org/codehaus/plexus/plexus-i18n/1.0-beta-6/plexus-i18n-1.0-beta-6.pom
2017-07-21T17:06:16.296 [INFO] Downloaded: https://repo.maven.apache.org/maven2/org/codehaus/plexus/plexus-i18n/1.0-beta-6/plexus-i18n-1.0-beta-6.pom
(771 B at 27.9 KB/sec)
2017-07-21T17:06:16.298 [INFO] Downloading: https://repo.maven.apache.org/maven2/org/codehaus/plexus/plexus-components/1.1.4/plexus-components-1.1.4.pom
2017-07-21T17:06:16.326 [INFO] Downloaded: https://repo.maven.apache.org/maven2/org/codehaus/plexus/plexus-components/1.1.4/plexus-components-1.1.4.pom
(3 KB at 69.7 KB/sec)
2017-07-21T17:06:16.328 [INFO] Downloading: https://repo.maven.apache.org/maven2/org/codehaus/plexus/plexus-container-default/1.0-alpha-8/plexus-container-default-1.0-alpha-8.pom
2017-07-21T17:06:16.356 [INFO] Downloaded: https://repo.maven.apache.org/maven2/org/codehaus/plexus/plexus-container-default/1.0-alpha-8/plexus-container-default-1.0-alpha-8.pom
(8 KB at 253.3 KB/sec)
2017-07-21T17:06:16.359 [INFO] Downloading: https://repo.maven.apache.org/maven2/org/apache/maven/plugin-testing/maven-plugin-testing-harness/1.3/maven-plugin-testing-harness-1.3.pom
2017-07-21T17:06:16.405 [INFO] Downloaded: https://repo.maven.apache.org/maven2/org/apache/maven/plugin-testing/maven-plugin-testing-harness/1.3/maven-plugin-testing-harness-1.3.pom
(4 KB at 73.2 KB/sec)
2017-07-21T17:06:16.407 [INFO] Downloading: https://repo.maven.apache.org/maven2/org/apache/maven/plugin-testing/maven-plugin-testing/1.3/maven-plugin-testing-1.3.pom
2017-07-21T17:06:16.435 [INFO] Downloaded: https://repo.maven.apache.org/maven2/org/apache/maven/plugin-testing/maven-plugin-testing/1.3/maven-plugin-testing-1.3.pom
(10 KB at 321.0 KB/sec)
2017-07-21T17:06:16.438 [INFO] Downloading: https://repo.maven.apache.org/maven2/org/codehaus/plexus/plexus-archiver/2.2/plexus-archiver-2.2.pom
2017-07-21T17:06:16.466 [INFO] Downloaded: https://repo.maven.apache.org/maven2/org/codehaus/plexus/plexus-archiver/2.2/plexus-archiver-2.2.pom
(4 KB at 112.1 KB/sec)
2017-07-21T17:06:16.468 [INFO] Downloading: https://repo.maven.apache.org/maven2/org/codehaus/plexus/plexus-components/1.1.20/plexus-components-1.1.20.pom
2017-07-21T17:06:16.496 [INFO] Downloaded: https://repo.maven.apache.org/maven2/org/codehaus/plexus/plexus-components/1.1.20/plexus-components-1.1.20.pom
(3 KB at 105.2 KB/sec)
2017-07-21T17:06:16.497 [INFO] Downloading: https://repo.maven.apache.org/maven2/org/codehaus/plexus/plexus/3.1/plexus-3.1.pom
2017-07-21T17:06:16.526 [INFO] Downloaded: https://repo.maven.apache.org/maven2/org/codehaus/plexus/plexus/3.1/plexus-3.1.pom
(19 KB at 626.9 KB/sec)
2017-07-21T17:06:16.530 [INFO] Downloading: https://repo.maven.apache.org/maven2/org/codehaus/plexus/plexus-io/2.0.4/plexus-io-2.0.4.pom
2017-07-21T17:06:16.563 [INFO] Downloaded: https://repo.maven.apache.org/maven2/org/codehaus/plexus/plexus-io/2.0.4/plexus-io-2.0.4.pom
(2 KB at 51.3 KB/sec)
2017-07-21T17:06:16.565 [INFO] Downloading: https://repo.maven.apache.org/maven2/org/codehaus/plexus/plexus-components/1.1.19/plexus-components-1.1.19.pom
2017-07-21T17:06:16.595 [INFO] Downloaded: https://repo.maven.apache.org/maven2/org/codehaus/plexus/plexus-components/1.1.19/plexus-components-1.1.19.pom
(3 KB at 90.9 KB/sec)
2017-07-21T17:06:16.596 [INFO] Downloading: https://repo.maven.apache.org/maven2/org/codehaus/plexus/plexus/3.0.1/plexus-3.0.1.pom
2017-07-21T17:06:16.624 [INFO] Downloaded: https://repo.maven.apache.org/maven2/org/codehaus/plexus/plexus/3.0.1/plexus-3.0.1.pom
(19 KB at 649.2 KB/sec)
2017-07-21T17:06:16.637 [INFO] Downloading: https://repo.maven.apache.org/maven2/org/codehaus/mojo/extra-enforcer-rules/1.0-beta-6/extra-enforcer-rules-1.0-beta-6.jar
2017-07-21T17:06:16.637 [INFO] Downloading: https://repo.maven.apache.org/maven2/org/apache/maven/maven-model/2.0.9/maven-model-2.0.9.jar
2017-07-21T17:06:16.637 [INFO] Downloading: https://repo.maven.apache.org/maven2/org/apache/maven/shared/maven-dependency-tree/2.2/maven-dependency-tree-2.2.jar
2017-07-21T17:06:16.638 [INFO] Downloading: https://repo.maven.apache.org/maven2/org/codehaus/plexus/plexus-container-default/1.0-alpha-9/plexus-container-default-1.0-alpha-9.jar
2017-07-21T17:06:16.639 [INFO] Downloading: https://repo.maven.apache.org/maven2/org/eclipse/aether/aether-util/0.9.0.M2/aether-util-0.9.0.M2.jar
2017-07-21T17:06:16.671 [INFO] Downloaded: https://repo.maven.apache.org/maven2/org/apache/maven/maven-model/2.0.9/maven-model-2.0.9.jar
(86 KB at 2436.4 KB/sec)
2017-07-21T17:06:16.672 [INFO] Downloading: https://repo.maven.apache.org/maven2/org/apache/maven/shared/maven-common-artifact-filters/1.4/maven-common-artifact-filters-1.4.jar
2017-07-21T17:06:16.675 [INFO] Downloaded: https://repo.maven.apache.org/maven2/org/codehaus/mojo/extra-enforcer-rules/1.0-beta-6/extra-enforcer-rules-1.0-beta-6.jar
(36 KB at 936.7 KB/sec)
2017-07-21T17:06:16.675 [INFO] Downloading: https://repo.maven.apache.org/maven2/com/ibm/icu/icu4j/56.1/icu4j-56.1.jar
2017-07-21T17:06:16.683 [INFO] Downloaded: https://repo.maven.apache.org/maven2/org/eclipse/aether/aether-util/0.9.0.M2/aether-util-0.9.0.M2.jar
(131 KB at 2836.0 KB/sec)
2017-07-21T17:06:16.683 [INFO] Downloading: https://repo.maven.apache.org/maven2/org/apache/maven/maven-artifact/2.2.1/maven-artifact-2.2.1.jar
2017-07-21T17:06:16.684 [INFO] Downloaded: https://repo.maven.apache.org/maven2/org/apache/maven/shared/maven-dependency-tree/2.2/maven-dependency-tree-2.2.jar
(63 KB at 1320.8 KB/sec)
2017-07-21T17:06:16.684 [INFO] Downloading: https://repo.maven.apache.org/maven2/org/apache/maven/maven-plugin-api/2.2.1/maven-plugin-api-2.2.1.jar
2017-07-21T17:06:16.695 [INFO] Downloaded: https://repo.maven.apache.org/maven2/org/codehaus/plexus/plexus-container-default/1.0-alpha-9/plexus-container-default-1.0-alpha-9.jar
(191 KB at 3347.6 KB/sec)
2017-07-21T17:06:16.695 [INFO] Downloading: https://repo.maven.apache.org/maven2/org/apache/maven/maven-project/2.2.1/maven-project-2.2.1.jar
2017-07-21T17:06:16.701 [INFO] Downloaded: https://repo.maven.apache.org/maven2/org/apache/maven/shared/maven-common-artifact-filters/1.4/maven-common-artifact-filters-1.4.jar
(31 KB at 489.8 KB/sec)
2017-07-21T17:06:16.701 [INFO] Downloading: https://repo.maven.apache.org/maven2/org/apache/maven/maven-settings/2.2.1/maven-settings-2.2.1.jar
2017-07-21T17:06:16.712 [INFO] Downloaded: https://repo.maven.apache.org/maven2/org/apache/maven/maven-plugin-api/2.2.1/maven-plugin-api-2.2.1.jar
(13 KB at 163.3 KB/sec)
2017-07-21T17:06:16.712 [INFO] Downloading: https://repo.maven.apache.org/maven2/org/apache/maven/maven-profile/2.2.1/maven-profile-2.2.1.jar
2017-07-21T17:06:16.721 [INFO] Downloaded: https://repo.maven.apache.org/maven2/org/apache/maven/maven-artifact/2.2.1/maven-artifact-2.2.1.jar
(79 KB at 945.1 KB/sec)
2017-07-21T17:06:16.721 [INFO] Downloading: https://repo.maven.apache.org/maven2/org/apache/maven/maven-artifact-manager/2.2.1/maven-artifact-manager-2.2.1.jar
2017-07-21T17:06:16.734 [INFO] Downloaded: https://repo.maven.apache.org/maven2/org/apache/maven/maven-settings/2.2.1/maven-settings-2.2.1.jar
(48 KB at 498.9 KB/sec)
2017-07-21T17:06:16.734 [INFO] Downloading: https://repo.maven.apache.org/maven2/backport-util-concurrent/backport-util-concurrent/3.1/backport-util-concurrent-3.1.jar
2017-07-21T17:06:16.742 [INFO] Downloaded: https://repo.maven.apache.org/maven2/org/apache/maven/maven-profile/2.2.1/maven-profile-2.2.1.jar
(35 KB at 332.1 KB/sec)
2017-07-21T17:06:16.743 [INFO] Downloading: https://repo.maven.apache.org/maven2/org/apache/maven/maven-plugin-registry/2.2.1/maven-plugin-registry-2.2.1.jar
2017-07-21T17:06:16.744 [INFO] Downloaded: https://repo.maven.apache.org/maven2/org/apache/maven/maven-project/2.2.1/maven-project-2.2.1.jar
(153 KB at 1439.8 KB/sec)
2017-07-21T17:06:16.744 [INFO] Downloading: https://repo.maven.apache.org/maven2/org/codehaus/plexus/plexus-interpolation/1.11/plexus-interpolation-1.11.jar
2017-07-21T17:06:16.756 [INFO] Downloaded: https://repo.maven.apache.org/maven2/org/apache/maven/maven-artifact-manager/2.2.1/maven-artifact-manager-2.2.1.jar
(66 KB at 559.2 KB/sec)
2017-07-21T17:06:16.759 [INFO] Downloading: https://repo.maven.apache.org/maven2/org/apache/maven/maven-core/2.2.1/maven-core-2.2.1.jar
2017-07-21T17:06:16.774 [INFO] Downloaded: https://repo.maven.apache.org/maven2/org/apache/maven/maven-plugin-registry/2.2.1/maven-plugin-registry-2.2.1.jar
(30 KB at 214.9 KB/sec)
2017-07-21T17:06:16.774 [INFO] Downloading: https://repo.maven.apache.org/maven2/org/apache/maven/maven-plugin-parameter-documenter/2.2.1/maven-plugin-parameter-documenter-2.2.1.jar
2017-07-21T17:06:16.777 [INFO] Downloaded: https://repo.maven.apache.org/maven2/org/codehaus/plexus/plexus-interpolation/1.11/plexus-interpolation-1.11.jar
(50 KB at 357.9 KB/sec)
2017-07-21T17:06:16.777 [INFO] Downloading: https://repo.maven.apache.org/maven2/org/slf4j/slf4j-jdk14/1.5.6/slf4j-jdk14-1.5.6.jar
2017-07-21T17:06:16.790 [INFO] Downloaded: https://repo.maven.apache.org/maven2/backport-util-concurrent/backport-util-concurrent/3.1/backport-util-concurrent-3.1.jar
(324 KB at 2131.2 KB/sec)
2017-07-21T17:06:16.791 [INFO] Downloading: https://repo.maven.apache.org/maven2/org/slf4j/slf4j-api/1.5.6/slf4j-api-1.5.6.jar
2017-07-21T17:06:16.803 [INFO] Downloaded: https://repo.maven.apache.org/maven2/org/apache/maven/maven-plugin-parameter-documenter/2.2.1/maven-plugin-parameter-documenter-2.2.1.jar
(22 KB at 131.3 KB/sec)
2017-07-21T17:06:16.804 [INFO] Downloading: https://repo.maven.apache.org/maven2/org/slf4j/jcl-over-slf4j/1.5.6/jcl-over-slf4j-1.5.6.jar
2017-07-21T17:06:16.807 [INFO] Downloaded: https://repo.maven.apache.org/maven2/org/slf4j/slf4j-jdk14/1.5.6/slf4j-jdk14-1.5.6.jar
(9 KB at 50.9 KB/sec)
2017-07-21T17:06:16.807 [INFO] Downloading: https://repo.maven.apache.org/maven2/org/apache/maven/reporting/maven-reporting-api/2.2.1/maven-reporting-api-2.2.1.jar
2017-07-21T17:06:16.809 [INFO] Downloaded: https://repo.maven.apache.org/maven2/org/apache/maven/maven-core/2.2.1/maven-core-2.2.1.jar
(174 KB at 1021.9 KB/sec)
2017-07-21T17:06:16.809 [INFO] Downloading: https://repo.maven.apache.org/maven2/org/apache/maven/doxia/doxia-sink-api/1.1/doxia-sink-api-1.1.jar
2017-07-21T17:06:16.819 [INFO] Downloaded: https://repo.maven.apache.org/maven2/org/slf4j/slf4j-api/1.5.6/slf4j-api-1.5.6.jar
(22 KB at 120.5 KB/sec)
2017-07-21T17:06:16.819 [INFO] Downloading: https://repo.maven.apache.org/maven2/org/apache/maven/doxia/doxia-logging-api/1.1/doxia-logging-api-1.1.jar
2017-07-21T17:06:16.835 [INFO] Downloaded: https://repo.maven.apache.org/maven2/org/slf4j/jcl-over-slf4j/1.5.6/jcl-over-slf4j-1.5.6.jar
(17 KB at 82.9 KB/sec)
2017-07-21T17:06:16.835 [INFO] Downloading: https://repo.maven.apache.org/maven2/org/apache/maven/maven-repository-metadata/2.2.1/maven-repository-metadata-2.2.1.jar
2017-07-21T17:06:16.836 [INFO] Downloaded: https://repo.maven.apache.org/maven2/org/apache/maven/doxia/doxia-sink-api/1.1/doxia-sink-api-1.1.jar
(13 KB at 63.2 KB/sec)
2017-07-21T17:06:16.837 [INFO] Downloading: https://repo.maven.apache.org/maven2/org/apache/maven/maven-error-diagnostics/2.2.1/maven-error-diagnostics-2.2.1.jar
2017-07-21T17:06:16.837 [INFO] Downloaded: https://repo.maven.apache.org/maven2/org/apache/maven/reporting/maven-reporting-api/2.2.1/maven-reporting-api-2.2.1.jar
(10 KB at 48.0 KB/sec)
2017-07-21T17:06:16.837 [INFO] Downloading: https://repo.maven.apache.org/maven2/commons-cli/commons-cli/1.2/commons-cli-1.2.jar
2017-07-21T17:06:16.847 [INFO] Downloaded: https://repo.maven.apache.org/maven2/org/apache/maven/doxia/doxia-logging-api/1.1/doxia-logging-api-1.1.jar
(12 KB at 53.0 KB/sec)
2017-07-21T17:06:16.847 [INFO] Downloading: https://repo.maven.apache.org/maven2/org/apache/maven/maven-plugin-descriptor/2.2.1/maven-plugin-descriptor-2.2.1.jar
2017-07-21T17:06:16.864 [INFO] Downloaded: https://repo.maven.apache.org/maven2/org/apache/maven/maven-error-diagnostics/2.2.1/maven-error-diagnostics-2.2.1.jar
(13 KB at 56.3 KB/sec)
2017-07-21T17:06:16.864 [INFO] Downloading: https://repo.maven.apache.org/maven2/org/codehaus/plexus/plexus-interactivity-api/1.0-alpha-4/plexus-interactivity-api-1.0-alpha-4.jar
2017-07-21T17:06:16.868 [INFO] Downloaded: https://repo.maven.apache.org/maven2/org/apache/maven/maven-repository-metadata/2.2.1/maven-repository-metadata-2.2.1.jar
(26 KB at 110.9 KB/sec)
2017-07-21T17:06:16.870 [INFO] Downloading: https://repo.maven.apache.org/maven2/org/apache/maven/maven-monitor/2.2.1/maven-monitor-2.2.1.jar
2017-07-21T17:06:16.870 [INFO] Downloaded: https://repo.maven.apache.org/maven2/commons-cli/commons-cli/1.2/commons-cli-1.2.jar
(41 KB at 173.1 KB/sec)
2017-07-21T17:06:16.873 [INFO] Downloading: https://repo.maven.apache.org/maven2/classworlds/classworlds/1.1/classworlds-1.1.jar
2017-07-21T17:06:16.884 [INFO] Downloaded: https://repo.maven.apache.org/maven2/org/apache/maven/maven-plugin-descriptor/2.2.1/maven-plugin-descriptor-2.2.1.jar
(39 KB at 157.9 KB/sec)
2017-07-21T17:06:16.884 [INFO] Downloading: https://repo.maven.apache.org/maven2/org/sonatype/plexus/plexus-sec-dispatcher/1.3/plexus-sec-dispatcher-1.3.jar
2017-07-21T17:06:16.898 [INFO] Downloaded: https://repo.maven.apache.org/maven2/org/codehaus/plexus/plexus-interactivity-api/1.0-alpha-4/plexus-interactivity-api-1.0-alpha-4.jar
(14 KB at 50.4 KB/sec)
2017-07-21T17:06:16.898 [INFO] Downloading: https://repo.maven.apache.org/maven2/org/sonatype/plexus/plexus-cipher/1.4/plexus-cipher-1.4.jar
2017-07-21T17:06:16.899 [INFO] Downloaded: https://repo.maven.apache.org/maven2/org/apache/maven/maven-monitor/2.2.1/maven-monitor-2.2.1.jar
(11 KB at 39.1 KB/sec)
2017-07-21T17:06:16.899 [INFO] Downloading: https://repo.maven.apache.org/maven2/org/codehaus/plexus/plexus-utils/3.0.22/plexus-utils-3.0.22.jar
2017-07-21T17:06:16.902 [INFO] Downloaded: https://repo.maven.apache.org/maven2/classworlds/classworlds/1.1/classworlds-1.1.jar
(37 KB at 140.0 KB/sec)
2017-07-21T17:06:16.902 [INFO] Downloading: https://repo.maven.apache.org/maven2/commons-lang/commons-lang/2.3/commons-lang-2.3.jar
2017-07-21T17:06:16.913 [INFO] Downloaded: https://repo.maven.apache.org/maven2/org/sonatype/plexus/plexus-sec-dispatcher/1.3/plexus-sec-dispatcher-1.3.jar
(28 KB at 101.4 KB/sec)
2017-07-21T17:06:16.913 [INFO] Downloading: https://repo.maven.apache.org/maven2/org/apache/maven/enforcer/enforcer-api/1.4.1/enforcer-api-1.4.1.jar
2017-07-21T17:06:16.932 [INFO] Downloaded: https://repo.maven.apache.org/maven2/org/sonatype/plexus/plexus-cipher/1.4/plexus-cipher-1.4.jar
(14 KB at 44.8 KB/sec)
2017-07-21T17:06:16.932 [INFO] Downloading: https://repo.maven.apache.org/maven2/org/apache/maven/enforcer/enforcer-rules/1.4.1/enforcer-rules-1.4.1.jar
2017-07-21T17:06:16.942 [INFO] Downloaded: https://repo.maven.apache.org/maven2/org/apache/maven/enforcer/enforcer-api/1.4.1/enforcer-api-1.4.1.jar
(12 KB at 36.4 KB/sec)
2017-07-21T17:06:16.942 [INFO] Downloading: https://repo.maven.apache.org/maven2/org/beanshell/bsh/2.0b4/bsh-2.0b4.jar
2017-07-21T17:06:16.949 [INFO] Downloaded: https://repo.maven.apache.org/maven2/org/codehaus/plexus/plexus-utils/3.0.22/plexus-utils-3.0.22.jar
(240 KB at 769.0 KB/sec)
2017-07-21T17:06:16.949 [INFO] Downloading: https://repo.maven.apache.org/maven2/org/codehaus/plexus/plexus-i18n/1.0-beta-6/plexus-i18n-1.0-beta-6.jar
2017-07-21T17:06:16.953 [INFO] Downloaded: https://repo.maven.apache.org/maven2/commons-lang/commons-lang/2.3/commons-lang-2.3.jar
(240 KB at 760.4 KB/sec)
2017-07-21T17:06:16.953 [INFO] Downloading: https://repo.maven.apache.org/maven2/org/apache/maven/plugin-testing/maven-plugin-testing-harness/1.3/maven-plugin-testing-harness-1.3.jar
2017-07-21T17:06:16.981 [INFO] Downloaded: https://repo.maven.apache.org/maven2/org/apache/maven/enforcer/enforcer-rules/1.4.1/enforcer-rules-1.4.1.jar
(97 KB at 281.6 KB/sec)
2017-07-21T17:06:16.981 [INFO] Downloading: https://repo.maven.apache.org/maven2/org/codehaus/plexus/plexus-archiver/2.2/plexus-archiver-2.2.jar
2017-07-21T17:06:16.983 [INFO] Downloaded: https://repo.maven.apache.org/maven2/org/apache/maven/plugin-testing/maven-plugin-testing-harness/1.3/maven-plugin-testing-harness-1.3.jar
(35 KB at 100.0 KB/sec)
2017-07-21T17:06:16.983 [INFO] Downloading: https://repo.maven.apache.org/maven2/org/codehaus/plexus/plexus-io/2.0.4/plexus-io-2.0.4.jar
2017-07-21T17:06:16.987 [INFO] Downloaded: https://repo.maven.apache.org/maven2/org/codehaus/plexus/plexus-i18n/1.0-beta-6/plexus-i18n-1.0-beta-6.jar
(12 KB at 33.6 KB/sec)
2017-07-21T17:06:16.988 [INFO] Downloading: https://repo.maven.apache.org/maven2/junit/junit/4.11/junit-4.11.jar
2017-07-21T17:06:16.996 [INFO] Downloaded: https://repo.maven.apache.org/maven2/org/beanshell/bsh/2.0b4/bsh-2.0b4.jar
(276 KB at 770.6 KB/sec)
2017-07-21T17:06:16.997 [INFO] Downloading: https://repo.maven.apache.org/maven2/org/hamcrest/hamcrest-core/1.3/hamcrest-core-1.3.jar
2017-07-21T17:06:17.029 [INFO] Downloaded: https://repo.maven.apache.org/maven2/org/codehaus/plexus/plexus-io/2.0.4/plexus-io-2.0.4.jar
(57 KB at 145.9 KB/sec)
2017-07-21T17:06:17.032 [INFO] Downloaded: https://repo.maven.apache.org/maven2/org/codehaus/plexus/plexus-archiver/2.2/plexus-archiver-2.2.jar
(181 KB at 462.0 KB/sec)
2017-07-21T17:06:17.035 [INFO] Downloaded: https://repo.maven.apache.org/maven2/org/hamcrest/hamcrest-core/1.3/hamcrest-core-1.3.jar
(44 KB at 111.3 KB/sec)
2017-07-21T17:06:17.038 [INFO] Downloaded: https://repo.maven.apache.org/maven2/junit/junit/4.11/junit-4.11.jar
(240 KB at 599.7 KB/sec)
[WARNING] Failed to getClass for org.apache.maven.plugins.enforcer.EnforceMojo
[JENKINS] Archiving disabled
[JENKINS] Archiving disabled
[JENKINS] Archiving disabled
[JENKINS] Archiving disabled
[JENKINS] Archiving disabled
[JENKINS] Archiving disabled
[JENKINS] Archiving disabled
[JENKINS] Archiving disabled
[JENKINS] Archiving disabled
[JENKINS] Archiving disabled
[JENKINS] Archiving disabled
[JENKINS] Archiving disabled
[JENKINS] Archiving disabled
2017-07-21T17:06:24.034 [INFO] ------------------------------------------------------------------------
2017-07-21T17:06:24.034 [INFO] Reactor Summary:
2017-07-21T17:06:24.034 [INFO] 
2017-07-21T17:06:24.034 [INFO] Apache Beam :: Parent .............................. FAILURE
[ 14.147 s]
2017-07-21T17:06:24.034 [INFO] Apache Beam :: SDKs :: Java :: Build Tools ......... SKIPPED
2017-07-21T17:06:24.034 [INFO] Apache Beam :: SDKs ................................ SKIPPED
2017-07-21T17:06:24.034 [INFO] Apache Beam :: SDKs :: Common ...................... SKIPPED
2017-07-21T17:06:24.034 [INFO] Apache Beam :: SDKs :: Common :: Runner API ........ SKIPPED
2017-07-21T17:06:24.034 [INFO] Apache Beam :: SDKs :: Common :: Fn API ............ SKIPPED
2017-07-21T17:06:24.034 [INFO] Apache Beam :: SDKs :: Java ........................ SKIPPED
2017-07-21T17:06:24.034 [INFO] Apache Beam :: SDKs :: Java :: Core ................ SKIPPED
2017-07-21T17:06:24.034 [INFO] Apache Beam :: Runners ............................. SKIPPED
2017-07-21T17:06:24.034 [INFO] Apache Beam :: Runners :: Core Construction Java ... SKIPPED
2017-07-21T17:06:24.034 [INFO] Apache Beam :: Runners :: Core Java ................ SKIPPED
2017-07-21T17:06:24.034 [INFO] Apache Beam :: Runners :: Apex ..................... SKIPPED
2017-07-21T17:06:24.034 [INFO] ------------------------------------------------------------------------
2017-07-21T17:06:24.034 [INFO] BUILD FAILURE
2017-07-21T17:06:24.034 [INFO] ------------------------------------------------------------------------
2017-07-21T17:06:24.034 [INFO] Total time: 51.402 s
2017-07-21T17:06:24.034 [INFO] Finished at: 2017-07-21T17:06:24+00:00
2017-07-21T17:06:24.357 [INFO] Final Memory: 45M/582M
2017-07-21T17:06:24.357 [INFO] ------------------------------------------------------------------------
2017-07-21T17:06:24.357 [WARNING] The requested profile "validates-runner-tests" could not
be activated because it does not exist.
2017-07-21T17:06:24.361 [ERROR] Failed to execute goal org.apache.maven.plugins:maven-enforcer-plugin:1.4.1:enforce
(enforce) on project beam-parent: Execution enforce of goal org.apache.maven.plugins:maven-enforcer-plugin:1.4.1:enforce
failed: Plugin org.apache.maven.plugins:maven-enforcer-plugin:1.4.1 or one of its dependencies
could not be resolved: Could not transfer artifact com.ibm.icu:icu4j:jar:56.1 from/to central
(https://repo.maven.apache.org/maven2): GET request of: com/ibm/icu/icu4j/56.1/icu4j-56.1.jar
from central failed: Connection reset -> [Help 1]
2017-07-21T17:06:24.361 [ERROR] 
2017-07-21T17:06:24.361 [ERROR] To see the full stack trace of the errors, re-run Maven with
the -e switch.
2017-07-21T17:06:24.361 [ERROR] Re-run Maven using the -X switch to enable full debug logging.
2017-07-21T17:06:24.361 [ERROR] 
2017-07-21T17:06:24.361 [ERROR] For more information about the errors and possible solutions,
please read the following articles:
2017-07-21T17:06:24.361 [ERROR] [Help 1] http://cwiki.apache.org/confluence/display/MAVEN/PluginResolutionException
channel stopped

Mime
View raw message