beam-commits mailing list archives

Site index · List index
Message view « Date » · « Thread »
Top « Date » · « Thread »
From Apache Jenkins Server <jenk...@builds.apache.org>
Subject Build failed in Jenkins: beam_PostCommit_Java_ValidatesRunner_Flink #3409
Date Sun, 16 Jul 2017 13:04:49 GMT
See <https://builds.apache.org/job/beam_PostCommit_Java_ValidatesRunner_Flink/3409/display/redirect>

------------------------------------------
[...truncated 219.00 KB...]
2017-07-16T13:04:20.180 [INFO] Downloading: https://repo.maven.apache.org/maven2/org/apache/maven/plugins/maven-checkstyle-plugin/2.17/maven-checkstyle-plugin-2.17.jar
2017-07-16T13:04:20.237 [INFO] Downloaded: https://repo.maven.apache.org/maven2/org/apache/maven/plugins/maven-checkstyle-plugin/2.17/maven-checkstyle-plugin-2.17.jar
(107 KB at 1860.1 KB/sec)
2017-07-16T13:04:20.245 [INFO] Downloading: https://repo.maven.apache.org/maven2/org/apache/maven/plugins/maven-surefire-plugin/2.20/maven-surefire-plugin-2.20.pom
2017-07-16T13:04:20.282 [INFO] Downloaded: https://repo.maven.apache.org/maven2/org/apache/maven/plugins/maven-surefire-plugin/2.20/maven-surefire-plugin-2.20.pom
(7 KB at 171.0 KB/sec)
2017-07-16T13:04:20.283 [INFO] Downloading: https://repo.maven.apache.org/maven2/org/apache/maven/surefire/surefire/2.20/surefire-2.20.pom
2017-07-16T13:04:20.312 [INFO] Downloaded: https://repo.maven.apache.org/maven2/org/apache/maven/surefire/surefire/2.20/surefire-2.20.pom
(21 KB at 700.5 KB/sec)
2017-07-16T13:04:20.316 [INFO] Downloading: https://repo.maven.apache.org/maven2/org/apache/maven/plugins/maven-surefire-plugin/2.20/maven-surefire-plugin-2.20.jar
2017-07-16T13:04:20.351 [INFO] Downloaded: https://repo.maven.apache.org/maven2/org/apache/maven/plugins/maven-surefire-plugin/2.20/maven-surefire-plugin-2.20.jar
(52 KB at 1528.7 KB/sec)
2017-07-16T13:04:20.362 [INFO] 
2017-07-16T13:04:20.362 [INFO] --- maven-clean-plugin:3.0.0:clean (default-clean) @ beam-sdks-java-build-tools
---
2017-07-16T13:04:20.366 [INFO] Deleting <https://builds.apache.org/job/beam_PostCommit_Java_ValidatesRunner_Flink/ws/sdks/java/build-tools>
(includes = [**/*.pyc, **/*.egg-info/, **/sdks/python/LICENSE, **/sdks/python/NOTICE, **/sdks/python/README.md],
excludes = [])
2017-07-16T13:04:20.478 [INFO] 
2017-07-16T13:04:20.478 [INFO] --- maven-enforcer-plugin:1.4.1:enforce (enforce) @ beam-sdks-java-build-tools
---
2017-07-16T13:04:20.589 [INFO] 
2017-07-16T13:04:20.589 [INFO] --- maven-enforcer-plugin:1.4.1:enforce (enforce-banned-dependencies)
@ beam-sdks-java-build-tools ---
2017-07-16T13:04:20.700 [INFO] 
2017-07-16T13:04:20.700 [INFO] --- maven-remote-resources-plugin:1.5:process (process-resource-bundles)
@ beam-sdks-java-build-tools ---
2017-07-16T13:04:20.824 [INFO] 
2017-07-16T13:04:20.824 [INFO] --- maven-resources-plugin:3.0.2:resources (default-resources)
@ beam-sdks-java-build-tools ---
2017-07-16T13:04:20.826 [INFO] Using 'UTF-8' encoding to copy filtered resources.
2017-07-16T13:04:20.827 [INFO] Copying 4 resources
2017-07-16T13:04:20.829 [INFO] Copying 3 resources
2017-07-16T13:04:20.937 [INFO] 
2017-07-16T13:04:20.937 [INFO] --- maven-compiler-plugin:3.6.1:compile (default-compile) @
beam-sdks-java-build-tools ---
2017-07-16T13:04:20.943 [INFO] Downloading: https://repo.maven.apache.org/maven2/org/apache/maven/shared/maven-shared-incremental/1.1/maven-shared-incremental-1.1.pom
2017-07-16T13:04:20.973 [INFO] Downloaded: https://repo.maven.apache.org/maven2/org/apache/maven/shared/maven-shared-incremental/1.1/maven-shared-incremental-1.1.pom
(5 KB at 154.4 KB/sec)
2017-07-16T13:04:20.978 [INFO] Downloading: https://repo.maven.apache.org/maven2/org/apache/maven/shared/maven-shared-utils/0.1/maven-shared-utils-0.1.pom
2017-07-16T13:04:21.006 [INFO] Downloaded: https://repo.maven.apache.org/maven2/org/apache/maven/shared/maven-shared-utils/0.1/maven-shared-utils-0.1.pom
(4 KB at 141.1 KB/sec)
2017-07-16T13:04:21.009 [INFO] Downloading: https://repo.maven.apache.org/maven2/org/ow2/asm/asm/6.0_ALPHA/asm-6.0_ALPHA.pom
2017-07-16T13:04:21.036 [INFO] Downloaded: https://repo.maven.apache.org/maven2/org/ow2/asm/asm/6.0_ALPHA/asm-6.0_ALPHA.pom
(2 KB at 70.1 KB/sec)
2017-07-16T13:04:21.038 [INFO] Downloading: https://repo.maven.apache.org/maven2/org/ow2/asm/asm-parent/6.0_ALPHA/asm-parent-6.0_ALPHA.pom
2017-07-16T13:04:21.065 [INFO] Downloaded: https://repo.maven.apache.org/maven2/org/ow2/asm/asm-parent/6.0_ALPHA/asm-parent-6.0_ALPHA.pom
(6 KB at 198.9 KB/sec)
2017-07-16T13:04:21.068 [INFO] Downloading: https://repo.maven.apache.org/maven2/com/thoughtworks/qdox/qdox/2.0-M5/qdox-2.0-M5.pom
2017-07-16T13:04:21.098 [INFO] Downloaded: https://repo.maven.apache.org/maven2/com/thoughtworks/qdox/qdox/2.0-M5/qdox-2.0-M5.pom
(16 KB at 507.5 KB/sec)
2017-07-16T13:04:21.100 [INFO] Downloading: https://repo.maven.apache.org/maven2/org/codehaus/plexus/plexus-compiler-api/2.8.1/plexus-compiler-api-2.8.1.pom
2017-07-16T13:04:21.127 [INFO] Downloaded: https://repo.maven.apache.org/maven2/org/codehaus/plexus/plexus-compiler-api/2.8.1/plexus-compiler-api-2.8.1.pom
(893 B at 32.3 KB/sec)
2017-07-16T13:04:21.128 [INFO] Downloading: https://repo.maven.apache.org/maven2/org/codehaus/plexus/plexus-compiler/2.8.1/plexus-compiler-2.8.1.pom
2017-07-16T13:04:21.160 [INFO] Downloaded: https://repo.maven.apache.org/maven2/org/codehaus/plexus/plexus-compiler/2.8.1/plexus-compiler-2.8.1.pom
(5 KB at 152.7 KB/sec)
2017-07-16T13:04:21.167 [INFO] Downloading: https://repo.maven.apache.org/maven2/org/codehaus/plexus/plexus-compiler-manager/2.8.1/plexus-compiler-manager-2.8.1.pom
2017-07-16T13:04:21.194 [INFO] Downloaded: https://repo.maven.apache.org/maven2/org/codehaus/plexus/plexus-compiler-manager/2.8.1/plexus-compiler-manager-2.8.1.pom
(713 B at 25.8 KB/sec)
2017-07-16T13:04:21.198 [INFO] Downloading: https://repo.maven.apache.org/maven2/org/codehaus/plexus/plexus-compiler-javac/2.8.1/plexus-compiler-javac-2.8.1.pom
2017-07-16T13:04:21.226 [INFO] Downloaded: https://repo.maven.apache.org/maven2/org/codehaus/plexus/plexus-compiler-javac/2.8.1/plexus-compiler-javac-2.8.1.pom
(794 B at 27.7 KB/sec)
2017-07-16T13:04:21.228 [INFO] Downloading: https://repo.maven.apache.org/maven2/org/codehaus/plexus/plexus-compilers/2.8.1/plexus-compilers-2.8.1.pom
2017-07-16T13:04:21.255 [INFO] Downloaded: https://repo.maven.apache.org/maven2/org/codehaus/plexus/plexus-compilers/2.8.1/plexus-compilers-2.8.1.pom
(2 KB at 52.0 KB/sec)
2017-07-16T13:04:21.260 [INFO] Downloading: https://repo.maven.apache.org/maven2/org/apache/maven/shared/maven-shared-utils/3.1.0/maven-shared-utils-3.1.0.jar
2017-07-16T13:04:21.261 [INFO] Downloading: https://repo.maven.apache.org/maven2/org/apache/maven/shared/maven-shared-incremental/1.1/maven-shared-incremental-1.1.jar
2017-07-16T13:04:21.261 [INFO] Downloading: https://repo.maven.apache.org/maven2/org/ow2/asm/asm/6.0_ALPHA/asm-6.0_ALPHA.jar
2017-07-16T13:04:21.263 [INFO] Downloading: https://repo.maven.apache.org/maven2/com/thoughtworks/qdox/qdox/2.0-M5/qdox-2.0-M5.jar
2017-07-16T13:04:21.267 [INFO] Downloading: https://repo.maven.apache.org/maven2/org/codehaus/plexus/plexus-compiler-api/2.8.1/plexus-compiler-api-2.8.1.jar
2017-07-16T13:04:21.310 [INFO] Downloaded: https://repo.maven.apache.org/maven2/org/apache/maven/shared/maven-shared-incremental/1.1/maven-shared-incremental-1.1.jar
(14 KB at 264.4 KB/sec)
2017-07-16T13:04:21.310 [INFO] Downloading: https://repo.maven.apache.org/maven2/org/codehaus/plexus/plexus-compiler-manager/2.8.1/plexus-compiler-manager-2.8.1.jar
2017-07-16T13:04:21.326 [INFO] Downloaded: https://repo.maven.apache.org/maven2/org/codehaus/plexus/plexus-compiler-api/2.8.1/plexus-compiler-api-2.8.1.jar
(26 KB at 408.2 KB/sec)
2017-07-16T13:04:21.326 [INFO] Downloading: https://repo.maven.apache.org/maven2/org/codehaus/plexus/plexus-compiler-javac/2.8.1/plexus-compiler-javac-2.8.1.jar
2017-07-16T13:04:21.336 [INFO] Downloaded: https://repo.maven.apache.org/maven2/org/codehaus/plexus/plexus-compiler-manager/2.8.1/plexus-compiler-manager-2.8.1.jar
(5 KB at 66.4 KB/sec)
2017-07-16T13:04:21.338 [INFO] Downloaded: https://repo.maven.apache.org/maven2/org/ow2/asm/asm/6.0_ALPHA/asm-6.0_ALPHA.jar
(55 KB at 698.9 KB/sec)
2017-07-16T13:04:21.364 [INFO] Downloaded: https://repo.maven.apache.org/maven2/org/codehaus/plexus/plexus-compiler-javac/2.8.1/plexus-compiler-javac-2.8.1.jar
(20 KB at 200.8 KB/sec)
2017-07-16T13:04:21.367 [INFO] Downloaded: https://repo.maven.apache.org/maven2/org/apache/maven/shared/maven-shared-utils/3.1.0/maven-shared-utils-3.1.0.jar
(160 KB at 1480.1 KB/sec)
2017-07-16T13:04:21.393 [INFO] Downloaded: https://repo.maven.apache.org/maven2/com/thoughtworks/qdox/qdox/2.0-M5/qdox-2.0-M5.jar
(307 KB at 2318.9 KB/sec)
2017-07-16T13:04:21.469 [INFO] No sources to compile
2017-07-16T13:04:21.577 [INFO] 
2017-07-16T13:04:21.577 [INFO] --- formatter-maven-plugin:2.0.1:format (test-code-style) @
beam-sdks-java-build-tools ---
2017-07-16T13:04:21.582 [INFO] Downloading: https://repo.maven.apache.org/maven2/com/google/guava/guava/20.0/guava-20.0.pom
2017-07-16T13:04:21.621 [INFO] Downloaded: https://repo.maven.apache.org/maven2/com/google/guava/guava/20.0/guava-20.0.pom
(7 KB at 171.2 KB/sec)
2017-07-16T13:04:21.624 [INFO] Downloading: https://repo.maven.apache.org/maven2/com/google/guava/guava-parent/20.0/guava-parent-20.0.pom
2017-07-16T13:04:21.652 [INFO] Downloaded: https://repo.maven.apache.org/maven2/com/google/guava/guava-parent/20.0/guava-parent-20.0.pom
(10 KB at 345.1 KB/sec)
2017-07-16T13:04:21.656 [INFO] Downloading: https://repo.maven.apache.org/maven2/net/revelc/code/formatter/jdt-core/2.0.1/jdt-core-2.0.1.pom
2017-07-16T13:04:21.682 [INFO] Downloaded: https://repo.maven.apache.org/maven2/net/revelc/code/formatter/jdt-core/2.0.1/jdt-core-2.0.1.pom
(2 KB at 46.8 KB/sec)
2017-07-16T13:04:21.684 [INFO] Downloading: https://repo.maven.apache.org/maven2/net/revelc/code/formatter/formatters/2.0.1/formatters-2.0.1.pom
2017-07-16T13:04:21.722 [INFO] Downloaded: https://repo.maven.apache.org/maven2/net/revelc/code/formatter/formatters/2.0.1/formatters-2.0.1.pom
(4 KB at 98.1 KB/sec)
2017-07-16T13:04:21.727 [INFO] Downloading: https://repo.maven.apache.org/maven2/net/revelc/code/formatter/jsdt-core/2.0.1/jsdt-core-2.0.1.pom
2017-07-16T13:04:21.755 [INFO] Downloaded: https://repo.maven.apache.org/maven2/net/revelc/code/formatter/jsdt-core/2.0.1/jsdt-core-2.0.1.pom
(2 KB at 43.5 KB/sec)
2017-07-16T13:04:21.760 [INFO] Downloading: https://repo.maven.apache.org/maven2/org/apache/commons/commons-digester3/3.2/commons-digester3-3.2.pom
2017-07-16T13:04:21.792 [INFO] Downloaded: https://repo.maven.apache.org/maven2/org/apache/commons/commons-digester3/3.2/commons-digester3-3.2.pom
(18 KB at 554.1 KB/sec)
2017-07-16T13:04:21.797 [INFO] Downloading: https://repo.maven.apache.org/maven2/cglib/cglib/2.2.2/cglib-2.2.2.pom
2017-07-16T13:04:21.834 [INFO] Downloaded: https://repo.maven.apache.org/maven2/cglib/cglib/2.2.2/cglib-2.2.2.pom
(2 KB at 38.9 KB/sec)
2017-07-16T13:04:21.836 [INFO] Downloading: https://repo.maven.apache.org/maven2/asm/asm/3.3.1/asm-3.3.1.pom
2017-07-16T13:04:21.862 [INFO] Downloaded: https://repo.maven.apache.org/maven2/asm/asm/3.3.1/asm-3.3.1.pom
(266 B at 10.0 KB/sec)
2017-07-16T13:04:21.864 [INFO] Downloading: https://repo.maven.apache.org/maven2/asm/asm-parent/3.3.1/asm-parent-3.3.1.pom
2017-07-16T13:04:21.890 [INFO] Downloaded: https://repo.maven.apache.org/maven2/asm/asm-parent/3.3.1/asm-parent-3.3.1.pom
(5 KB at 162.7 KB/sec)
2017-07-16T13:04:21.892 [INFO] Downloading: https://repo.maven.apache.org/maven2/commons-beanutils/commons-beanutils/1.8.3/commons-beanutils-1.8.3.pom
2017-07-16T13:04:21.918 [INFO] Downloaded: https://repo.maven.apache.org/maven2/commons-beanutils/commons-beanutils/1.8.3/commons-beanutils-1.8.3.pom
(11 KB at 420.6 KB/sec)
2017-07-16T13:04:21.920 [INFO] Downloading: https://repo.maven.apache.org/maven2/org/apache/commons/commons-parent/14/commons-parent-14.pom
2017-07-16T13:04:21.948 [INFO] Downloaded: https://repo.maven.apache.org/maven2/org/apache/commons/commons-parent/14/commons-parent-14.pom
(31 KB at 1094.8 KB/sec)
2017-07-16T13:04:21.960 [INFO] Downloading: https://repo.maven.apache.org/maven2/org/apache/maven/plugin-tools/maven-plugin-annotations/3.5/maven-plugin-annotations-3.5.pom
2017-07-16T13:04:21.991 [INFO] Downloaded: https://repo.maven.apache.org/maven2/org/apache/maven/plugin-tools/maven-plugin-annotations/3.5/maven-plugin-annotations-3.5.pom
(2 KB at 52.6 KB/sec)
2017-07-16T13:04:21.993 [INFO] Downloading: https://repo.maven.apache.org/maven2/org/apache/maven/plugin-tools/maven-plugin-tools/3.5/maven-plugin-tools-3.5.pom
2017-07-16T13:04:22.023 [INFO] Downloaded: https://repo.maven.apache.org/maven2/org/apache/maven/plugin-tools/maven-plugin-tools/3.5/maven-plugin-tools-3.5.pom
(16 KB at 545.2 KB/sec)
2017-07-16T13:04:22.028 [INFO] Downloading: https://repo.maven.apache.org/maven2/org/codehaus/plexus/plexus-resources/1.0.1/plexus-resources-1.0.1.pom
2017-07-16T13:04:22.054 [INFO] Downloaded: https://repo.maven.apache.org/maven2/org/codehaus/plexus/plexus-resources/1.0.1/plexus-resources-1.0.1.pom
(2 KB at 49.5 KB/sec)
2017-07-16T13:04:22.058 [INFO] Downloading: https://repo.maven.apache.org/maven2/org/codehaus/plexus/plexus-utils/3.0.8/plexus-utils-3.0.8.pom
2017-07-16T13:04:22.085 [INFO] Downloaded: https://repo.maven.apache.org/maven2/org/codehaus/plexus/plexus-utils/3.0.8/plexus-utils-3.0.8.pom
(4 KB at 113.6 KB/sec)
2017-07-16T13:04:22.090 [INFO] Downloading: https://repo.maven.apache.org/maven2/com/google/guava/guava/20.0/guava-20.0.jar
2017-07-16T13:04:22.095 [INFO] Downloading: https://repo.maven.apache.org/maven2/net/revelc/code/formatter/jdt-core/2.0.1/jdt-core-2.0.1.jar
2017-07-16T13:04:22.096 [INFO] Downloading: https://repo.maven.apache.org/maven2/net/revelc/code/formatter/jsdt-core/2.0.1/jsdt-core-2.0.1.jar
2017-07-16T13:04:22.096 [INFO] Downloading: https://repo.maven.apache.org/maven2/org/apache/commons/commons-digester3/3.2/commons-digester3-3.2.jar
2017-07-16T13:04:22.097 [INFO] Downloading: https://repo.maven.apache.org/maven2/cglib/cglib/2.2.2/cglib-2.2.2.jar
2017-07-16T13:04:22.234 [INFO] Downloaded: https://repo.maven.apache.org/maven2/org/apache/commons/commons-digester3/3.2/commons-digester3-3.2.jar
(236 KB at 1722.3 KB/sec)
2017-07-16T13:04:22.234 [INFO] Downloading: https://repo.maven.apache.org/maven2/asm/asm/3.3.1/asm-3.3.1.jar
2017-07-16T13:04:22.242 [INFO] Downloaded: https://repo.maven.apache.org/maven2/cglib/cglib/2.2.2/cglib-2.2.2.jar
(281 KB at 1921.0 KB/sec)
2017-07-16T13:04:22.242 [INFO] Downloading: https://repo.maven.apache.org/maven2/commons-beanutils/commons-beanutils/1.8.3/commons-beanutils-1.8.3.jar
[INFO] I/O exception (java.net.SocketException) caught when processing request to {s}->https://repo.maven.apache.org:443:
Connection reset
[INFO] Retrying request to {s}->https://repo.maven.apache.org:443
2017-07-16T13:04:22.368 [INFO] Downloading: https://repo.maven.apache.org/maven2/commons-logging/commons-logging/1.1.1/commons-logging-1.1.1.jar
2017-07-16T13:04:22.379 [INFO] Downloaded: https://repo.maven.apache.org/maven2/commons-beanutils/commons-beanutils/1.8.3/commons-beanutils-1.8.3.jar
(227 KB at 803.5 KB/sec)
2017-07-16T13:04:22.380 [INFO] Downloading: https://repo.maven.apache.org/maven2/org/apache/maven/plugin-tools/maven-plugin-annotations/3.5/maven-plugin-annotations-3.5.jar
2017-07-16T13:04:22.410 [INFO] Downloaded: https://repo.maven.apache.org/maven2/org/apache/maven/plugin-tools/maven-plugin-annotations/3.5/maven-plugin-annotations-3.5.jar
(14 KB at 44.8 KB/sec)
2017-07-16T13:04:22.410 [INFO] Downloading: https://repo.maven.apache.org/maven2/commons-io/commons-io/2.2/commons-io-2.2.jar
2017-07-16T13:04:22.432 [INFO] Downloaded: https://repo.maven.apache.org/maven2/asm/asm/3.3.1/asm-3.3.1.jar
(43 KB at 127.0 KB/sec)
2017-07-16T13:04:22.432 [INFO] Downloading: https://repo.maven.apache.org/maven2/org/codehaus/plexus/plexus-resources/1.0.1/plexus-resources-1.0.1.jar
2017-07-16T13:04:22.463 [INFO] Downloaded: https://repo.maven.apache.org/maven2/org/codehaus/plexus/plexus-resources/1.0.1/plexus-resources-1.0.1.jar
(22 KB at 58.4 KB/sec)
2017-07-16T13:04:22.463 [INFO] Downloading: https://repo.maven.apache.org/maven2/classworlds/classworlds/1.1-alpha-2/classworlds-1.1-alpha-2.jar
2017-07-16T13:04:22.464 [INFO] Downloaded: https://repo.maven.apache.org/maven2/commons-logging/commons-logging/1.1.1/commons-logging-1.1.1.jar
(60 KB at 161.5 KB/sec)
2017-07-16T13:04:22.495 [INFO] Downloaded: https://repo.maven.apache.org/maven2/commons-io/commons-io/2.2/commons-io-2.2.jar
(170 KB at 425.9 KB/sec)
2017-07-16T13:04:22.497 [INFO] Downloaded: https://repo.maven.apache.org/maven2/classworlds/classworlds/1.1-alpha-2/classworlds-1.1-alpha-2.jar
(37 KB at 91.6 KB/sec)
2017-07-16T13:04:22.597 [INFO] Downloaded: https://repo.maven.apache.org/maven2/com/google/guava/guava/20.0/guava-20.0.jar
(2386 KB at 4695.6 KB/sec)
[WARNING] Failed to getClass for net.revelc.code.formatter.FormatterMojo
[JENKINS] Archiving disabled
[JENKINS] Archiving disabled
[JENKINS] Archiving disabled
[JENKINS] Archiving disabled
[JENKINS] Archiving disabled
[JENKINS] Archiving disabled
[JENKINS] Archiving disabled
[JENKINS] Archiving disabled
[JENKINS] Archiving disabled
[JENKINS] Archiving disabled
[JENKINS] Archiving disabled
[JENKINS] Archiving disabled
[JENKINS] Archiving disabled
2017-07-16T13:04:27.788 [INFO] ------------------------------------------------------------------------
2017-07-16T13:04:27.788 [INFO] Reactor Summary:
2017-07-16T13:04:27.788 [INFO] 
2017-07-16T13:04:27.788 [INFO] Apache Beam :: Parent .............................. SUCCESS
[ 27.407 s]
2017-07-16T13:04:27.788 [INFO] Apache Beam :: SDKs :: Java :: Build Tools ......... FAILURE
[  3.036 s]
2017-07-16T13:04:27.788 [INFO] Apache Beam :: SDKs ................................ SKIPPED
2017-07-16T13:04:27.788 [INFO] Apache Beam :: SDKs :: Common ...................... SKIPPED
2017-07-16T13:04:27.788 [INFO] Apache Beam :: SDKs :: Common :: Runner API ........ SKIPPED
2017-07-16T13:04:27.788 [INFO] Apache Beam :: SDKs :: Common :: Fn API ............ SKIPPED
2017-07-16T13:04:27.788 [INFO] Apache Beam :: SDKs :: Java ........................ SKIPPED
2017-07-16T13:04:27.788 [INFO] Apache Beam :: SDKs :: Java :: Core ................ SKIPPED
2017-07-16T13:04:27.788 [INFO] Apache Beam :: Runners ............................. SKIPPED
2017-07-16T13:04:27.788 [INFO] Apache Beam :: Runners :: Core Construction Java ... SKIPPED
2017-07-16T13:04:27.789 [INFO] Apache Beam :: Runners :: Core Java ................ SKIPPED
2017-07-16T13:04:27.789 [INFO] Apache Beam :: Runners :: Flink .................... SKIPPED
2017-07-16T13:04:27.789 [INFO] ------------------------------------------------------------------------
2017-07-16T13:04:27.789 [INFO] BUILD FAILURE
2017-07-16T13:04:27.789 [INFO] ------------------------------------------------------------------------
2017-07-16T13:04:27.789 [INFO] Total time: 01:07 min
2017-07-16T13:04:27.789 [INFO] Finished at: 2017-07-16T13:04:27+00:00
2017-07-16T13:04:28.251 [INFO] Final Memory: 58M/683M
2017-07-16T13:04:28.251 [INFO] ------------------------------------------------------------------------
2017-07-16T13:04:28.252 [WARNING] The requested profile "validates-runner-tests" could not
be activated because it does not exist.
2017-07-16T13:04:28.257 [ERROR] Failed to execute goal net.revelc.code.formatter:formatter-maven-plugin:2.0.1:format
(test-code-style) on project beam-sdks-java-build-tools: Execution test-code-style of goal
net.revelc.code.formatter:formatter-maven-plugin:2.0.1:format failed: Plugin net.revelc.code.formatter:formatter-maven-plugin:2.0.1
or one of its dependencies could not be resolved: The following artifacts could not be resolved:
net.revelc.code.formatter:jdt-core:jar:2.0.1, net.revelc.code.formatter:jsdt-core:jar:2.0.1:
Could not transfer artifact net.revelc.code.formatter:jdt-core:jar:2.0.1 from/to central (https://repo.maven.apache.org/maven2):
GET request of: net/revelc/code/formatter/jdt-core/2.0.1/jdt-core-2.0.1.jar from central failed:
Connection reset -> [Help 1]
org.apache.maven.lifecycle.LifecycleExecutionException: Failed to execute goal net.revelc.code.formatter:formatter-maven-plugin:2.0.1:format
(test-code-style) on project beam-sdks-java-build-tools: Execution test-code-style of goal
net.revelc.code.formatter:formatter-maven-plugin:2.0.1:format failed: Plugin net.revelc.code.formatter:formatter-maven-plugin:2.0.1
or one of its dependencies could not be resolved: The following artifacts could not be resolved:
net.revelc.code.formatter:jdt-core:jar:2.0.1, net.revelc.code.formatter:jsdt-core:jar:2.0.1:
Could not transfer artifact net.revelc.code.formatter:jdt-core:jar:2.0.1 from/to central (https://repo.maven.apache.org/maven2):
GET request of: net/revelc/code/formatter/jdt-core/2.0.1/jdt-core-2.0.1.jar from central failed
	at org.apache.maven.lifecycle.internal.MojoExecutor.execute(MojoExecutor.java:224)
	at org.apache.maven.lifecycle.internal.MojoExecutor.execute(MojoExecutor.java:153)
	at org.apache.maven.lifecycle.internal.MojoExecutor.execute(MojoExecutor.java:145)
	at org.apache.maven.lifecycle.internal.LifecycleModuleBuilder.buildProject(LifecycleModuleBuilder.java:116)
	at org.apache.maven.lifecycle.internal.LifecycleModuleBuilder.buildProject(LifecycleModuleBuilder.java:80)
	at org.apache.maven.lifecycle.internal.builder.singlethreaded.SingleThreadedBuilder.build(SingleThreadedBuilder.java:51)
	at org.apache.maven.lifecycle.internal.LifecycleStarter.execute(LifecycleStarter.java:128)
	at org.apache.maven.DefaultMaven.doExecute(DefaultMaven.java:307)
	at org.apache.maven.DefaultMaven.doExecute(DefaultMaven.java:193)
	at org.apache.maven.DefaultMaven.execute(DefaultMaven.java:106)
	at org.jvnet.hudson.maven3.launcher.Maven33Launcher.main(Maven33Launcher.java:129)
	at sun.reflect.NativeMethodAccessorImpl.invoke0(Native Method)
	at sun.reflect.NativeMethodAccessorImpl.invoke(NativeMethodAccessorImpl.java:62)
	at sun.reflect.DelegatingMethodAccessorImpl.invoke(DelegatingMethodAccessorImpl.java:43)
	at java.lang.reflect.Method.invoke(Method.java:498)
	at org.codehaus.plexus.classworlds.launcher.Launcher.launchStandard(Launcher.java:330)
	at org.codehaus.plexus.classworlds.launcher.Launcher.launch(Launcher.java:238)
	at jenkins.maven3.agent.Maven33Main.launch(Maven33Main.java:176)
	at sun.reflect.NativeMethodAccessorImpl.invoke0(Native Method)
	at sun.reflect.NativeMethodAccessorImpl.invoke(NativeMethodAccessorImpl.java:62)
	at sun.reflect.DelegatingMethodAccessorImpl.invoke(DelegatingMethodAccessorImpl.java:43)
	at java.lang.reflect.Method.invoke(Method.java:498)
	at hudson.maven.Maven3Builder.call(Maven3Builder.java:139)
	at hudson.maven.Maven3Builder.call(Maven3Builder.java:70)
	at hudson.remoting.UserRequest.perform(UserRequest.java:153)
	at hudson.remoting.UserRequest.perform(UserRequest.java:50)
	at hudson.remoting.Request$2.run(Request.java:336)
	at hudson.remoting.InterceptingExecutorService$1.call(InterceptingExecutorService.java:68)
	at java.util.concurrent.FutureTask.run(FutureTask.java:266)
	at java.util.concurrent.ThreadPoolExecutor.runWorker(ThreadPoolExecutor.java:1142)
	at java.util.concurrent.ThreadPoolExecutor$Worker.run(ThreadPoolExecutor.java:617)
	at java.lang.Thread.run(Thread.java:748)
Caused by: org.apache.maven.plugin.PluginExecutionException: Execution test-code-style of
goal net.revelc.code.formatter:formatter-maven-plugin:2.0.1:format failed: Plugin net.revelc.code.formatter:formatter-maven-plugin:2.0.1
or one of its dependencies could not be resolved: The following artifacts could not be resolved:
net.revelc.code.formatter:jdt-core:jar:2.0.1, net.revelc.code.formatter:jsdt-core:jar:2.0.1:
Could not transfer artifact net.revelc.code.formatter:jdt-core:jar:2.0.1 from/to central (https://repo.maven.apache.org/maven2):
GET request of: net/revelc/code/formatter/jdt-core/2.0.1/jdt-core-2.0.1.jar from central failed
	at org.apache.maven.plugin.DefaultBuildPluginManager.executeMojo(DefaultBuildPluginManager.java:106)
	at org.apache.maven.lifecycle.internal.MojoExecutor.execute(MojoExecutor.java:208)
	... 31 more
Caused by: org.apache.maven.plugin.PluginResolutionException: Plugin net.revelc.code.formatter:formatter-maven-plugin:2.0.1
or one of its dependencies could not be resolved: The following artifacts could not be resolved:
net.revelc.code.formatter:jdt-core:jar:2.0.1, net.revelc.code.formatter:jsdt-core:jar:2.0.1:
Could not transfer artifact net.revelc.code.formatter:jdt-core:jar:2.0.1 from/to central (https://repo.maven.apache.org/maven2):
GET request of: net/revelc/code/formatter/jdt-core/2.0.1/jdt-core-2.0.1.jar from central failed
	at org.apache.maven.plugin.internal.DefaultPluginDependenciesResolver.resolveInternal(DefaultPluginDependenciesResolver.java:218)
	at org.apache.maven.plugin.internal.DefaultPluginDependenciesResolver.resolve(DefaultPluginDependenciesResolver.java:149)
	at org.apache.maven.plugin.internal.DefaultMavenPluginManager.createPluginRealm(DefaultMavenPluginManager.java:422)
	at org.apache.maven.plugin.internal.DefaultMavenPluginManager.setupPluginRealm(DefaultMavenPluginManager.java:385)
	at org.apache.maven.plugin.DefaultBuildPluginManager.getPluginRealm(DefaultBuildPluginManager.java:231)
	at org.apache.maven.plugin.DefaultBuildPluginManager.executeMojo(DefaultBuildPluginManager.java:102)
	... 32 more
Caused by: org.eclipse.aether.resolution.ArtifactResolutionException: The following artifacts
could not be resolved: net.revelc.code.formatter:jdt-core:jar:2.0.1, net.revelc.code.formatter:jsdt-core:jar:2.0.1:
Could not transfer artifact net.revelc.code.formatter:jdt-core:jar:2.0.1 from/to central (https://repo.maven.apache.org/maven2):
GET request of: net/revelc/code/formatter/jdt-core/2.0.1/jdt-core-2.0.1.jar from central failed
	at org.eclipse.aether.internal.impl.DefaultArtifactResolver.resolve(DefaultArtifactResolver.java:444)
	at org.eclipse.aether.internal.impl.DefaultArtifactResolver.resolveArtifacts(DefaultArtifactResolver.java:246)
	at org.eclipse.aether.internal.impl.DefaultRepositorySystem.resolveDependencies(DefaultRepositorySystem.java:367)
	at org.apache.maven.plugin.internal.DefaultPluginDependenciesResolver.resolveInternal(DefaultPluginDependenciesResolver.java:210)
	... 37 more
Caused by: org.eclipse.aether.transfer.ArtifactTransferException: Could not transfer artifact
net.revelc.code.formatter:jdt-core:jar:2.0.1 from/to central (https://repo.maven.apache.org/maven2):
GET request of: net/revelc/code/formatter/jdt-core/2.0.1/jdt-core-2.0.1.jar from central failed
	at org.eclipse.aether.connector.basic.ArtifactTransportListener.transferFailed(ArtifactTransportListener.java:43)
	at org.eclipse.aether.connector.basic.BasicRepositoryConnector$TaskRunner.run(BasicRepositoryConnector.java:355)
	at org.eclipse.aether.util.concurrency.RunnableErrorForwarder$1.run(RunnableErrorForwarder.java:67)
	... 3 more
Caused by: org.apache.maven.wagon.TransferFailedException: GET request of: net/revelc/code/formatter/jdt-core/2.0.1/jdt-core-2.0.1.jar
from central failed
	at org.apache.maven.wagon.AbstractWagon.getTransfer(AbstractWagon.java:363)
	at org.apache.maven.wagon.AbstractWagon.getTransfer(AbstractWagon.java:316)
	at org.apache.maven.wagon.AbstractWagon.getTransfer(AbstractWagon.java:285)
	at org.apache.maven.wagon.StreamWagon.getIfNewer(StreamWagon.java:97)
	at org.apache.maven.wagon.StreamWagon.get(StreamWagon.java:61)
	at org.eclipse.aether.transport.wagon.WagonTransporter$GetTaskRunner.run(WagonTransporter.java:560)
	at org.eclipse.aether.transport.wagon.WagonTransporter.execute(WagonTransporter.java:427)
	at org.eclipse.aether.transport.wagon.WagonTransporter.get(WagonTransporter.java:404)
	at org.eclipse.aether.connector.basic.BasicRepositoryConnector$GetTaskRunner.runTask(BasicRepositoryConnector.java:447)
	at org.eclipse.aether.connector.basic.BasicRepositoryConnector$TaskRunner.run(BasicRepositoryConnector.java:350)
	... 4 more
Caused by: java.net.SocketException: Connection reset
	at java.net.SocketInputStream.read(SocketInputStream.java:210)
	at java.net.SocketInputStream.read(SocketInputStream.java:141)
	at sun.security.ssl.InputRecord.readFully(InputRecord.java:465)
	at sun.security.ssl.InputRecord.readV3Record(InputRecord.java:593)
	at sun.security.ssl.InputRecord.read(InputRecord.java:532)
	at sun.security.ssl.SSLSocketImpl.readRecord(SSLSocketImpl.java:973)
	at sun.security.ssl.SSLSocketImpl.readDataRecord(SSLSocketImpl.java:930)
	at sun.security.ssl.AppInputStream.read(AppInputStream.java:105)
	at org.apache.maven.wagon.providers.http.httpclient.impl.io.SessionInputBufferImpl.streamRead(SessionInputBufferImpl.java:136)
	at org.apache.maven.wagon.providers.http.httpclient.impl.io.SessionInputBufferImpl.read(SessionInputBufferImpl.java:195)
	at org.apache.maven.wagon.providers.http.httpclient.impl.io.ContentLengthInputStream.read(ContentLengthInputStream.java:178)
	at org.apache.maven.wagon.providers.http.httpclient.conn.EofSensorInputStream.read(EofSensorInputStream.java:137)
	at org.apache.maven.wagon.AbstractWagon.transfer(AbstractWagon.java:531)
	at org.apache.maven.wagon.AbstractWagon.getTransfer(AbstractWagon.java:353)
	... 13 more
2017-07-16T13:04:28.271 [ERROR] 
2017-07-16T13:04:28.271 [ERROR] Re-run Maven using the -X switch to enable full debug logging.
2017-07-16T13:04:28.271 [ERROR] 
2017-07-16T13:04:28.271 [ERROR] For more information about the errors and possible solutions,
please read the following articles:
2017-07-16T13:04:28.271 [ERROR] [Help 1] http://cwiki.apache.org/confluence/display/MAVEN/PluginResolutionException
2017-07-16T13:04:28.271 [ERROR] 
2017-07-16T13:04:28.271 [ERROR] After correcting the problems, you can resume the build with
the command
2017-07-16T13:04:28.271 [ERROR]   mvn <goals> -rf :beam-sdks-java-build-tools
channel stopped
Not sending mail to unregistered user fipsy@google.com
Not sending mail to unregistered user kirpichov@google.com
Not sending mail to unregistered user klk@google.com

Mime
View raw message