beam-commits mailing list archives

Site index · List index
Message view « Date » · « Thread »
Top « Date » · « Thread »
From Apache Jenkins Server <jenk...@builds.apache.org>
Subject Build failed in Jenkins: beam_PostCommit_Python_Verify #2806
Date Wed, 26 Jul 2017 21:37:14 GMT
See <https://builds.apache.org/job/beam_PostCommit_Python_Verify/2806/display/redirect>

------------------------------------------
[...truncated 568.35 KB...]
Collecting six (from pyhamcrest->-r postcommit_requirements.txt (line 1))
  File was already downloaded /tmp/dataflow-requirements-cache/six-1.10.0.tar.gz
Collecting funcsigs>=1 (from mock->-r postcommit_requirements.txt (line 2))
  File was already downloaded /tmp/dataflow-requirements-cache/funcsigs-1.0.2.tar.gz
Collecting pbr>=0.11 (from mock->-r postcommit_requirements.txt (line 2))
  File was already downloaded /tmp/dataflow-requirements-cache/pbr-3.1.1.tar.gz
Successfully downloaded pyhamcrest mock setuptools six funcsigs pbr
test_as_list_twice (apache_beam.transforms.sideinputs_test.SideInputsTest) ... ok
DEPRECATION: pip install --download has been deprecated and will be removed in the future.
Pip now has a download command that should be used instead.
Collecting pyhamcrest (from -r postcommit_requirements.txt (line 1))
  File was already downloaded /tmp/dataflow-requirements-cache/PyHamcrest-1.9.0.tar.gz
Collecting mock (from -r postcommit_requirements.txt (line 2))
  File was already downloaded /tmp/dataflow-requirements-cache/mock-2.0.0.tar.gz
Collecting setuptools (from pyhamcrest->-r postcommit_requirements.txt (line 1))
  File was already downloaded /tmp/dataflow-requirements-cache/setuptools-36.2.4.zip
Collecting six (from pyhamcrest->-r postcommit_requirements.txt (line 1))
  File was already downloaded /tmp/dataflow-requirements-cache/six-1.10.0.tar.gz
Collecting funcsigs>=1 (from mock->-r postcommit_requirements.txt (line 2))
  File was already downloaded /tmp/dataflow-requirements-cache/funcsigs-1.0.2.tar.gz
Collecting pbr>=0.11 (from mock->-r postcommit_requirements.txt (line 2))
  File was already downloaded /tmp/dataflow-requirements-cache/pbr-3.1.1.tar.gz
Successfully downloaded pyhamcrest mock setuptools six funcsigs pbr
test_as_list_and_as_dict_side_inputs (apache_beam.transforms.sideinputs_test.SideInputsTest)
... ok
DEPRECATION: pip install --download has been deprecated and will be removed in the future.
Pip now has a download command that should be used instead.
Collecting pyhamcrest (from -r postcommit_requirements.txt (line 1))
  File was already downloaded /tmp/dataflow-requirements-cache/PyHamcrest-1.9.0.tar.gz
Collecting mock (from -r postcommit_requirements.txt (line 2))
  File was already downloaded /tmp/dataflow-requirements-cache/mock-2.0.0.tar.gz
Collecting setuptools (from pyhamcrest->-r postcommit_requirements.txt (line 1))
  File was already downloaded /tmp/dataflow-requirements-cache/setuptools-36.2.4.zip
Collecting six (from pyhamcrest->-r postcommit_requirements.txt (line 1))
  File was already downloaded /tmp/dataflow-requirements-cache/six-1.10.0.tar.gz
Collecting funcsigs>=1 (from mock->-r postcommit_requirements.txt (line 2))
  File was already downloaded /tmp/dataflow-requirements-cache/funcsigs-1.0.2.tar.gz
Collecting pbr>=0.11 (from mock->-r postcommit_requirements.txt (line 2))
  File was already downloaded /tmp/dataflow-requirements-cache/pbr-3.1.1.tar.gz
Successfully downloaded pyhamcrest mock setuptools six funcsigs pbr
test_as_singleton_with_different_defaults (apache_beam.transforms.sideinputs_test.SideInputsTest)
... ok
DEPRECATION: pip install --download has been deprecated and will be removed in the future.
Pip now has a download command that should be used instead.
Collecting pyhamcrest (from -r postcommit_requirements.txt (line 1))
  File was already downloaded /tmp/dataflow-requirements-cache/PyHamcrest-1.9.0.tar.gz
Collecting mock (from -r postcommit_requirements.txt (line 2))
  File was already downloaded /tmp/dataflow-requirements-cache/mock-2.0.0.tar.gz
Collecting setuptools (from pyhamcrest->-r postcommit_requirements.txt (line 1))
  File was already downloaded /tmp/dataflow-requirements-cache/setuptools-36.2.4.zip
Collecting six (from pyhamcrest->-r postcommit_requirements.txt (line 1))
  File was already downloaded /tmp/dataflow-requirements-cache/six-1.10.0.tar.gz
Collecting funcsigs>=1 (from mock->-r postcommit_requirements.txt (line 2))
  File was already downloaded /tmp/dataflow-requirements-cache/funcsigs-1.0.2.tar.gz
Collecting pbr>=0.11 (from mock->-r postcommit_requirements.txt (line 2))
  File was already downloaded /tmp/dataflow-requirements-cache/pbr-3.1.1.tar.gz
Successfully downloaded pyhamcrest mock setuptools six funcsigs pbr
test_as_singleton_without_unique_labels (apache_beam.transforms.sideinputs_test.SideInputsTest)
... ok
DEPRECATION: pip install --download has been deprecated and will be removed in the future.
Pip now has a download command that should be used instead.
Collecting pyhamcrest (from -r postcommit_requirements.txt (line 1))
  File was already downloaded /tmp/dataflow-requirements-cache/PyHamcrest-1.9.0.tar.gz
Collecting mock (from -r postcommit_requirements.txt (line 2))
  File was already downloaded /tmp/dataflow-requirements-cache/mock-2.0.0.tar.gz
Collecting setuptools (from pyhamcrest->-r postcommit_requirements.txt (line 1))
  File was already downloaded /tmp/dataflow-requirements-cache/setuptools-36.2.4.zip
Collecting six (from pyhamcrest->-r postcommit_requirements.txt (line 1))
  File was already downloaded /tmp/dataflow-requirements-cache/six-1.10.0.tar.gz
Collecting funcsigs>=1 (from mock->-r postcommit_requirements.txt (line 2))
  File was already downloaded /tmp/dataflow-requirements-cache/funcsigs-1.0.2.tar.gz
Collecting pbr>=0.11 (from mock->-r postcommit_requirements.txt (line 2))
  File was already downloaded /tmp/dataflow-requirements-cache/pbr-3.1.1.tar.gz
Successfully downloaded pyhamcrest mock setuptools six funcsigs pbr
test_empty_singleton_side_input (apache_beam.transforms.sideinputs_test.SideInputsTest) ...
ok
DEPRECATION: pip install --download has been deprecated and will be removed in the future.
Pip now has a download command that should be used instead.
Collecting pyhamcrest (from -r postcommit_requirements.txt (line 1))
<https://builds.apache.org/job/beam_PostCommit_Python_Verify/ws/sdks/python/local/lib/python2.7/site-packages/pip/_vendor/requests/packages/urllib3/util/ssl_.py>:318:
SNIMissingWarning: An HTTPS request has been made, but the SNI (Subject Name Indication) extension
to TLS is not available on this platform. This may cause the server to present an incorrect
TLS certificate, which can cause validation failures. You can upgrade to a newer version of
Python to solve this. For more information, see https://urllib3.readthedocs.io/en/latest/security.html#snimissingwarning.
  SNIMissingWarning
<https://builds.apache.org/job/beam_PostCommit_Python_Verify/ws/sdks/python/local/lib/python2.7/site-packages/pip/_vendor/requests/packages/urllib3/util/ssl_.py>:122:
InsecurePlatformWarning: A true SSLContext object is not available. This prevents urllib3
from configuring SSL appropriately and may cause certain SSL connections to fail. You can
upgrade to a newer version of Python to solve this. For more information, see https://urllib3.readthedocs.io/en/latest/security.html#insecureplatformwarning.
  InsecurePlatformWarning
  File was already downloaded /tmp/dataflow-requirements-cache/PyHamcrest-1.9.0.tar.gz
Collecting mock (from -r postcommit_requirements.txt (line 2))
  File was already downloaded /tmp/dataflow-requirements-cache/mock-2.0.0.tar.gz
Collecting setuptools (from pyhamcrest->-r postcommit_requirements.txt (line 1))
  File was already downloaded /tmp/dataflow-requirements-cache/setuptools-36.2.4.zip
Collecting six (from pyhamcrest->-r postcommit_requirements.txt (line 1))
  File was already downloaded /tmp/dataflow-requirements-cache/six-1.10.0.tar.gz
Collecting funcsigs>=1 (from mock->-r postcommit_requirements.txt (line 2))
  File was already downloaded /tmp/dataflow-requirements-cache/funcsigs-1.0.2.tar.gz
Collecting pbr>=0.11 (from mock->-r postcommit_requirements.txt (line 2))
  File was already downloaded /tmp/dataflow-requirements-cache/pbr-3.1.1.tar.gz
Successfully downloaded pyhamcrest mock setuptools six funcsigs pbr
test_flattened_side_input (apache_beam.transforms.sideinputs_test.SideInputsTest) ... ok
test_iterable_side_input (apache_beam.transforms.sideinputs_test.SideInputsTest) ... ok
test_default_value_singleton_side_input (apache_beam.transforms.sideinputs_test.SideInputsTest)
... ok
test_multi_valued_singleton_side_input (apache_beam.transforms.sideinputs_test.SideInputsTest)
... ok

======================================================================
ERROR: test_par_do_with_multiple_outputs_and_using_return (apache_beam.transforms.ptransform_test.PTransformTest)
----------------------------------------------------------------------
Traceback (most recent call last):
  File "<https://builds.apache.org/job/beam_PostCommit_Python_Verify/ws/sdks/python/apache_beam/transforms/ptransform_test.py",>
line 236, in test_par_do_with_multiple_outputs_and_using_return
    pipeline.run()
  File "<https://builds.apache.org/job/beam_PostCommit_Python_Verify/ws/sdks/python/apache_beam/testing/test_pipeline.py",>
line 96, in run
    result = super(TestPipeline, self).run()
  File "<https://builds.apache.org/job/beam_PostCommit_Python_Verify/ws/sdks/python/apache_beam/pipeline.py",>
line 319, in run
    self.to_runner_api(), self.runner, self._options).run(False)
  File "<https://builds.apache.org/job/beam_PostCommit_Python_Verify/ws/sdks/python/apache_beam/pipeline.py",>
line 328, in run
    return self.runner.run(self)
  File "<https://builds.apache.org/job/beam_PostCommit_Python_Verify/ws/sdks/python/apache_beam/runners/dataflow/test_dataflow_runner.py",>
line 38, in run
    self.result = super(TestDataflowRunner, self).run(pipeline)
  File "<https://builds.apache.org/job/beam_PostCommit_Python_Verify/ws/sdks/python/apache_beam/runners/dataflow/dataflow_runner.py",>
line 272, in run
    self.dataflow_client.create_job(self.job), self)
  File "<https://builds.apache.org/job/beam_PostCommit_Python_Verify/ws/sdks/python/apache_beam/utils/retry.py",>
line 168, in wrapper
    return fun(*args, **kwargs)
  File "<https://builds.apache.org/job/beam_PostCommit_Python_Verify/ws/sdks/python/apache_beam/runners/dataflow/internal/apiclient.py",>
line 438, in create_job
    self.create_job_description(job)
  File "<https://builds.apache.org/job/beam_PostCommit_Python_Verify/ws/sdks/python/apache_beam/runners/dataflow/internal/apiclient.py",>
line 461, in create_job_description
    job.options, file_copy=self._gcs_file_copy)
  File "<https://builds.apache.org/job/beam_PostCommit_Python_Verify/ws/sdks/python/apache_beam/runners/dataflow/internal/dependency.py",>
line 327, in stage_job_resources
    setup_options.requirements_file, requirements_cache_path)
  File "<https://builds.apache.org/job/beam_PostCommit_Python_Verify/ws/sdks/python/apache_beam/runners/dataflow/internal/dependency.py",>
line 261, in _populate_requirements_cache
    processes.check_call(cmd_args)
  File "<https://builds.apache.org/job/beam_PostCommit_Python_Verify/ws/sdks/python/apache_beam/utils/processes.py",>
line 44, in check_call
    return subprocess.check_call(*args, **kwargs)
  File "/usr/lib/python2.7/subprocess.py", line 540, in check_call
    raise CalledProcessError(retcode, cmd)
CalledProcessError: Command '['<https://builds.apache.org/job/beam_PostCommit_Python_Verify/ws/sdks/python/bin/python',>
'-m', 'pip', 'install', '--download', '/tmp/dataflow-requirements-cache', '-r', 'postcommit_requirements.txt',
'--no-binary', ':all:']' returned non-zero exit status 2
-------------------- >> begin captured logging << --------------------
root: DEBUG: PValue computed by Some Numbers/Read (tag None): refcount: 1 => 0
root: DEBUG: PValue computed by ClassifyNumbers/FlatMap(some_fn) (tag None): refcount: 1 =>
0
root: DEBUG: PValue computed by assert_that/WindowInto(WindowIntoFn) (tag None): refcount:
1 => 0
root: DEBUG: PValue computed by assert_that/Create/Read (tag None): refcount: 1 => 0
root: DEBUG: PValue computed by assert_that/ToVoidKey (tag None): refcount: 1 => 0
root: DEBUG: PValue computed by assert_that/Group/pair_with_0 (tag None): refcount: 1 =>
0
root: DEBUG: PValue computed by assert_that/Group/pair_with_1 (tag None): refcount: 1 =>
0
root: DEBUG: PValue computed by assert_that/Group/Flatten (tag None): refcount: 1 => 0
root: DEBUG: PValue computed by assert_that/Group/GroupByKey (tag None): refcount: 1 =>
0
root: DEBUG: PValue computed by assert_that/Group/Map(_merge_tagged_vals_under_key) (tag None):
refcount: 1 => 0
root: DEBUG: PValue computed by assert_that/Unkey (tag None): refcount: 1 => 0
root: DEBUG: PValue computed by ClassifyNumbers/FlatMap(some_fn) (tag odd): refcount: 1 =>
0
root: DEBUG: PValue computed by assert:odd/WindowInto(WindowIntoFn) (tag None): refcount:
1 => 0
root: DEBUG: PValue computed by assert:odd/Create/Read (tag None): refcount: 1 => 0
root: DEBUG: PValue computed by assert:odd/ToVoidKey (tag None): refcount: 1 => 0
root: DEBUG: PValue computed by assert:odd/Group/pair_with_0 (tag None): refcount: 1 =>
0
root: DEBUG: PValue computed by assert:odd/Group/pair_with_1 (tag None): refcount: 1 =>
0
root: DEBUG: PValue computed by assert:odd/Group/Flatten (tag None): refcount: 1 => 0
root: DEBUG: PValue computed by assert:odd/Group/GroupByKey (tag None): refcount: 1 =>
0
root: DEBUG: PValue computed by assert:odd/Group/Map(_merge_tagged_vals_under_key) (tag None):
refcount: 1 => 0
root: DEBUG: PValue computed by assert:odd/Unkey (tag None): refcount: 1 => 0
root: DEBUG: PValue computed by ClassifyNumbers/FlatMap(some_fn) (tag even): refcount: 1 =>
0
root: DEBUG: PValue computed by assert:even/WindowInto(WindowIntoFn) (tag None): refcount:
1 => 0
root: DEBUG: PValue computed by assert:even/Create/Read (tag None): refcount: 1 => 0
root: DEBUG: PValue computed by assert:even/ToVoidKey (tag None): refcount: 1 => 0
root: DEBUG: PValue computed by assert:even/Group/pair_with_0 (tag None): refcount: 1 =>
0
root: DEBUG: PValue computed by assert:even/Group/pair_with_1 (tag None): refcount: 1 =>
0
root: DEBUG: PValue computed by assert:even/Group/Flatten (tag None): refcount: 1 => 0
root: DEBUG: PValue computed by assert:even/Group/GroupByKey (tag None): refcount: 1 =>
0
root: DEBUG: PValue computed by assert:even/Group/Map(_merge_tagged_vals_under_key) (tag None):
refcount: 1 => 0
root: DEBUG: PValue computed by assert:even/Unkey (tag None): refcount: 1 => 0
root: DEBUG: Connecting using Google Application Default Credentials.
root: INFO: Starting GCS upload to gs://temp-storage-for-end-to-end-tests/staging-validatesrunner-test/beamapp-jenkins-0726211510-354687.1501103710.354912/requirements.txt...
oauth2client.transport: INFO: Attempting refresh to obtain initial access_token
root: INFO: Completed GCS upload to gs://temp-storage-for-end-to-end-tests/staging-validatesrunner-test/beamapp-jenkins-0726211510-354687.1501103710.354912/requirements.txt
root: INFO: Executing command: ['<https://builds.apache.org/job/beam_PostCommit_Python_Verify/ws/sdks/python/bin/python',>
'-m', 'pip', 'install', '--download', '/tmp/dataflow-requirements-cache', '-r', 'postcommit_requirements.txt',
'--no-binary', ':all:']
--------------------- >> end captured logging << ---------------------

======================================================================
ERROR: test_par_do_with_multiple_outputs_and_using_yield (apache_beam.transforms.ptransform_test.PTransformTest)
----------------------------------------------------------------------
Traceback (most recent call last):
  File "<https://builds.apache.org/job/beam_PostCommit_Python_Verify/ws/sdks/python/apache_beam/transforms/ptransform_test.py",>
line 220, in test_par_do_with_multiple_outputs_and_using_yield
    pipeline.run()
  File "<https://builds.apache.org/job/beam_PostCommit_Python_Verify/ws/sdks/python/apache_beam/testing/test_pipeline.py",>
line 96, in run
    result = super(TestPipeline, self).run()
  File "<https://builds.apache.org/job/beam_PostCommit_Python_Verify/ws/sdks/python/apache_beam/pipeline.py",>
line 319, in run
    self.to_runner_api(), self.runner, self._options).run(False)
  File "<https://builds.apache.org/job/beam_PostCommit_Python_Verify/ws/sdks/python/apache_beam/pipeline.py",>
line 328, in run
    return self.runner.run(self)
  File "<https://builds.apache.org/job/beam_PostCommit_Python_Verify/ws/sdks/python/apache_beam/runners/dataflow/test_dataflow_runner.py",>
line 38, in run
    self.result = super(TestDataflowRunner, self).run(pipeline)
  File "<https://builds.apache.org/job/beam_PostCommit_Python_Verify/ws/sdks/python/apache_beam/runners/dataflow/dataflow_runner.py",>
line 272, in run
    self.dataflow_client.create_job(self.job), self)
  File "<https://builds.apache.org/job/beam_PostCommit_Python_Verify/ws/sdks/python/apache_beam/utils/retry.py",>
line 168, in wrapper
    return fun(*args, **kwargs)
  File "<https://builds.apache.org/job/beam_PostCommit_Python_Verify/ws/sdks/python/apache_beam/runners/dataflow/internal/apiclient.py",>
line 438, in create_job
    self.create_job_description(job)
  File "<https://builds.apache.org/job/beam_PostCommit_Python_Verify/ws/sdks/python/apache_beam/runners/dataflow/internal/apiclient.py",>
line 461, in create_job_description
    job.options, file_copy=self._gcs_file_copy)
  File "<https://builds.apache.org/job/beam_PostCommit_Python_Verify/ws/sdks/python/apache_beam/runners/dataflow/internal/dependency.py",>
line 327, in stage_job_resources
    setup_options.requirements_file, requirements_cache_path)
  File "<https://builds.apache.org/job/beam_PostCommit_Python_Verify/ws/sdks/python/apache_beam/runners/dataflow/internal/dependency.py",>
line 261, in _populate_requirements_cache
    processes.check_call(cmd_args)
  File "<https://builds.apache.org/job/beam_PostCommit_Python_Verify/ws/sdks/python/apache_beam/utils/processes.py",>
line 44, in check_call
    return subprocess.check_call(*args, **kwargs)
  File "/usr/lib/python2.7/subprocess.py", line 540, in check_call
    raise CalledProcessError(retcode, cmd)
CalledProcessError: Command '['<https://builds.apache.org/job/beam_PostCommit_Python_Verify/ws/sdks/python/bin/python',>
'-m', 'pip', 'install', '--download', '/tmp/dataflow-requirements-cache', '-r', 'postcommit_requirements.txt',
'--no-binary', ':all:']' returned non-zero exit status 2
-------------------- >> begin captured logging << --------------------
root: DEBUG: PValue computed by Some Numbers/Read (tag None): refcount: 1 => 0
root: DEBUG: PValue computed by ClassifyNumbers/ParDo(SomeDoFn) (tag None): refcount: 1 =>
0
root: DEBUG: PValue computed by assert_that/WindowInto(WindowIntoFn) (tag None): refcount:
1 => 0
root: DEBUG: PValue computed by assert_that/Create/Read (tag None): refcount: 1 => 0
root: DEBUG: PValue computed by assert_that/ToVoidKey (tag None): refcount: 1 => 0
root: DEBUG: PValue computed by assert_that/Group/pair_with_0 (tag None): refcount: 1 =>
0
root: DEBUG: PValue computed by assert_that/Group/pair_with_1 (tag None): refcount: 1 =>
0
root: DEBUG: PValue computed by assert_that/Group/Flatten (tag None): refcount: 1 => 0
root: DEBUG: PValue computed by assert_that/Group/GroupByKey (tag None): refcount: 1 =>
0
root: DEBUG: PValue computed by assert_that/Group/Map(_merge_tagged_vals_under_key) (tag None):
refcount: 1 => 0
root: DEBUG: PValue computed by assert_that/Unkey (tag None): refcount: 1 => 0
root: DEBUG: PValue computed by ClassifyNumbers/ParDo(SomeDoFn) (tag odd): refcount: 1 =>
0
root: DEBUG: PValue computed by assert:odd/WindowInto(WindowIntoFn) (tag None): refcount:
1 => 0
root: DEBUG: PValue computed by assert:odd/Create/Read (tag None): refcount: 1 => 0
root: DEBUG: PValue computed by assert:odd/ToVoidKey (tag None): refcount: 1 => 0
root: DEBUG: PValue computed by assert:odd/Group/pair_with_0 (tag None): refcount: 1 =>
0
root: DEBUG: PValue computed by assert:odd/Group/pair_with_1 (tag None): refcount: 1 =>
0
root: DEBUG: PValue computed by assert:odd/Group/Flatten (tag None): refcount: 1 => 0
root: DEBUG: PValue computed by assert:odd/Group/GroupByKey (tag None): refcount: 1 =>
0
root: DEBUG: PValue computed by assert:odd/Group/Map(_merge_tagged_vals_under_key) (tag None):
refcount: 1 => 0
root: DEBUG: PValue computed by assert:odd/Unkey (tag None): refcount: 1 => 0
root: DEBUG: PValue computed by ClassifyNumbers/ParDo(SomeDoFn) (tag even): refcount: 1 =>
0
root: DEBUG: PValue computed by assert:even/WindowInto(WindowIntoFn) (tag None): refcount:
1 => 0
root: DEBUG: PValue computed by assert:even/Create/Read (tag None): refcount: 1 => 0
root: DEBUG: PValue computed by assert:even/ToVoidKey (tag None): refcount: 1 => 0
root: DEBUG: PValue computed by assert:even/Group/pair_with_0 (tag None): refcount: 1 =>
0
root: DEBUG: PValue computed by assert:even/Group/pair_with_1 (tag None): refcount: 1 =>
0
root: DEBUG: PValue computed by assert:even/Group/Flatten (tag None): refcount: 1 => 0
root: DEBUG: PValue computed by assert:even/Group/GroupByKey (tag None): refcount: 1 =>
0
root: DEBUG: PValue computed by assert:even/Group/Map(_merge_tagged_vals_under_key) (tag None):
refcount: 1 => 0
root: DEBUG: PValue computed by assert:even/Unkey (tag None): refcount: 1 => 0
root: DEBUG: Connecting using Google Application Default Credentials.
root: INFO: Starting GCS upload to gs://temp-storage-for-end-to-end-tests/staging-validatesrunner-test/beamapp-jenkins-0726211510-383046.1501103710.383246/requirements.txt...
oauth2client.transport: INFO: Attempting refresh to obtain initial access_token
root: INFO: Completed GCS upload to gs://temp-storage-for-end-to-end-tests/staging-validatesrunner-test/beamapp-jenkins-0726211510-383046.1501103710.383246/requirements.txt
root: INFO: Executing command: ['<https://builds.apache.org/job/beam_PostCommit_Python_Verify/ws/sdks/python/bin/python',>
'-m', 'pip', 'install', '--download', '/tmp/dataflow-requirements-cache', '-r', 'postcommit_requirements.txt',
'--no-binary', ':all:']
--------------------- >> end captured logging << ---------------------

----------------------------------------------------------------------
Ran 15 tests in 1324.443s

FAILED (errors=2)
Found: https://console.cloud.google.com/dataflow/jobsDetail/locations/us-central1/jobs/2017-07-26_14_15_30-12209507452459781415?project=apache-beam-testing
Found: https://console.cloud.google.com/dataflow/jobsDetail/locations/us-central1/jobs/2017-07-26_14_20_34-768316653688620561?project=apache-beam-testing
Found: https://console.cloud.google.com/dataflow/jobsDetail/locations/us-central1/jobs/2017-07-26_14_26_23-7475628260501990158?project=apache-beam-testing
Found: https://console.cloud.google.com/dataflow/jobsDetail/locations/us-central1/jobs/2017-07-26_14_31_32-8491151589855664171?project=apache-beam-testing
Found: https://console.cloud.google.com/dataflow/jobsDetail/locations/us-central1/jobs/2017-07-26_14_15_42-16693350550771445813?project=apache-beam-testing
Found: https://console.cloud.google.com/dataflow/jobsDetail/locations/us-central1/jobs/2017-07-26_14_21_56-1335614021495420801?project=apache-beam-testing
Found: https://console.cloud.google.com/dataflow/jobsDetail/locations/us-central1/jobs/2017-07-26_14_27_34-3696300777918439775?project=apache-beam-testing
Found: https://console.cloud.google.com/dataflow/jobsDetail/locations/us-central1/jobs/2017-07-26_14_15_37-18273955232876906653?project=apache-beam-testing
Found: https://console.cloud.google.com/dataflow/jobsDetail/locations/us-central1/jobs/2017-07-26_14_20_59-16315884215728650345?project=apache-beam-testing
Found: https://console.cloud.google.com/dataflow/jobsDetail/locations/us-central1/jobs/2017-07-26_14_26_15-15593042113350978822?project=apache-beam-testing
Found: https://console.cloud.google.com/dataflow/jobsDetail/locations/us-central1/jobs/2017-07-26_14_15_33-638823764017045293?project=apache-beam-testing
Found: https://console.cloud.google.com/dataflow/jobsDetail/locations/us-central1/jobs/2017-07-26_14_21_13-12736407222899122865?project=apache-beam-testing
Found: https://console.cloud.google.com/dataflow/jobsDetail/locations/us-central1/jobs/2017-07-26_14_26_33-1390602188084649174?project=apache-beam-testing
Build step 'Execute shell' marked build as failure

Mime
View raw message