beam-commits mailing list archives

Site index · List index
Message view « Date » · « Thread »
Top « Date » · « Thread »
From Apache Jenkins Server <jenk...@builds.apache.org>
Subject Build failed in Jenkins: beam_PostCommit_Java_ValidatesRunner_Dataflow #3626
Date Fri, 21 Jul 2017 17:06:56 GMT
See <https://builds.apache.org/job/beam_PostCommit_Java_ValidatesRunner_Dataflow/3626/display/redirect?page=changes>

Changes:

[tgroh] Register a PTransformTranslator for Combine

------------------------------------------
[...truncated 91.02 KB...]
2017-07-21T17:06:15.756 [INFO] Downloaded: https://repo.maven.apache.org/maven2/org/apache/maven/maven-plugin-registry/2.0.8/maven-plugin-registry-2.0.8.pom
(2 KB at 69.7 KB/sec)
2017-07-21T17:06:15.759 [INFO] Downloading: https://repo.maven.apache.org/maven2/org/apache/maven/maven-plugin-api/2.0.8/maven-plugin-api-2.0.8.pom
2017-07-21T17:06:15.787 [INFO] Downloaded: https://repo.maven.apache.org/maven2/org/apache/maven/maven-plugin-api/2.0.8/maven-plugin-api-2.0.8.pom
(2 KB at 52.1 KB/sec)
2017-07-21T17:06:15.790 [INFO] Downloading: https://repo.maven.apache.org/maven2/junit/junit/3.8.2/junit-3.8.2.pom
2017-07-21T17:06:15.818 [INFO] Downloaded: https://repo.maven.apache.org/maven2/junit/junit/3.8.2/junit-3.8.2.pom
(747 B at 26.1 KB/sec)
2017-07-21T17:06:15.820 [INFO] Downloading: https://repo.maven.apache.org/maven2/org/apache/maven/shared/maven-filtering/1.1/maven-filtering-1.1.pom
2017-07-21T17:06:15.847 [INFO] Downloaded: https://repo.maven.apache.org/maven2/org/apache/maven/shared/maven-filtering/1.1/maven-filtering-1.1.pom
(6 KB at 209.4 KB/sec)
2017-07-21T17:06:15.850 [INFO] Downloading: https://repo.maven.apache.org/maven2/org/apache/maven/maven-project/2.0.6/maven-project-2.0.6.pom
2017-07-21T17:06:15.879 [INFO] Downloaded: https://repo.maven.apache.org/maven2/org/apache/maven/maven-project/2.0.6/maven-project-2.0.6.pom
(3 KB at 88.8 KB/sec)
2017-07-21T17:06:15.881 [INFO] Downloading: https://repo.maven.apache.org/maven2/org/apache/maven/maven/2.0.6/maven-2.0.6.pom
2017-07-21T17:06:15.910 [INFO] Downloaded: https://repo.maven.apache.org/maven2/org/apache/maven/maven/2.0.6/maven-2.0.6.pom
(9 KB at 304.7 KB/sec)
2017-07-21T17:06:15.911 [INFO] Downloading: https://repo.maven.apache.org/maven2/org/apache/maven/maven-parent/5/maven-parent-5.pom
2017-07-21T17:06:15.939 [INFO] Downloaded: https://repo.maven.apache.org/maven2/org/apache/maven/maven-parent/5/maven-parent-5.pom
(15 KB at 531.4 KB/sec)
2017-07-21T17:06:15.941 [INFO] Downloading: https://repo.maven.apache.org/maven2/org/apache/apache/3/apache-3.pom
2017-07-21T17:06:15.968 [INFO] Downloaded: https://repo.maven.apache.org/maven2/org/apache/apache/3/apache-3.pom
(4 KB at 124.1 KB/sec)
2017-07-21T17:06:15.971 [INFO] Downloading: https://repo.maven.apache.org/maven2/org/apache/maven/maven-settings/2.0.6/maven-settings-2.0.6.pom
2017-07-21T17:06:15.999 [INFO] Downloaded: https://repo.maven.apache.org/maven2/org/apache/maven/maven-settings/2.0.6/maven-settings-2.0.6.pom
(2 KB at 69.8 KB/sec)
2017-07-21T17:06:16.003 [INFO] Downloading: https://repo.maven.apache.org/maven2/org/apache/maven/maven-model/2.0.6/maven-model-2.0.6.pom
2017-07-21T17:06:16.030 [INFO] Downloaded: https://repo.maven.apache.org/maven2/org/apache/maven/maven-model/2.0.6/maven-model-2.0.6.pom
(3 KB at 110.2 KB/sec)
2017-07-21T17:06:16.033 [INFO] Downloading: https://repo.maven.apache.org/maven2/org/codehaus/plexus/plexus-utils/1.4.1/plexus-utils-1.4.1.pom
2017-07-21T17:06:16.062 [INFO] Downloaded: https://repo.maven.apache.org/maven2/org/codehaus/plexus/plexus-utils/1.4.1/plexus-utils-1.4.1.pom
(2 KB at 64.3 KB/sec)
2017-07-21T17:06:16.065 [INFO] Downloading: https://repo.maven.apache.org/maven2/org/apache/maven/maven-profile/2.0.6/maven-profile-2.0.6.pom
2017-07-21T17:06:16.094 [INFO] Downloaded: https://repo.maven.apache.org/maven2/org/apache/maven/maven-profile/2.0.6/maven-profile-2.0.6.pom
(2 KB at 66.7 KB/sec)
2017-07-21T17:06:16.097 [INFO] Downloading: https://repo.maven.apache.org/maven2/org/apache/maven/maven-artifact-manager/2.0.6/maven-artifact-manager-2.0.6.pom
2017-07-21T17:06:16.125 [INFO] Downloaded: https://repo.maven.apache.org/maven2/org/apache/maven/maven-artifact-manager/2.0.6/maven-artifact-manager-2.0.6.pom
(3 KB at 91.4 KB/sec)
2017-07-21T17:06:16.128 [INFO] Downloading: https://repo.maven.apache.org/maven2/org/apache/maven/maven-repository-metadata/2.0.6/maven-repository-metadata-2.0.6.pom
2017-07-21T17:06:16.155 [INFO] Downloaded: https://repo.maven.apache.org/maven2/org/apache/maven/maven-repository-metadata/2.0.6/maven-repository-metadata-2.0.6.pom
(2 KB at 66.9 KB/sec)
2017-07-21T17:06:16.158 [INFO] Downloading: https://repo.maven.apache.org/maven2/org/apache/maven/maven-artifact/2.0.6/maven-artifact-2.0.6.pom
2017-07-21T17:06:16.188 [INFO] Downloaded: https://repo.maven.apache.org/maven2/org/apache/maven/maven-artifact/2.0.6/maven-artifact-2.0.6.pom
(2 KB at 51.3 KB/sec)
2017-07-21T17:06:16.191 [INFO] Downloading: https://repo.maven.apache.org/maven2/org/apache/maven/maven-plugin-registry/2.0.6/maven-plugin-registry-2.0.6.pom
2017-07-21T17:06:16.220 [INFO] Downloaded: https://repo.maven.apache.org/maven2/org/apache/maven/maven-plugin-registry/2.0.6/maven-plugin-registry-2.0.6.pom
(2 KB at 65.5 KB/sec)
2017-07-21T17:06:16.223 [INFO] Downloading: https://repo.maven.apache.org/maven2/org/apache/maven/maven-core/2.0.6/maven-core-2.0.6.pom
2017-07-21T17:06:16.249 [INFO] Downloaded: https://repo.maven.apache.org/maven2/org/apache/maven/maven-core/2.0.6/maven-core-2.0.6.pom
(7 KB at 252.1 KB/sec)
2017-07-21T17:06:16.252 [INFO] Downloading: https://repo.maven.apache.org/maven2/org/apache/maven/maven-plugin-parameter-documenter/2.0.6/maven-plugin-parameter-documenter-2.0.6.pom
2017-07-21T17:06:16.281 [INFO] Downloaded: https://repo.maven.apache.org/maven2/org/apache/maven/maven-plugin-parameter-documenter/2.0.6/maven-plugin-parameter-documenter-2.0.6.pom
(2 KB at 64.4 KB/sec)
2017-07-21T17:06:16.284 [INFO] Downloading: https://repo.maven.apache.org/maven2/org/apache/maven/reporting/maven-reporting-api/2.0.6/maven-reporting-api-2.0.6.pom
2017-07-21T17:06:16.311 [INFO] Downloaded: https://repo.maven.apache.org/maven2/org/apache/maven/reporting/maven-reporting-api/2.0.6/maven-reporting-api-2.0.6.pom
(2 KB at 63.4 KB/sec)
2017-07-21T17:06:16.313 [INFO] Downloading: https://repo.maven.apache.org/maven2/org/apache/maven/reporting/maven-reporting/2.0.6/maven-reporting-2.0.6.pom
2017-07-21T17:06:16.340 [INFO] Downloaded: https://repo.maven.apache.org/maven2/org/apache/maven/reporting/maven-reporting/2.0.6/maven-reporting-2.0.6.pom
(2 KB at 52.0 KB/sec)
2017-07-21T17:06:16.342 [INFO] Downloading: https://repo.maven.apache.org/maven2/org/apache/maven/doxia/doxia-sink-api/1.0-alpha-7/doxia-sink-api-1.0-alpha-7.pom
2017-07-21T17:06:16.369 [INFO] Downloaded: https://repo.maven.apache.org/maven2/org/apache/maven/doxia/doxia-sink-api/1.0-alpha-7/doxia-sink-api-1.0-alpha-7.pom
(424 B at 15.3 KB/sec)
2017-07-21T17:06:16.371 [INFO] Downloading: https://repo.maven.apache.org/maven2/org/apache/maven/doxia/doxia/1.0-alpha-7/doxia-1.0-alpha-7.pom
2017-07-21T17:06:16.397 [INFO] Downloaded: https://repo.maven.apache.org/maven2/org/apache/maven/doxia/doxia/1.0-alpha-7/doxia-1.0-alpha-7.pom
(4 KB at 147.0 KB/sec)
2017-07-21T17:06:16.400 [INFO] Downloading: https://repo.maven.apache.org/maven2/org/apache/maven/maven-error-diagnostics/2.0.6/maven-error-diagnostics-2.0.6.pom
2017-07-21T17:06:16.426 [INFO] Downloaded: https://repo.maven.apache.org/maven2/org/apache/maven/maven-error-diagnostics/2.0.6/maven-error-diagnostics-2.0.6.pom
(2 KB at 61.6 KB/sec)
2017-07-21T17:06:16.429 [INFO] Downloading: https://repo.maven.apache.org/maven2/commons-cli/commons-cli/1.0/commons-cli-1.0.pom
2017-07-21T17:06:16.455 [INFO] Downloaded: https://repo.maven.apache.org/maven2/commons-cli/commons-cli/1.0/commons-cli-1.0.pom
(3 KB at 76.1 KB/sec)
2017-07-21T17:06:16.457 [INFO] Downloading: https://repo.maven.apache.org/maven2/org/apache/maven/maven-plugin-api/2.0.6/maven-plugin-api-2.0.6.pom
2017-07-21T17:06:16.485 [INFO] Downloaded: https://repo.maven.apache.org/maven2/org/apache/maven/maven-plugin-api/2.0.6/maven-plugin-api-2.0.6.pom
(2 KB at 50.7 KB/sec)
2017-07-21T17:06:16.488 [INFO] Downloading: https://repo.maven.apache.org/maven2/org/apache/maven/maven-plugin-descriptor/2.0.6/maven-plugin-descriptor-2.0.6.pom
2017-07-21T17:06:16.514 [INFO] Downloaded: https://repo.maven.apache.org/maven2/org/apache/maven/maven-plugin-descriptor/2.0.6/maven-plugin-descriptor-2.0.6.pom
(2 KB at 75.8 KB/sec)
2017-07-21T17:06:16.517 [INFO] Downloading: https://repo.maven.apache.org/maven2/org/apache/maven/maven-monitor/2.0.6/maven-monitor-2.0.6.pom
2017-07-21T17:06:16.545 [INFO] Downloaded: https://repo.maven.apache.org/maven2/org/apache/maven/maven-monitor/2.0.6/maven-monitor-2.0.6.pom
(2 KB at 43.7 KB/sec)
2017-07-21T17:06:16.548 [INFO] Downloading: https://repo.maven.apache.org/maven2/org/codehaus/plexus/plexus-interpolation/1.12/plexus-interpolation-1.12.pom
2017-07-21T17:06:16.576 [INFO] Downloaded: https://repo.maven.apache.org/maven2/org/codehaus/plexus/plexus-interpolation/1.12/plexus-interpolation-1.12.pom
(889 B at 31.0 KB/sec)
2017-07-21T17:06:16.580 [INFO] Downloading: https://repo.maven.apache.org/maven2/org/sonatype/plexus/plexus-build-api/0.0.4/plexus-build-api-0.0.4.pom
2017-07-21T17:06:16.610 [INFO] Downloaded: https://repo.maven.apache.org/maven2/org/sonatype/plexus/plexus-build-api/0.0.4/plexus-build-api-0.0.4.pom
(3 KB at 93.2 KB/sec)
2017-07-21T17:06:16.612 [INFO] Downloading: https://repo.maven.apache.org/maven2/org/sonatype/spice/spice-parent/10/spice-parent-10.pom
2017-07-21T17:06:16.639 [INFO] Downloaded: https://repo.maven.apache.org/maven2/org/sonatype/spice/spice-parent/10/spice-parent-10.pom
(3 KB at 109.0 KB/sec)
2017-07-21T17:06:16.641 [INFO] Downloading: https://repo.maven.apache.org/maven2/org/sonatype/forge/forge-parent/3/forge-parent-3.pom
2017-07-21T17:06:16.668 [INFO] Downloaded: https://repo.maven.apache.org/maven2/org/sonatype/forge/forge-parent/3/forge-parent-3.pom
(5 KB at 182.0 KB/sec)
2017-07-21T17:06:16.671 [INFO] Downloading: https://repo.maven.apache.org/maven2/org/codehaus/plexus/plexus-utils/1.5.8/plexus-utils-1.5.8.pom
2017-07-21T17:06:16.700 [INFO] Downloaded: https://repo.maven.apache.org/maven2/org/codehaus/plexus/plexus-utils/1.5.8/plexus-utils-1.5.8.pom
(8 KB at 271.5 KB/sec)
2017-07-21T17:06:16.702 [INFO] Downloading: https://repo.maven.apache.org/maven2/org/codehaus/plexus/plexus-resources/1.0-alpha-7/plexus-resources-1.0-alpha-7.pom
2017-07-21T17:06:16.731 [INFO] Downloaded: https://repo.maven.apache.org/maven2/org/codehaus/plexus/plexus-resources/1.0-alpha-7/plexus-resources-1.0-alpha-7.pom
(2 KB at 45.8 KB/sec)
2017-07-21T17:06:16.734 [INFO] Downloading: https://repo.maven.apache.org/maven2/org/codehaus/plexus/plexus-components/1.1.17/plexus-components-1.1.17.pom
2017-07-21T17:06:16.763 [INFO] Downloaded: https://repo.maven.apache.org/maven2/org/codehaus/plexus/plexus-components/1.1.17/plexus-components-1.1.17.pom
(6 KB at 175.4 KB/sec)
2017-07-21T17:06:16.766 [INFO] Downloading: https://repo.maven.apache.org/maven2/org/codehaus/plexus/plexus/2.0.5/plexus-2.0.5.pom
2017-07-21T17:06:16.796 [INFO] Downloaded: https://repo.maven.apache.org/maven2/org/codehaus/plexus/plexus/2.0.5/plexus-2.0.5.pom
(17 KB at 564.7 KB/sec)
2017-07-21T17:06:16.799 [INFO] Downloading: https://repo.maven.apache.org/maven2/org/apache/velocity/velocity/1.7/velocity-1.7.pom
2017-07-21T17:06:16.827 [INFO] Downloaded: https://repo.maven.apache.org/maven2/org/apache/velocity/velocity/1.7/velocity-1.7.pom
(11 KB at 378.7 KB/sec)
2017-07-21T17:06:16.830 [INFO] Downloading: https://repo.maven.apache.org/maven2/commons-collections/commons-collections/3.2.1/commons-collections-3.2.1.pom
2017-07-21T17:06:16.858 [INFO] Downloaded: https://repo.maven.apache.org/maven2/commons-collections/commons-collections/3.2.1/commons-collections-3.2.1.pom
(13 KB at 436.1 KB/sec)
2017-07-21T17:06:16.860 [INFO] Downloading: https://repo.maven.apache.org/maven2/org/apache/commons/commons-parent/9/commons-parent-9.pom
2017-07-21T17:06:16.887 [INFO] Downloaded: https://repo.maven.apache.org/maven2/org/apache/commons/commons-parent/9/commons-parent-9.pom
(22 KB at 793.2 KB/sec)
2017-07-21T17:06:16.891 [INFO] Downloading: https://repo.maven.apache.org/maven2/commons-lang/commons-lang/2.4/commons-lang-2.4.pom
2017-07-21T17:06:16.917 [INFO] Downloaded: https://repo.maven.apache.org/maven2/commons-lang/commons-lang/2.4/commons-lang-2.4.pom
(14 KB at 524.9 KB/sec)
2017-07-21T17:06:16.925 [INFO] Downloading: https://repo.maven.apache.org/maven2/org/codehaus/plexus/plexus-container-default/1.0-alpha-9-stable-1/plexus-container-default-1.0-alpha-9-stable-1.jar
2017-07-21T17:06:16.925 [INFO] Downloading: https://repo.maven.apache.org/maven2/org/apache/maven/maven-model/2.2.1/maven-model-2.2.1.jar
2017-07-21T17:06:16.925 [INFO] Downloading: https://repo.maven.apache.org/maven2/junit/junit/3.8.1/junit-3.8.1.jar
2017-07-21T17:06:16.926 [INFO] Downloading: https://repo.maven.apache.org/maven2/org/apache/maven/shared/maven-filtering/1.1/maven-filtering-1.1.jar
2017-07-21T17:06:16.927 [INFO] Downloading: https://repo.maven.apache.org/maven2/org/apache/maven/shared/maven-artifact-resolver/1.0/maven-artifact-resolver-1.0.jar
[INFO] I/O exception (java.net.SocketException) caught when processing request to {s}->https://repo.maven.apache.org:443:
Connection reset
[INFO] Retrying request to {s}->https://repo.maven.apache.org:443
[INFO] I/O exception (java.net.SocketException) caught when processing request to {s}->https://repo.maven.apache.org:443:
Connection reset
[INFO] Retrying request to {s}->https://repo.maven.apache.org:443
[INFO] I/O exception (java.net.SocketException) caught when processing request to {s}->https://repo.maven.apache.org:443:
Connection reset
[INFO] Retrying request to {s}->https://repo.maven.apache.org:443
2017-07-21T17:06:16.965 [INFO] Downloading: https://repo.maven.apache.org/maven2/org/sonatype/plexus/plexus-build-api/0.0.4/plexus-build-api-0.0.4.jar
2017-07-21T17:06:16.985 [INFO] Downloaded: https://repo.maven.apache.org/maven2/junit/junit/3.8.1/junit-3.8.1.jar
(119 KB at 1970.5 KB/sec)
2017-07-21T17:06:16.985 [INFO] Downloading: https://repo.maven.apache.org/maven2/org/codehaus/plexus/plexus-resources/1.0-alpha-7/plexus-resources-1.0-alpha-7.jar
2017-07-21T17:06:17.021 [INFO] Downloaded: https://repo.maven.apache.org/maven2/org/codehaus/plexus/plexus-resources/1.0-alpha-7/plexus-resources-1.0-alpha-7.jar
(23 KB at 239.1 KB/sec)
2017-07-21T17:06:17.021 [INFO] Downloading: https://repo.maven.apache.org/maven2/org/codehaus/plexus/plexus-interpolation/1.12/plexus-interpolation-1.12.jar
2017-07-21T17:06:17.030 [INFO] Downloaded: https://repo.maven.apache.org/maven2/org/apache/maven/shared/maven-artifact-resolver/1.0/maven-artifact-resolver-1.0.jar
(14 KB at 126.2 KB/sec)
2017-07-21T17:06:17.030 [INFO] Downloading: https://repo.maven.apache.org/maven2/org/codehaus/plexus/plexus-utils/1.5.15/plexus-utils-1.5.15.jar
2017-07-21T17:06:17.031 [INFO] Downloaded: https://repo.maven.apache.org/maven2/org/apache/maven/shared/maven-filtering/1.1/maven-filtering-1.1.jar
(43 KB at 397.1 KB/sec)
2017-07-21T17:06:17.031 [INFO] Downloading: https://repo.maven.apache.org/maven2/org/apache/velocity/velocity/1.7/velocity-1.7.jar
2017-07-21T17:06:17.047 [INFO] Downloaded: https://repo.maven.apache.org/maven2/org/sonatype/plexus/plexus-build-api/0.0.4/plexus-build-api-0.0.4.jar
(7 KB at 55.0 KB/sec)
2017-07-21T17:06:17.047 [INFO] Downloading: https://repo.maven.apache.org/maven2/commons-collections/commons-collections/3.2.1/commons-collections-3.2.1.jar
2017-07-21T17:06:17.053 [INFO] Downloaded: https://repo.maven.apache.org/maven2/org/codehaus/plexus/plexus-interpolation/1.12/plexus-interpolation-1.12.jar
(60 KB at 468.8 KB/sec)
2017-07-21T17:06:17.053 [INFO] Downloading: https://repo.maven.apache.org/maven2/commons-lang/commons-lang/2.4/commons-lang-2.4.jar
2017-07-21T17:06:17.067 [INFO] Downloaded: https://repo.maven.apache.org/maven2/org/apache/maven/maven-model/2.2.1/maven-model-2.2.1.jar
(86 KB at 602.4 KB/sec)
2017-07-21T17:06:17.103 [INFO] Downloaded: https://repo.maven.apache.org/maven2/org/codehaus/plexus/plexus-utils/1.5.15/plexus-utils-1.5.15.jar
(223 KB at 1258.6 KB/sec)
2017-07-21T17:06:17.109 [INFO] Downloaded: https://repo.maven.apache.org/maven2/commons-lang/commons-lang/2.4/commons-lang-2.4.jar
(256 KB at 1404.8 KB/sec)
2017-07-21T17:06:17.124 [INFO] Downloaded: https://repo.maven.apache.org/maven2/org/apache/velocity/velocity/1.7/velocity-1.7.jar
(439 KB at 2217.0 KB/sec)
2017-07-21T17:06:17.199 [INFO] Downloaded: https://repo.maven.apache.org/maven2/commons-collections/commons-collections/3.2.1/commons-collections-3.2.1.jar
(562 KB at 2058.3 KB/sec)
[WARNING] Failed to getClass for org.apache.maven.plugin.resources.remote.ProcessRemoteResourcesMojo
[JENKINS] Archiving disabled
[JENKINS] Archiving disabled
[JENKINS] Archiving disabled
[JENKINS] Archiving disabled
[JENKINS] Archiving disabled
[JENKINS] Archiving disabled
[JENKINS] Archiving disabled
[JENKINS] Archiving disabled
[JENKINS] Archiving disabled
[JENKINS] Archiving disabled
[JENKINS] Archiving disabled
[JENKINS] Archiving disabled
[JENKINS] Archiving disabled
[JENKINS] Archiving disabled
[JENKINS] Archiving disabled
[JENKINS] Archiving disabled
[JENKINS] Archiving disabled
[JENKINS] Archiving disabled
[JENKINS] Archiving disabled
2017-07-21T17:06:26.004 [INFO] ------------------------------------------------------------------------
2017-07-21T17:06:26.004 [INFO] Reactor Summary:
2017-07-21T17:06:26.004 [INFO] 
2017-07-21T17:06:26.004 [INFO] Apache Beam :: Parent .............................. FAILURE
[ 10.709 s]
2017-07-21T17:06:26.004 [INFO] Apache Beam :: SDKs :: Java :: Build Tools ......... SKIPPED
2017-07-21T17:06:26.004 [INFO] Apache Beam :: SDKs ................................ SKIPPED
2017-07-21T17:06:26.004 [INFO] Apache Beam :: SDKs :: Common ...................... SKIPPED
2017-07-21T17:06:26.004 [INFO] Apache Beam :: SDKs :: Common :: Runner API ........ SKIPPED
2017-07-21T17:06:26.004 [INFO] Apache Beam :: SDKs :: Common :: Fn API ............ SKIPPED
2017-07-21T17:06:26.004 [INFO] Apache Beam :: SDKs :: Java ........................ SKIPPED
2017-07-21T17:06:26.004 [INFO] Apache Beam :: SDKs :: Java :: Core ................ SKIPPED
2017-07-21T17:06:26.004 [INFO] Apache Beam :: Runners ............................. SKIPPED
2017-07-21T17:06:26.005 [INFO] Apache Beam :: Runners :: Core Construction Java ... SKIPPED
2017-07-21T17:06:26.005 [INFO] Apache Beam :: Runners :: Core Java ................ SKIPPED
2017-07-21T17:06:26.005 [INFO] Apache Beam :: Runners :: Direct Java .............. SKIPPED
2017-07-21T17:06:26.005 [INFO] Apache Beam :: SDKs :: Java :: IO .................. SKIPPED
2017-07-21T17:06:26.005 [INFO] Apache Beam :: SDKs :: Java :: Extensions .......... SKIPPED
2017-07-21T17:06:26.005 [INFO] Apache Beam :: SDKs :: Java :: Extensions :: Google Cloud Platform
Core SKIPPED
2017-07-21T17:06:26.005 [INFO] Apache Beam :: SDKs :: Java :: Extensions :: Protobuf SKIPPED
2017-07-21T17:06:26.005 [INFO] Apache Beam :: SDKs :: Java :: IO :: Google Cloud Platform
SKIPPED
2017-07-21T17:06:26.005 [INFO] Apache Beam :: Runners :: Google Cloud Dataflow .... SKIPPED
2017-07-21T17:06:26.005 [INFO] ------------------------------------------------------------------------
2017-07-21T17:06:26.005 [INFO] BUILD FAILURE
2017-07-21T17:06:26.005 [INFO] ------------------------------------------------------------------------
2017-07-21T17:06:26.005 [INFO] Total time: 45.355 s
2017-07-21T17:06:26.005 [INFO] Finished at: 2017-07-21T17:06:26+00:00
2017-07-21T17:06:26.160 [INFO] Final Memory: 46M/536M
2017-07-21T17:06:26.160 [INFO] ------------------------------------------------------------------------
2017-07-21T17:06:26.164 [ERROR] Failed to execute goal org.apache.maven.plugins:maven-remote-resources-plugin:1.5:process
(process-resource-bundles) on project beam-parent: Execution process-resource-bundles of goal
org.apache.maven.plugins:maven-remote-resources-plugin:1.5:process failed: Plugin org.apache.maven.plugins:maven-remote-resources-plugin:1.5
or one of its dependencies could not be resolved: Could not transfer artifact org.codehaus.plexus:plexus-container-default:jar:1.0-alpha-9-stable-1
from/to central (https://repo.maven.apache.org/maven2): GET request of: org/codehaus/plexus/plexus-container-default/1.0-alpha-9-stable-1/plexus-container-default-1.0-alpha-9-stable-1.jar
from central failed: Connection reset -> [Help 1]
org.apache.maven.lifecycle.LifecycleExecutionException: Failed to execute goal org.apache.maven.plugins:maven-remote-resources-plugin:1.5:process
(process-resource-bundles) on project beam-parent: Execution process-resource-bundles of goal
org.apache.maven.plugins:maven-remote-resources-plugin:1.5:process failed: Plugin org.apache.maven.plugins:maven-remote-resources-plugin:1.5
or one of its dependencies could not be resolved: Could not transfer artifact org.codehaus.plexus:plexus-container-default:jar:1.0-alpha-9-stable-1
from/to central (https://repo.maven.apache.org/maven2): GET request of: org/codehaus/plexus/plexus-container-default/1.0-alpha-9-stable-1/plexus-container-default-1.0-alpha-9-stable-1.jar
from central failed
	at org.apache.maven.lifecycle.internal.MojoExecutor.execute(MojoExecutor.java:224)
	at org.apache.maven.lifecycle.internal.MojoExecutor.execute(MojoExecutor.java:153)
	at org.apache.maven.lifecycle.internal.MojoExecutor.execute(MojoExecutor.java:145)
	at org.apache.maven.lifecycle.internal.LifecycleModuleBuilder.buildProject(LifecycleModuleBuilder.java:116)
	at org.apache.maven.lifecycle.internal.LifecycleModuleBuilder.buildProject(LifecycleModuleBuilder.java:80)
	at org.apache.maven.lifecycle.internal.builder.singlethreaded.SingleThreadedBuilder.build(SingleThreadedBuilder.java:51)
	at org.apache.maven.lifecycle.internal.LifecycleStarter.execute(LifecycleStarter.java:128)
	at org.apache.maven.DefaultMaven.doExecute(DefaultMaven.java:307)
	at org.apache.maven.DefaultMaven.doExecute(DefaultMaven.java:193)
	at org.apache.maven.DefaultMaven.execute(DefaultMaven.java:106)
	at org.jvnet.hudson.maven3.launcher.Maven33Launcher.main(Maven33Launcher.java:129)
	at sun.reflect.NativeMethodAccessorImpl.invoke0(Native Method)
	at sun.reflect.NativeMethodAccessorImpl.invoke(NativeMethodAccessorImpl.java:62)
	at sun.reflect.DelegatingMethodAccessorImpl.invoke(DelegatingMethodAccessorImpl.java:43)
	at java.lang.reflect.Method.invoke(Method.java:498)
	at org.codehaus.plexus.classworlds.launcher.Launcher.launchStandard(Launcher.java:330)
	at org.codehaus.plexus.classworlds.launcher.Launcher.launch(Launcher.java:238)
	at jenkins.maven3.agent.Maven33Main.launch(Maven33Main.java:176)
	at sun.reflect.NativeMethodAccessorImpl.invoke0(Native Method)
	at sun.reflect.NativeMethodAccessorImpl.invoke(NativeMethodAccessorImpl.java:62)
	at sun.reflect.DelegatingMethodAccessorImpl.invoke(DelegatingMethodAccessorImpl.java:43)
	at java.lang.reflect.Method.invoke(Method.java:498)
	at hudson.maven.Maven3Builder.call(Maven3Builder.java:139)
	at hudson.maven.Maven3Builder.call(Maven3Builder.java:70)
	at hudson.remoting.UserRequest.perform(UserRequest.java:153)
	at hudson.remoting.UserRequest.perform(UserRequest.java:50)
	at hudson.remoting.Request$2.run(Request.java:336)
	at hudson.remoting.InterceptingExecutorService$1.call(InterceptingExecutorService.java:68)
	at java.util.concurrent.FutureTask.run(FutureTask.java:266)
	at java.util.concurrent.ThreadPoolExecutor.runWorker(ThreadPoolExecutor.java:1142)
	at java.util.concurrent.ThreadPoolExecutor$Worker.run(ThreadPoolExecutor.java:617)
	at java.lang.Thread.run(Thread.java:748)
Caused by: org.apache.maven.plugin.PluginExecutionException: Execution process-resource-bundles
of goal org.apache.maven.plugins:maven-remote-resources-plugin:1.5:process failed: Plugin
org.apache.maven.plugins:maven-remote-resources-plugin:1.5 or one of its dependencies could
not be resolved: Could not transfer artifact org.codehaus.plexus:plexus-container-default:jar:1.0-alpha-9-stable-1
from/to central (https://repo.maven.apache.org/maven2): GET request of: org/codehaus/plexus/plexus-container-default/1.0-alpha-9-stable-1/plexus-container-default-1.0-alpha-9-stable-1.jar
from central failed
	at org.apache.maven.plugin.DefaultBuildPluginManager.executeMojo(DefaultBuildPluginManager.java:106)
	at org.apache.maven.lifecycle.internal.MojoExecutor.execute(MojoExecutor.java:208)
	... 31 more
Caused by: org.apache.maven.plugin.PluginResolutionException: Plugin org.apache.maven.plugins:maven-remote-resources-plugin:1.5
or one of its dependencies could not be resolved: Could not transfer artifact org.codehaus.plexus:plexus-container-default:jar:1.0-alpha-9-stable-1
from/to central (https://repo.maven.apache.org/maven2): GET request of: org/codehaus/plexus/plexus-container-default/1.0-alpha-9-stable-1/plexus-container-default-1.0-alpha-9-stable-1.jar
from central failed
	at org.apache.maven.plugin.internal.DefaultPluginDependenciesResolver.resolveInternal(DefaultPluginDependenciesResolver.java:218)
	at org.apache.maven.plugin.internal.DefaultPluginDependenciesResolver.resolve(DefaultPluginDependenciesResolver.java:149)
	at org.apache.maven.plugin.internal.DefaultMavenPluginManager.createPluginRealm(DefaultMavenPluginManager.java:422)
	at org.apache.maven.plugin.internal.DefaultMavenPluginManager.setupPluginRealm(DefaultMavenPluginManager.java:385)
	at org.apache.maven.plugin.DefaultBuildPluginManager.getPluginRealm(DefaultBuildPluginManager.java:231)
	at org.apache.maven.plugin.DefaultBuildPluginManager.executeMojo(DefaultBuildPluginManager.java:102)
	... 32 more
Caused by: org.eclipse.aether.resolution.ArtifactResolutionException: Could not transfer artifact
org.codehaus.plexus:plexus-container-default:jar:1.0-alpha-9-stable-1 from/to central (https://repo.maven.apache.org/maven2):
GET request of: org/codehaus/plexus/plexus-container-default/1.0-alpha-9-stable-1/plexus-container-default-1.0-alpha-9-stable-1.jar
from central failed
	at org.eclipse.aether.internal.impl.DefaultArtifactResolver.resolve(DefaultArtifactResolver.java:444)
	at org.eclipse.aether.internal.impl.DefaultArtifactResolver.resolveArtifacts(DefaultArtifactResolver.java:246)
	at org.eclipse.aether.internal.impl.DefaultRepositorySystem.resolveDependencies(DefaultRepositorySystem.java:367)
	at org.apache.maven.plugin.internal.DefaultPluginDependenciesResolver.resolveInternal(DefaultPluginDependenciesResolver.java:210)
	... 37 more
Caused by: org.eclipse.aether.transfer.ArtifactTransferException: Could not transfer artifact
org.codehaus.plexus:plexus-container-default:jar:1.0-alpha-9-stable-1 from/to central (https://repo.maven.apache.org/maven2):
GET request of: org/codehaus/plexus/plexus-container-default/1.0-alpha-9-stable-1/plexus-container-default-1.0-alpha-9-stable-1.jar
from central failed
	at org.eclipse.aether.connector.basic.ArtifactTransportListener.transferFailed(ArtifactTransportListener.java:43)
	at org.eclipse.aether.connector.basic.BasicRepositoryConnector$TaskRunner.run(BasicRepositoryConnector.java:355)
	at org.eclipse.aether.util.concurrency.RunnableErrorForwarder$1.run(RunnableErrorForwarder.java:67)
	... 3 more
Caused by: org.apache.maven.wagon.TransferFailedException: GET request of: org/codehaus/plexus/plexus-container-default/1.0-alpha-9-stable-1/plexus-container-default-1.0-alpha-9-stable-1.jar
from central failed
	at org.apache.maven.wagon.AbstractWagon.getTransfer(AbstractWagon.java:363)
	at org.apache.maven.wagon.AbstractWagon.getTransfer(AbstractWagon.java:316)
	at org.apache.maven.wagon.AbstractWagon.getTransfer(AbstractWagon.java:285)
	at org.apache.maven.wagon.StreamWagon.getIfNewer(StreamWagon.java:97)
	at org.apache.maven.wagon.StreamWagon.get(StreamWagon.java:61)
	at org.eclipse.aether.transport.wagon.WagonTransporter$GetTaskRunner.run(WagonTransporter.java:560)
	at org.eclipse.aether.transport.wagon.WagonTransporter.execute(WagonTransporter.java:427)
	at org.eclipse.aether.transport.wagon.WagonTransporter.get(WagonTransporter.java:404)
	at org.eclipse.aether.connector.basic.BasicRepositoryConnector$GetTaskRunner.runTask(BasicRepositoryConnector.java:447)
	at org.eclipse.aether.connector.basic.BasicRepositoryConnector$TaskRunner.run(BasicRepositoryConnector.java:350)
	... 4 more
Caused by: java.net.SocketException: Connection reset
	at java.net.SocketInputStream.read(SocketInputStream.java:210)
	at java.net.SocketInputStream.read(SocketInputStream.java:141)
	at sun.security.ssl.InputRecord.readFully(InputRecord.java:465)
	at sun.security.ssl.InputRecord.readV3Record(InputRecord.java:593)
	at sun.security.ssl.InputRecord.read(InputRecord.java:532)
	at sun.security.ssl.SSLSocketImpl.readRecord(SSLSocketImpl.java:973)
	at sun.security.ssl.SSLSocketImpl.readDataRecord(SSLSocketImpl.java:930)
	at sun.security.ssl.AppInputStream.read(AppInputStream.java:105)
	at org.apache.maven.wagon.providers.http.httpclient.impl.io.SessionInputBufferImpl.streamRead(SessionInputBufferImpl.java:136)
	at org.apache.maven.wagon.providers.http.httpclient.impl.io.SessionInputBufferImpl.read(SessionInputBufferImpl.java:195)
	at org.apache.maven.wagon.providers.http.httpclient.impl.io.ContentLengthInputStream.read(ContentLengthInputStream.java:178)
	at org.apache.maven.wagon.providers.http.httpclient.conn.EofSensorInputStream.read(EofSensorInputStream.java:137)
	at org.apache.maven.wagon.AbstractWagon.transfer(AbstractWagon.java:531)
	at org.apache.maven.wagon.AbstractWagon.getTransfer(AbstractWagon.java:353)
	... 13 more
2017-07-21T17:06:26.165 [ERROR] 
2017-07-21T17:06:26.165 [ERROR] Re-run Maven using the -X switch to enable full debug logging.
2017-07-21T17:06:26.165 [ERROR] 
2017-07-21T17:06:26.165 [ERROR] For more information about the errors and possible solutions,
please read the following articles:
2017-07-21T17:06:26.165 [ERROR] [Help 1] http://cwiki.apache.org/confluence/display/MAVEN/PluginResolutionException
channel stopped
Not sending mail to unregistered user sourabhbajaj@google.com
Not sending mail to unregistered user kirpichov@google.com
Not sending mail to unregistered user fipsy@google.com
Not sending mail to unregistered user klk@google.com

Mime
View raw message