beam-commits mailing list archives

Site index · List index
Message view « Date » · « Thread »
Top « Date » · « Thread »
From Apache Jenkins Server <jenk...@builds.apache.org>
Subject Build failed in Jenkins: beam_PostCommit_Java_MavenInstall #4395
Date Tue, 18 Jul 2017 07:53:23 GMT
See <https://builds.apache.org/job/beam_PostCommit_Java_MavenInstall/4395/display/redirect>

------------------------------------------
[...truncated 2.79 MB...]
[JENKINS] Archiving disabled
[JENKINS] Archiving disabled
[JENKINS] Archiving disabled
[JENKINS] Archiving disabled
[JENKINS] Archiving disabled
[JENKINS] Archiving disabled
[JENKINS] Archiving disabled
[JENKINS] Archiving disabled
[JENKINS] Archiving disabled
[JENKINS] Archiving disabled
[JENKINS] Archiving disabled
[JENKINS] Archiving disabled
[JENKINS] Archiving disabled
[JENKINS] Archiving disabled
[JENKINS] Archiving disabled
[JENKINS] Archiving disabled
[JENKINS] Archiving disabled
[JENKINS] Archiving disabled
[JENKINS] Archiving disabled
[JENKINS] Archiving disabled
[JENKINS] Archiving disabled
[JENKINS] Archiving disabled
[JENKINS] Archiving disabled
[JENKINS] Archiving disabled
[JENKINS] Archiving disabled
[JENKINS] Archiving disabled
[JENKINS] Archiving disabled
[JENKINS] Archiving disabled
[JENKINS] Archiving disabled
[JENKINS] Archiving disabled
[JENKINS] Archiving disabled
[JENKINS] Archiving disabled
[JENKINS] Archiving disabled
[JENKINS] Archiving disabled
[JENKINS] Archiving disabled
[JENKINS] Archiving disabled
[JENKINS] Archiving disabled
[JENKINS] Archiving disabled
[JENKINS] Archiving disabled
[JENKINS] Archiving disabled
[JENKINS] Archiving disabled2017-07-18T07:53:14.114 [INFO] ------------------------------------------------------------------------
2017-07-18T07:53:14.114 [INFO] Reactor Summary:
2017-07-18T07:53:14.114 [INFO] 

2017-07-18T07:53:14.114 [INFO] Apache Beam :: Parent .............................. SUCCESS
[ 27.967 s]
2017-07-18T07:53:14.114 [INFO] Apache Beam :: SDKs :: Java :: Build Tools ......... SUCCESS
[ 16.870 s]
2017-07-18T07:53:14.114 [INFO] Apache Beam :: SDKs ................................ SUCCESS
[  5.514 s]
2017-07-18T07:53:14.114 [INFO] Apache Beam :: SDKs :: Common ...................... SUCCESS
[  2.790 s]
2017-07-18T07:53:14.114 [INFO] Apache Beam :: SDKs :: Common :: Runner API ........ SUCCESS
[ 24.366 s]
2017-07-18T07:53:14.114 [INFO] Apache Beam :: SDKs :: Common :: Fn API ............ SUCCESS
[ 19.173 s]
2017-07-18T07:53:14.114 [INFO] Apache Beam :: SDKs :: Java ........................ SUCCESS
[  3.076 s]
2017-07-18T07:53:14.115 [INFO] Apache Beam :: SDKs :: Java :: Core ................ SUCCESS
[03:31 min]
2017-07-18T07:53:14.115 [INFO] Apache Beam :: Runners ............................. SUCCESS
[  3.216 s]
2017-07-18T07:53:14.115 [INFO] Apache Beam :: Runners :: Core Construction Java ... SUCCESS
[ 41.030 s]
2017-07-18T07:53:14.115 [INFO] Apache Beam :: Runners :: Core Java ................ SUCCESS
[01:02 min]
2017-07-18T07:53:14.115 [INFO] Apache Beam :: Runners :: Direct Java .............. SUCCESS
[04:14 min]
2017-07-18T07:53:14.115 [INFO] Apache Beam :: SDKs :: Java :: IO .................. SUCCESS
[  2.813 s]
2017-07-18T07:53:14.115 [INFO] Apache Beam :: SDKs :: Java :: IO :: AMQP .......... SUCCESS
[ 33.043 s]
2017-07-18T07:53:14.115 [INFO] Apache Beam :: SDKs :: Java :: IO :: Common ........ SUCCESS
[  6.532 s]
2017-07-18T07:53:14.115 [INFO] Apache Beam :: SDKs :: Java :: IO :: Cassandra ..... SUCCESS
[ 34.262 s]
2017-07-18T07:53:14.115 [INFO] Apache Beam :: SDKs :: Java :: IO :: Elasticsearch . SUCCESS
[ 38.896 s]
2017-07-18T07:53:14.115 [INFO] Apache Beam :: SDKs :: Java :: Extensions .......... SUCCESS
[  2.736 s]
2017-07-18T07:53:14.115 [INFO] Apache Beam :: SDKs :: Java :: Extensions :: Google Cloud Platform
Core SUCCESS [ 31.500 s]
2017-07-18T07:53:14.115 [INFO] Apache Beam :: SDKs :: Java :: Extensions :: Protobuf SUCCESS
[ 22.218 s]
2017-07-18T07:53:14.115 [INFO] Apache Beam :: SDKs :: Java :: IO :: Google Cloud Platform
SUCCESS [01:43 min]
2017-07-18T07:53:14.115 [INFO] Apache Beam :: SDKs :: Java :: IO :: Hadoop Common . SUCCESS
[ 24.618 s]
2017-07-18T07:53:14.115 [INFO] Apache Beam :: SDKs :: Java :: IO :: Hadoop File System SUCCESS
[ 49.949 s]
2017-07-18T07:53:14.115 [INFO] Apache Beam :: SDKs :: Java :: IO :: Hadoop ........ SUCCESS
[  6.506 s]
2017-07-18T07:53:14.115 [INFO] Apache Beam :: SDKs :: Java :: IO :: Hadoop :: input-format
SUCCESS [ 26.051 s]
2017-07-18T07:53:14.115 [INFO] Apache Beam :: Runners :: Google Cloud Dataflow .... SUCCESS
[08:01 min]
2017-07-18T07:53:14.115 [INFO] Apache Beam :: SDKs :: Java :: IO :: Hadoop :: jdk1.8-tests
SUCCESS [01:34 min]
2017-07-18T07:53:14.115 [INFO] Apache Beam :: SDKs :: Java :: IO :: HBase ......... SUCCESS
[01:08 min]
2017-07-18T07:53:14.115 [INFO] Apache Beam :: SDKs :: Java :: IO :: HCatalog ...... SUCCESS
[01:07 min]
2017-07-18T07:53:14.115 [INFO] Apache Beam :: SDKs :: Java :: IO :: JDBC .......... SUCCESS
[ 39.291 s]
2017-07-18T07:53:14.115 [INFO] Apache Beam :: SDKs :: Java :: IO :: JMS ........... SUCCESS
[ 24.753 s]
2017-07-18T07:53:14.115 [INFO] Apache Beam :: SDKs :: Java :: IO :: Kafka ......... SUCCESS
[ 29.931 s]
2017-07-18T07:53:14.115 [INFO] Apache Beam :: SDKs :: Java :: IO :: Kinesis ....... SUCCESS
[ 29.236 s]
2017-07-18T07:53:14.115 [INFO] Apache Beam :: SDKs :: Java :: IO :: MongoDB ....... SUCCESS
[ 44.156 s]
2017-07-18T07:53:14.115 [INFO] Apache Beam :: SDKs :: Java :: IO :: MQTT .......... SUCCESS
[ 23.940 s]
2017-07-18T07:53:14.115 [INFO] Apache Beam :: SDKs :: Java :: IO :: XML ........... SUCCESS
[ 31.925 s]
2017-07-18T07:53:14.115 [INFO] Apache Beam :: SDKs :: Java :: Maven Archetypes .... SUCCESS
[  2.356 s]
2017-07-18T07:53:14.115 [INFO] Apache Beam :: SDKs :: Java :: Maven Archetypes :: Starter
SUCCESS [ 15.092 s]
2017-07-18T07:53:14.115 [INFO] Apache Beam :: Examples ............................ SUCCESS
[  2.751 s]
2017-07-18T07:53:14.115 [INFO] Apache Beam :: Examples :: Java .................... SUCCESS
[06:32 min]
2017-07-18T07:53:14.115 [INFO] Apache Beam :: SDKs :: Java :: Maven Archetypes :: Examples
SUCCESS [ 42.526 s]
2017-07-18T07:53:14.115 [INFO] Apache Beam :: Examples :: Java 8 .................. SUCCESS
[ 26.833 s]
2017-07-18T07:53:14.115 [INFO] Apache Beam :: SDKs :: Java :: Maven Archetypes :: Examples
- Java 8 SUCCESS [ 33.249 s]
2017-07-18T07:53:14.115 [INFO] Apache Beam :: SDKs :: Java :: Extensions :: Jackson SUCCESS
[ 17.870 s]
2017-07-18T07:53:14.115 [INFO] Apache Beam :: SDKs :: Java :: Extensions :: Join library SUCCESS
[ 20.645 s]
2017-07-18T07:53:14.115 [INFO] Apache Beam :: SDKs :: Java :: Extensions :: Sorter  SUCCESS
[ 33.031 s]
2017-07-18T07:53:14.115 [INFO] Apache Beam :: SDKs :: Java :: Harness ............. SUCCESS
[ 40.777 s]
2017-07-18T07:53:14.115 [INFO] Apache Beam :: SDKs :: Java :: Java 8 Tests ........ SUCCESS
[ 15.662 s]
2017-07-18T07:53:14.115 [INFO] Apache Beam :: SDKs :: Python ...................... FAILURE
[06:06 min]
2017-07-18T07:53:14.115 [INFO] Apache Beam :: Runners :: Flink .................... SKIPPED
2017-07-18T07:53:14.115 [INFO] Apache Beam :: Runners :: Spark .................... SKIPPED
2017-07-18T07:53:14.115 [INFO] Apache Beam :: Runners :: Apex ..................... SKIPPED
2017-07-18T07:53:14.115 [INFO] Apache Beam :: SDKs :: Java :: Aggregated Javadoc .. SKIPPED
2017-07-18T07:53:14.115 [INFO] ------------------------------------------------------------------------
2017-07-18T07:53:14.115 [INFO] BUILD FAILURE
2017-07-18T07:53:14.115 [INFO] ------------------------------------------------------------------------
2017-07-18T07:53:14.115 [INFO] Total time: 51:54 min
2017-07-18T07:53:14.115 [INFO] Finished at: 2017-07-18T07:53:14+00:00
2017-07-18T07:53:14.891 [INFO] Final Memory: 310M/1977M
2017-07-18T07:53:14.892 [INFO] ------------------------------------------------------------------------
ERROR: Asynchronous execution failure
2017-07-18T07:53:17.116 [ERROR] Failed to execute goal org.codehaus.mojo:exec-maven-plugin:1.5.0:exec
(setup-test-tox) on project beam-sdks-python: Command execution failed. Process exited with
an error: 2 (Exit value: 2) -> [Help 1]
org.apache.maven.lifecycle.LifecycleExecutionException: Failed to execute goal org.codehaus.mojo:exec-maven-plugin:1.5.0:exec
(setup-test-tox) on project beam-sdks-python: Command execution failed.
	at org.apache.maven.lifecycle.internal.MojoExecutor.execute(MojoExecutor.java:216)
	at org.apache.maven.lifecycle.internal.MojoExecutor.execute(MojoExecutor.java:153)
	at org.apache.maven.lifecycle.internal.MojoExecutor.execute(MojoExecutor.java:145)
	at org.apache.maven.lifecycle.internal.LifecycleModuleBuilder.buildProject(LifecycleModuleBuilder.java:116)
	at org.apache.maven.lifecycle.internal.LifecycleModuleBuilder.buildProject(LifecycleModuleBuilder.java:80)
	at org.apache.maven.lifecycle.internal.builder.singlethreaded.SingleThreadedBuilder.build(SingleThreadedBuilder.java:51)
	at org.apache.maven.lifecycle.internal.LifecycleStarter.execute(LifecycleStarter.java:128)
	at org.apache.maven.DefaultMaven.doExecute(DefaultMaven.java:307)
	at org.apache.maven.DefaultMaven.doExecute(DefaultMaven.java:193)
	at org.apache.maven.DefaultMaven.execute(DefaultMaven.java:106)
	at org.jvnet.hudson.maven3.launcher.Maven33Launcher.main(Maven33Launcher.java:129)
	at sun.reflect.NativeMethodAccessorImpl.invoke0(Native Method)
	at sun.reflect.NativeMethodAccessorImpl.invoke(NativeMethodAccessorImpl.java:62)
	at sun.reflect.DelegatingMethodAccessorImpl.invoke(DelegatingMethodAccessorImpl.java:43)
	at java.lang.reflect.Method.invoke(Method.java:498)
	at org.codehaus.plexus.classworlds.launcher.Launcher.launchStandard(Launcher.java:330)
	at org.codehaus.plexus.classworlds.launcher.Launcher.launch(Launcher.java:238)
	at jenkins.maven3.agent.Maven33Main.launch(Maven33Main.java:176)
	at sun.reflect.NativeMethodAccessorImpl.invoke0(Native Method)
	at sun.reflect.NativeMethodAccessorImpl.invoke(NativeMethodAccessorImpl.java:62)
	at sun.reflect.DelegatingMethodAccessorImpl.invoke(DelegatingMethodAccessorImpl.java:43)
	at java.lang.reflect.Method.invoke(Method.java:498)
	at hudson.maven.Maven3Builder.call(Maven3Builder.java:139)
	at hudson.maven.Maven3Builder.call(Maven3Builder.java:70)
	at hudson.remoting.UserRequest.perform(UserRequest.java:153)
	at hudson.remoting.UserRequest.perform(UserRequest.java:50)
	at hudson.remoting.Request$2.run(Request.java:336)
	at hudson.remoting.InterceptingExecutorService$1.call(InterceptingExecutorService.java:68)
	at java.util.concurrent.FutureTask.run(FutureTask.java:266)
	at java.util.concurrent.ThreadPoolExecutor.runWorker(ThreadPoolExecutor.java:1142)
	at java.util.concurrent.ThreadPoolExecutor$Worker.run(ThreadPoolExecutor.java:617)
	at java.lang.Thread.run(Thread.java:748)
Caused by: org.apache.maven.plugin.MojoExecutionException: Command execution failed.
	at org.codehaus.mojo.exec.ExecMojo.execute(ExecMojo.java:302)
	at org.apache.maven.plugin.DefaultBuildPluginManager.executeMojo(DefaultBuildPluginManager.java:134)
	at org.apache.maven.lifecycle.internal.MojoExecutor.execute(MojoExecutor.java:208)
	... 31 more
Caused by: org.apache.commons.exec.ExecuteException: Process exited with an error: 2 (Exit
value: 2)
	at org.apache.commons.exec.DefaultExecutor.executeInternal(DefaultExecutor.java:404)
	at org.apache.commons.exec.DefaultExecutor.execute(DefaultExecutor.java:166)
	at org.codehaus.mojo.exec.ExecMojo.executeCommandLine(ExecMojo.java:764)
	at org.codehaus.mojo.exec.ExecMojo.executeCommandLine(ExecMojo.java:711)
	at org.codehaus.mojo.exec.ExecMojo.execute(ExecMojo.java:289)
	... 33 more
2017-07-18T07:53:17.117 [ERROR] 
2017-07-18T07:53:17.117 [ERROR] Re-run Maven using the -X switch to enable full debug logging.
2017-07-18T07:53:17.117 [ERROR] 
2017-07-18T07:53:17.117 [ERROR] For more information about the errors and possible solutions,
please read the following articles:
2017-07-18T07:53:17.117 [ERROR] [Help 1] http://cwiki.apache.org/confluence/display/MAVEN/MojoExecutionException
2017-07-18T07:53:17.118 [ERROR] 
2017-07-18T07:53:17.118 [ERROR] After correcting the problems, you can resume the build with
the command
2017-07-18T07:53:17.118 [ERROR]   mvn <goals> -rf :beam-sdks-python
java.util.concurrent.ExecutionException: java.io.IOException: Failed to create a temporary
file in /x1/jenkins/jenkins-home/fingerprints/97/b9
	at hudson.remoting.Channel$2.adapt(Channel.java:862)
	at hudson.remoting.Channel$2.adapt(Channel.java:857)
	at hudson.remoting.FutureAdapter.get(FutureAdapter.java:55)
	at hudson.maven.AbstractMavenBuilder.waitForAsynchronousExecutions(AbstractMavenBuilder.java:186)
	at hudson.maven.Maven3Builder.call(Maven3Builder.java:146)
	at hudson.maven.Maven3Builder.call(Maven3Builder.java:70)
	at hudson.remoting.UserRequest.perform(UserRequest.java:153)
	at hudson.remoting.UserRequest.perform(UserRequest.java:50)
	at hudson.remoting.Request$2.run(Request.java:336)
	at hudson.remoting.InterceptingExecutorService$1.call(InterceptingExecutorService.java:68)
	at java.util.concurrent.FutureTask.run(FutureTask.java:266)
	at java.util.concurrent.ThreadPoolExecutor.runWorker(ThreadPoolExecutor.java:1142)
	at java.util.concurrent.ThreadPoolExecutor$Worker.run(ThreadPoolExecutor.java:617)
	at java.lang.Thread.run(Thread.java:748)
Caused by: java.io.IOException: Failed to create a temporary file in /x1/jenkins/jenkins-home/fingerprints/97/b9
	at hudson.util.AtomicFileWriter.<init>(AtomicFileWriter.java:70)
	at hudson.util.AtomicFileWriter.<init>(AtomicFileWriter.java:57)
	at hudson.model.Fingerprint.save(Fingerprint.java:1256)
	at hudson.model.Fingerprint.save(Fingerprint.java:1245)
	at hudson.model.Fingerprint.<init>(Fingerprint.java:882)
	at hudson.model.FingerprintMap.create(FingerprintMap.java:93)
	at hudson.model.FingerprintMap.create(FingerprintMap.java:47)
	at hudson.util.KeyedDataStorage.get(KeyedDataStorage.java:163)
	at hudson.model.FingerprintMap.get(FingerprintMap.java:82)
	at hudson.model.FingerprintMap.get(FingerprintMap.java:47)
	at hudson.util.KeyedDataStorage.getOrCreate(KeyedDataStorage.java:111)
	at hudson.model.FingerprintMap.getOrCreate(FingerprintMap.java:68)
	at hudson.maven.reporters.MavenFingerprinter$1.call(MavenFingerprinter.java:123)
	at hudson.maven.reporters.MavenFingerprinter$1.call(MavenFingerprinter.java:112)
	at hudson.maven.MavenBuild$ProxyImpl.execute(MavenBuild.java:426)
	at hudson.maven.MavenBuild$ProxyImpl2.execute(MavenBuild.java:558)
	at sun.reflect.GeneratedMethodAccessor1163.invoke(Unknown Source)
	at sun.reflect.DelegatingMethodAccessorImpl.invoke(DelegatingMethodAccessorImpl.java:43)
	at java.lang.reflect.Method.invoke(Method.java:498)
	at hudson.model.Executor$2.call(Executor.java:914)
	at hudson.util.InterceptingProxy$1.invoke(InterceptingProxy.java:23)
	at com.sun.proxy.$Proxy147.execute(Unknown Source)
	at hudson.maven.MavenBuildProxy$Filter$AsyncInvoker.call(MavenBuildProxy.java:294)
	at hudson.remoting.UserRequest.perform(UserRequest.java:153)
	at hudson.remoting.UserRequest.perform(UserRequest.java:50)
	at hudson.remoting.Request$2.run(Request.java:336)
	at hudson.remoting.InterceptingExecutorService$1.call(InterceptingExecutorService.java:68)
	at org.jenkinsci.remoting.CallableDecorator.call(CallableDecorator.java:19)
	at hudson.remoting.CallableDecoratorList$1.call(CallableDecoratorList.java:21)
	at jenkins.util.ContextResettingExecutorService$2.call(ContextResettingExecutorService.java:46)
	at java.util.concurrent.FutureTask.run(FutureTask.java:266)
	at java.util.concurrent.ThreadPoolExecutor.runWorker(ThreadPoolExecutor.java:1142)
	at java.util.concurrent.ThreadPoolExecutor$Worker.run(ThreadPoolExecutor.java:617)
	at java.lang.Thread.run(Thread.java:748)
	at ......remote call to channel(Native Method)
	at hudson.remoting.Channel.attachCallSiteStackTrace(Channel.java:1545)
	at hudson.remoting.UserResponse.retrieve(UserRequest.java:253)
	at hudson.remoting.Channel$2.adapt(Channel.java:860)
	... 13 more
Caused by: java.io.IOException: Too many open files
	at java.io.UnixFileSystem.createFileExclusively(Native Method)
	at java.io.File.createTempFile(File.java:2024)
	at hudson.util.AtomicFileWriter.<init>(AtomicFileWriter.java:68)
	at hudson.util.AtomicFileWriter.<init>(AtomicFileWriter.java:57)
	at hudson.model.Fingerprint.save(Fingerprint.java:1256)
	at hudson.model.Fingerprint.save(Fingerprint.java:1245)
	at hudson.model.Fingerprint.<init>(Fingerprint.java:882)
	at hudson.model.FingerprintMap.create(FingerprintMap.java:93)
	at hudson.model.FingerprintMap.create(FingerprintMap.java:47)
	at hudson.util.KeyedDataStorage.get(KeyedDataStorage.java:163)
	at hudson.model.FingerprintMap.get(FingerprintMap.java:82)
	at hudson.model.FingerprintMap.get(FingerprintMap.java:47)
	at hudson.util.KeyedDataStorage.getOrCreate(KeyedDataStorage.java:111)
	at hudson.model.FingerprintMap.getOrCreate(FingerprintMap.java:68)
	at hudson.maven.reporters.MavenFingerprinter$1.call(MavenFingerprinter.java:123)
	at hudson.maven.reporters.MavenFingerprinter$1.call(MavenFingerprinter.java:112)
	at hudson.maven.MavenBuild$ProxyImpl.execute(MavenBuild.java:426)
	at hudson.maven.MavenBuild$ProxyImpl2.execute(MavenBuild.java:558)
	at sun.reflect.GeneratedMethodAccessor1163.invoke(Unknown Source)
	at sun.reflect.DelegatingMethodAccessorImpl.invoke(DelegatingMethodAccessorImpl.java:43)
	at java.lang.reflect.Method.invoke(Method.java:498)
	at hudson.model.Executor$2.call(Executor.java:914)
	at hudson.util.InterceptingProxy$1.invoke(InterceptingProxy.java:23)
	at com.sun.proxy.$Proxy147.execute(Unknown Source)
	at hudson.maven.MavenBuildProxy$Filter$AsyncInvoker.call(MavenBuildProxy.java:294)
	at hudson.remoting.UserRequest.perform(UserRequest.java:153)
	at hudson.remoting.UserRequest.perform(UserRequest.java:50)
	at hudson.remoting.Request$2.run(Request.java:336)
	at hudson.remoting.InterceptingExecutorService$1.call(InterceptingExecutorService.java:68)
	at org.jenkinsci.remoting.CallableDecorator.call(CallableDecorator.java:19)
	at hudson.remoting.CallableDecoratorList$1.call(CallableDecoratorList.java:21)
	at jenkins.util.ContextResettingExecutorService$2.call(ContextResettingExecutorService.java:46)
	... 4 more
channel stopped

Mime
View raw message