beam-commits mailing list archives

Site index · List index
Message view « Date » · « Thread »
Top « Date » · « Thread »
From Apache Jenkins Server <jenk...@builds.apache.org>
Subject Build failed in Jenkins: beam_PostCommit_Java_MavenInstall #4281
Date Sun, 02 Jul 2017 06:29:27 GMT
See <https://builds.apache.org/job/beam_PostCommit_Java_MavenInstall/4281/display/redirect>

------------------------------------------
[...truncated 1.22 MB...]
2017-07-02T06:28:54.151 [INFO] Downloading: https://repo.maven.apache.org/maven2/org/apache/hive/hive-service-rpc/2.1.0/hive-service-rpc-2.1.0.jar
2017-07-02T06:28:54.404 [INFO] Downloaded: https://repo.maven.apache.org/maven2/org/apache/hive/hive-serde/2.1.0/hive-serde-2.1.0.jar
(895 KB at 323.8 KB/sec)
2017-07-02T06:28:54.404 [INFO] Downloading: https://repo.maven.apache.org/maven2/org/apache/parquet/parquet-hadoop-bundle/1.8.1/parquet-hadoop-bundle-1.8.1.jar
2017-07-02T06:28:54.435 [INFO] Downloaded: https://repo.maven.apache.org/maven2/org/apache/hive/hive-service-rpc/2.1.0/hive-service-rpc-2.1.0.jar
(1503 KB at 538.1 KB/sec)
2017-07-02T06:28:54.436 [INFO] Downloading: https://repo.maven.apache.org/maven2/org/apache/hive/hive-service/2.1.0/hive-service-2.1.0.jar
2017-07-02T06:28:54.616 [INFO] Downloaded: https://repo.maven.apache.org/maven2/org/apache/hive/hive-service/2.1.0/hive-service-2.1.0.jar
(472 KB at 158.8 KB/sec)
2017-07-02T06:28:54.616 [INFO] Downloading: https://repo.maven.apache.org/maven2/org/apache/hive/hive-llap-server/2.1.0/hive-llap-server-2.1.0.jar
2017-07-02T06:28:54.654 [INFO] Downloaded: https://repo.maven.apache.org/maven2/org/apache/hadoop/hadoop-hdfs/2.6.0/hadoop-hdfs-2.6.0.jar
(7640 KB at 2537.1 KB/sec)
2017-07-02T06:28:54.654 [INFO] Downloading: https://repo.maven.apache.org/maven2/org/apache/slider/slider-core/0.90.2-incubating/slider-core-0.90.2-incubating.jar
2017-07-02T06:28:54.760 [INFO] Downloaded: https://repo.maven.apache.org/maven2/org/apache/hive/hive-llap-server/2.1.0/hive-llap-server-2.1.0.jar
(545 KB at 174.7 KB/sec)
2017-07-02T06:28:54.760 [INFO] Downloading: https://repo.maven.apache.org/maven2/com/beust/jcommander/1.30/jcommander-1.30.jar
2017-07-02T06:28:54.796 [INFO] Downloaded: https://repo.maven.apache.org/maven2/com/beust/jcommander/1.30/jcommander-1.30.jar
(59 KB at 18.7 KB/sec)
2017-07-02T06:28:54.796 [INFO] Downloading: https://repo.maven.apache.org/maven2/org/apache/hadoop/hadoop-yarn-registry/2.7.1/hadoop-yarn-registry-2.7.1.jar
2017-07-02T06:28:54.844 [INFO] Downloaded: https://repo.maven.apache.org/maven2/org/apache/hadoop/hadoop-yarn-registry/2.7.1/hadoop-yarn-registry-2.7.1.jar
(96 KB at 29.9 KB/sec)
2017-07-02T06:28:54.844 [INFO] Downloading: https://repo.maven.apache.org/maven2/org/apache/hbase/hbase-hadoop2-compat/1.1.1/hbase-hadoop2-compat-1.1.1.jar
2017-07-02T06:28:54.884 [INFO] Downloaded: https://repo.maven.apache.org/maven2/org/apache/hbase/hbase-hadoop2-compat/1.1.1/hbase-hadoop2-compat-1.1.1.jar
(80 KB at 24.5 KB/sec)
2017-07-02T06:28:54.884 [INFO] Downloading: https://repo.maven.apache.org/maven2/org/apache/hbase/hbase-server/1.1.1/hbase-server-1.1.1.jar
2017-07-02T06:28:54.919 [INFO] Downloaded: https://repo.maven.apache.org/maven2/org/apache/parquet/parquet-hadoop-bundle/1.8.1/parquet-hadoop-bundle-1.8.1.jar
(2835 KB at 865.2 KB/sec)
2017-07-02T06:28:54.919 [INFO] Downloading: https://repo.maven.apache.org/maven2/org/apache/hbase/hbase-procedure/1.1.1/hbase-procedure-1.1.1.jar
2017-07-02T06:28:54.969 [INFO] Downloaded: https://repo.maven.apache.org/maven2/org/apache/hbase/hbase-procedure/1.1.1/hbase-procedure-1.1.1.jar
(100 KB at 29.9 KB/sec)
2017-07-02T06:28:54.969 [INFO] Downloading: https://repo.maven.apache.org/maven2/org/apache/hbase/hbase-common/1.1.1/hbase-common-1.1.1-tests.jar
2017-07-02T06:28:54.972 [INFO] Downloaded: https://repo.maven.apache.org/maven2/org/apache/slider/slider-core/0.90.2-incubating/slider-core-0.90.2-incubating.jar
(1744 KB at 523.8 KB/sec)
2017-07-02T06:28:54.972 [INFO] Downloading: https://repo.maven.apache.org/maven2/org/apache/hbase/hbase-prefix-tree/1.1.1/hbase-prefix-tree-1.1.1.jar
2017-07-02T06:28:55.014 [INFO] Downloaded: https://repo.maven.apache.org/maven2/org/apache/hbase/hbase-prefix-tree/1.1.1/hbase-prefix-tree-1.1.1.jar
(100 KB at 29.6 KB/sec)
2017-07-02T06:28:55.014 [INFO] Downloading: https://repo.maven.apache.org/maven2/org/apache/hbase/hbase-hadoop-compat/1.1.1/hbase-hadoop-compat-1.1.1.jar
2017-07-02T06:28:55.032 [INFO] Downloaded: https://repo.maven.apache.org/maven2/org/apache/hbase/hbase-common/1.1.1/hbase-common-1.1.1-tests.jar
(206 KB at 60.6 KB/sec)
2017-07-02T06:28:55.032 [INFO] Downloading: https://repo.maven.apache.org/maven2/javax/servlet/jsp-api/2.0/jsp-api-2.0.jar
2017-07-02T06:28:55.044 [INFO] Downloaded: https://repo.maven.apache.org/maven2/org/apache/hbase/hbase-hadoop-compat/1.1.1/hbase-hadoop-compat-1.1.1.jar
(36 KB at 10.3 KB/sec)
2017-07-02T06:28:55.044 [INFO] Downloading: https://repo.maven.apache.org/maven2/org/jamon/jamon-runtime/2.3.1/jamon-runtime-2.3.1.jar
2017-07-02T06:28:55.067 [INFO] Downloaded: https://repo.maven.apache.org/maven2/javax/servlet/jsp-api/2.0/jsp-api-2.0.jar
(50 KB at 14.4 KB/sec)
2017-07-02T06:28:55.067 [INFO] Downloading: https://repo.maven.apache.org/maven2/org/apache/thrift/libthrift/0.9.3/libthrift-0.9.3.jar
2017-07-02T06:28:55.082 [INFO] Downloaded: https://repo.maven.apache.org/maven2/org/jamon/jamon-runtime/2.3.1/jamon-runtime-2.3.1.jar
(21 KB at 5.9 KB/sec)
2017-07-02T06:28:55.126 [INFO] Downloaded: https://repo.maven.apache.org/maven2/org/apache/thrift/libthrift/0.9.3/libthrift-0.9.3.jar
(229 KB at 65.7 KB/sec)
2017-07-02T06:28:55.329 [INFO] Downloaded: https://repo.maven.apache.org/maven2/it/unimi/dsi/fastutil/6.5.6/fastutil-6.5.6.jar
(16502 KB at 4476.9 KB/sec)
2017-07-02T06:28:55.429 [INFO] Downloaded: https://repo.maven.apache.org/maven2/org/apache/hbase/hbase-server/1.1.1/hbase-server-1.1.1.jar
(3878 KB at 1024.1 KB/sec)
2017-07-02T06:28:55.856 [INFO] Downloading: http://www.datanucleus.org/downloads/maven2/org/pentaho/pentaho-aggdesigner-algorithm/5.1.5-jhyde/pentaho-aggdesigner-algorithm-5.1.5-jhyde.jar
2017-07-02T06:28:56.188 [INFO] Downloading: http://conjars.org/repo/org/pentaho/pentaho-aggdesigner-algorithm/5.1.5-jhyde/pentaho-aggdesigner-algorithm-5.1.5-jhyde.jar
2017-07-02T06:28:56.258 [INFO] Downloaded: http://conjars.org/repo/org/pentaho/pentaho-aggdesigner-algorithm/5.1.5-jhyde/pentaho-aggdesigner-algorithm-5.1.5-jhyde.jar
(0 B at 0.0 KB/sec)
[JENKINS] Archiving disabled
2017-07-02T06:28:57.836 [INFO]                                                           
             
2017-07-02T06:28:57.836 [INFO] ------------------------------------------------------------------------
2017-07-02T06:28:57.836 [INFO] Skipping Apache Beam :: Parent
2017-07-02T06:28:57.836 [INFO] This project has been banned from the build due to previous
failures.
2017-07-02T06:28:57.836 [INFO] ------------------------------------------------------------------------
[JENKINS] Archiving disabled
[JENKINS] Archiving disabled
[JENKINS] Archiving disabled
[JENKINS] Archiving disabled
[JENKINS] Archiving disabled
[JENKINS] Archiving disabled
[JENKINS] Archiving disabled
[JENKINS] Archiving disabled
[JENKINS] Archiving disabled
[JENKINS] Archiving disabled
[JENKINS] Archiving disabled
[JENKINS] Archiving disabled
[JENKINS] Archiving disabled
[JENKINS] Archiving disabled
[JENKINS] Archiving disabled
[JENKINS] Archiving disabled
[JENKINS] Archiving disabled
[JENKINS] Archiving disabled
[JENKINS] Archiving disabled
[JENKINS] Archiving disabled
[JENKINS] Archiving disabled
[JENKINS] Archiving disabled
[JENKINS] Archiving disabled
[JENKINS] Archiving disabled
[JENKINS] Archiving disabled
[JENKINS] Archiving disabled
[JENKINS] Archiving disabled
[JENKINS] Archiving disabled
[JENKINS] Archiving disabled
[JENKINS] Archiving disabled
[JENKINS] Archiving disabled
[JENKINS] Archiving disabled
[JENKINS] Archiving disabled
[JENKINS] Archiving disabled
[JENKINS] Archiving disabled
[JENKINS] Archiving disabled
[JENKINS] Archiving disabled
[JENKINS] Archiving disabled
[JENKINS] Archiving disabled
[JENKINS] Archiving disabled
[JENKINS] Archiving disabled
[JENKINS] Archiving disabled
[JENKINS] Archiving disabled
[JENKINS] Archiving disabled
[JENKINS] Archiving disabled
[JENKINS] Archiving disabled
[JENKINS] Archiving disabled
[JENKINS] Archiving disabled
[JENKINS] Archiving disabled
2017-07-02T06:29:19.513 [INFO] ------------------------------------------------------------------------
2017-07-02T06:29:19.513 [INFO] Reactor Summary:
2017-07-02T06:29:19.513 [INFO] 
2017-07-02T06:29:19.513 [INFO] Apache Beam :: Parent .............................. SUCCESS
[ 30.000 s]
2017-07-02T06:29:19.513 [INFO] Apache Beam :: SDKs :: Java :: Build Tools ......... SUCCESS
[ 12.314 s]
2017-07-02T06:29:19.514 [INFO] Apache Beam :: SDKs ................................ SUCCESS
[  5.055 s]
2017-07-02T06:29:19.514 [INFO] Apache Beam :: SDKs :: Common ...................... SUCCESS
[  2.190 s]
2017-07-02T06:29:19.514 [INFO] Apache Beam :: SDKs :: Common :: Runner API ........ SUCCESS
[ 21.370 s]
2017-07-02T06:29:19.514 [INFO] Apache Beam :: SDKs :: Common :: Fn API ............ SUCCESS
[ 21.615 s]
2017-07-02T06:29:19.514 [INFO] Apache Beam :: SDKs :: Java ........................ SUCCESS
[  2.111 s]
2017-07-02T06:29:19.514 [INFO] Apache Beam :: SDKs :: Java :: Core ................ SUCCESS
[03:09 min]
2017-07-02T06:29:19.514 [INFO] Apache Beam :: Runners ............................. SUCCESS
[  2.051 s]
2017-07-02T06:29:19.514 [INFO] Apache Beam :: Runners :: Core Construction Java ... SUCCESS
[ 33.308 s]
2017-07-02T06:29:19.514 [INFO] Apache Beam :: Runners :: Core Java ................ SUCCESS
[ 55.001 s]
2017-07-02T06:29:19.514 [INFO] Apache Beam :: Runners :: Direct Java .............. SUCCESS
[03:37 min]
2017-07-02T06:29:19.514 [INFO] Apache Beam :: SDKs :: Java :: IO .................. SUCCESS
[  1.828 s]
2017-07-02T06:29:19.514 [INFO] Apache Beam :: SDKs :: Java :: IO :: AMQP .......... SUCCESS
[ 38.301 s]
2017-07-02T06:29:19.514 [INFO] Apache Beam :: SDKs :: Java :: IO :: Common ........ SUCCESS
[  4.725 s]
2017-07-02T06:29:19.514 [INFO] Apache Beam :: SDKs :: Java :: IO :: Cassandra ..... SUCCESS
[ 30.890 s]
2017-07-02T06:29:19.514 [INFO] Apache Beam :: SDKs :: Java :: IO :: Elasticsearch . SUCCESS
[ 41.152 s]
2017-07-02T06:29:19.514 [INFO] Apache Beam :: SDKs :: Java :: Extensions .......... SUCCESS
[  1.695 s]
2017-07-02T06:29:19.514 [INFO] Apache Beam :: SDKs :: Java :: Extensions :: Google Cloud Platform
Core SUCCESS [ 32.969 s]
2017-07-02T06:29:19.514 [INFO] Apache Beam :: SDKs :: Java :: Extensions :: Protobuf SUCCESS
[ 21.262 s]
2017-07-02T06:29:19.514 [INFO] Apache Beam :: SDKs :: Java :: IO :: Google Cloud Platform
SUCCESS [01:28 min]
2017-07-02T06:29:19.514 [INFO] Apache Beam :: SDKs :: Java :: IO :: Hadoop Common . SUCCESS
[ 24.585 s]
2017-07-02T06:29:19.514 [INFO] Apache Beam :: SDKs :: Java :: IO :: Hadoop File System SUCCESS
[ 47.946 s]
2017-07-02T06:29:19.514 [INFO] Apache Beam :: SDKs :: Java :: IO :: Hadoop ........ SUCCESS
[  5.556 s]
2017-07-02T06:29:19.514 [INFO] Apache Beam :: SDKs :: Java :: IO :: Hadoop :: input-format
SUCCESS [ 26.587 s]
2017-07-02T06:29:19.514 [INFO] Apache Beam :: Runners :: Google Cloud Dataflow .... SUCCESS
[08:34 min]
2017-07-02T06:29:19.514 [INFO] Apache Beam :: SDKs :: Java :: IO :: Hadoop :: jdk1.8-tests
SUCCESS [01:14 min]
2017-07-02T06:29:19.514 [INFO] Apache Beam :: SDKs :: Java :: IO :: HBase ......... SUCCESS
[ 59.568 s]
2017-07-02T06:29:19.514 [INFO] Apache Beam :: SDKs :: Java :: IO :: HCatalog ...... FAILURE
[  9.650 s]
2017-07-02T06:29:19.514 [INFO] Apache Beam :: SDKs :: Java :: IO :: JDBC .......... SKIPPED
2017-07-02T06:29:19.514 [INFO] Apache Beam :: SDKs :: Java :: IO :: JMS ........... SKIPPED
2017-07-02T06:29:19.514 [INFO] Apache Beam :: SDKs :: Java :: IO :: Kafka ......... SKIPPED
2017-07-02T06:29:19.514 [INFO] Apache Beam :: SDKs :: Java :: IO :: Kinesis ....... SKIPPED
2017-07-02T06:29:19.514 [INFO] Apache Beam :: SDKs :: Java :: IO :: MongoDB ....... SKIPPED
2017-07-02T06:29:19.514 [INFO] Apache Beam :: SDKs :: Java :: IO :: MQTT .......... SKIPPED
2017-07-02T06:29:19.514 [INFO] Apache Beam :: SDKs :: Java :: IO :: XML ........... SKIPPED
2017-07-02T06:29:19.514 [INFO] Apache Beam :: SDKs :: Java :: Maven Archetypes .... SKIPPED
2017-07-02T06:29:19.514 [INFO] Apache Beam :: SDKs :: Java :: Maven Archetypes :: Starter
SKIPPED
2017-07-02T06:29:19.514 [INFO] Apache Beam :: Examples ............................ SKIPPED
2017-07-02T06:29:19.514 [INFO] Apache Beam :: Examples :: Java .................... SKIPPED
2017-07-02T06:29:19.514 [INFO] Apache Beam :: SDKs :: Java :: Maven Archetypes :: Examples
SKIPPED
2017-07-02T06:29:19.514 [INFO] Apache Beam :: Examples :: Java 8 .................. SKIPPED
2017-07-02T06:29:19.514 [INFO] Apache Beam :: SDKs :: Java :: Maven Archetypes :: Examples
- Java 8 SKIPPED
2017-07-02T06:29:19.514 [INFO] Apache Beam :: SDKs :: Java :: Extensions :: Jackson SKIPPED
2017-07-02T06:29:19.514 [INFO] Apache Beam :: SDKs :: Java :: Extensions :: Join library SKIPPED
2017-07-02T06:29:19.514 [INFO] Apache Beam :: SDKs :: Java :: Extensions :: Sorter  SKIPPED
2017-07-02T06:29:19.514 [INFO] Apache Beam :: SDKs :: Java :: Harness ............. SKIPPED
2017-07-02T06:29:19.514 [INFO] Apache Beam :: SDKs :: Java :: Java 8 Tests ........ SKIPPED
2017-07-02T06:29:19.514 [INFO] Apache Beam :: SDKs :: Python ...................... SKIPPED
2017-07-02T06:29:19.514 [INFO] Apache Beam :: Runners :: Flink .................... SKIPPED
2017-07-02T06:29:19.514 [INFO] Apache Beam :: Runners :: Spark .................... SKIPPED
2017-07-02T06:29:19.514 [INFO] Apache Beam :: Runners :: Apex ..................... SKIPPED
2017-07-02T06:29:19.514 [INFO] Apache Beam :: SDKs :: Java :: Aggregated Javadoc .. SKIPPED
2017-07-02T06:29:19.514 [INFO] ------------------------------------------------------------------------
2017-07-02T06:29:19.514 [INFO] BUILD FAILURE
2017-07-02T06:29:19.514 [INFO] ------------------------------------------------------------------------
2017-07-02T06:29:19.515 [INFO] Total time: 27:52 min
2017-07-02T06:29:19.515 [INFO] Finished at: 2017-07-02T06:29:19+00:00
2017-07-02T06:29:20.230 [INFO] Final Memory: 235M/2035M
2017-07-02T06:29:20.230 [INFO] ------------------------------------------------------------------------
Waiting for Jenkins to finish collecting data
2017-07-02T06:29:20.871 [ERROR] Failed to execute goal on project beam-sdks-java-io-hcatalog:
Could not resolve dependencies for project org.apache.beam:beam-sdks-java-io-hcatalog:jar:2.1.0-SNAPSHOT:
Could not transfer artifact org.apache.hive:hive-exec:jar:2.1.0 from/to central (https://repo.maven.apache.org/maven2):
GET request of: org/apache/hive/hive-exec/2.1.0/hive-exec-2.1.0.jar from central failed: Connection
reset -> [Help 1]
org.apache.maven.lifecycle.LifecycleExecutionException: Failed to execute goal on project
beam-sdks-java-io-hcatalog: Could not resolve dependencies for project org.apache.beam:beam-sdks-java-io-hcatalog:jar:2.1.0-SNAPSHOT:
Could not transfer artifact org.apache.hive:hive-exec:jar:2.1.0 from/to central (https://repo.maven.apache.org/maven2):
GET request of: org/apache/hive/hive-exec/2.1.0/hive-exec-2.1.0.jar from central failed
	at org.apache.maven.lifecycle.internal.LifecycleDependencyResolver.getDependencies(LifecycleDependencyResolver.java:221)
	at org.apache.maven.lifecycle.internal.LifecycleDependencyResolver.resolveProjectDependencies(LifecycleDependencyResolver.java:127)
	at org.apache.maven.lifecycle.internal.MojoExecutor.ensureDependenciesAreResolved(MojoExecutor.java:257)
	at org.apache.maven.lifecycle.internal.MojoExecutor.execute(MojoExecutor.java:200)
	at org.apache.maven.lifecycle.internal.MojoExecutor.execute(MojoExecutor.java:153)
	at org.apache.maven.lifecycle.internal.MojoExecutor.execute(MojoExecutor.java:145)
	at org.apache.maven.lifecycle.internal.LifecycleModuleBuilder.buildProject(LifecycleModuleBuilder.java:116)
	at org.apache.maven.lifecycle.internal.LifecycleModuleBuilder.buildProject(LifecycleModuleBuilder.java:80)
	at org.apache.maven.lifecycle.internal.builder.singlethreaded.SingleThreadedBuilder.build(SingleThreadedBuilder.java:51)
	at org.apache.maven.lifecycle.internal.LifecycleStarter.execute(LifecycleStarter.java:128)
	at org.apache.maven.DefaultMaven.doExecute(DefaultMaven.java:307)
	at org.apache.maven.DefaultMaven.doExecute(DefaultMaven.java:193)
	at org.apache.maven.DefaultMaven.execute(DefaultMaven.java:106)
	at org.jvnet.hudson.maven3.launcher.Maven33Launcher.main(Maven33Launcher.java:129)
	at sun.reflect.NativeMethodAccessorImpl.invoke0(Native Method)
	at sun.reflect.NativeMethodAccessorImpl.invoke(NativeMethodAccessorImpl.java:62)
	at sun.reflect.DelegatingMethodAccessorImpl.invoke(DelegatingMethodAccessorImpl.java:43)
	at java.lang.reflect.Method.invoke(Method.java:498)
	at org.codehaus.plexus.classworlds.launcher.Launcher.launchStandard(Launcher.java:330)
	at org.codehaus.plexus.classworlds.launcher.Launcher.launch(Launcher.java:238)
	at jenkins.maven3.agent.Maven33Main.launch(Maven33Main.java:176)
	at sun.reflect.NativeMethodAccessorImpl.invoke0(Native Method)
	at sun.reflect.NativeMethodAccessorImpl.invoke(NativeMethodAccessorImpl.java:62)
	at sun.reflect.DelegatingMethodAccessorImpl.invoke(DelegatingMethodAccessorImpl.java:43)
	at java.lang.reflect.Method.invoke(Method.java:498)
	at hudson.maven.Maven3Builder.call(Maven3Builder.java:139)
	at hudson.maven.Maven3Builder.call(Maven3Builder.java:70)
	at hudson.remoting.UserRequest.perform(UserRequest.java:153)
	at hudson.remoting.UserRequest.perform(UserRequest.java:50)
	at hudson.remoting.Request$2.run(Request.java:336)
	at hudson.remoting.InterceptingExecutorService$1.call(InterceptingExecutorService.java:68)
	at java.util.concurrent.FutureTask.run(FutureTask.java:266)
	at java.util.concurrent.ThreadPoolExecutor.runWorker(ThreadPoolExecutor.java:1142)
	at java.util.concurrent.ThreadPoolExecutor$Worker.run(ThreadPoolExecutor.java:617)
	at java.lang.Thread.run(Thread.java:748)
Caused by: org.apache.maven.project.DependencyResolutionException: Could not resolve dependencies
for project org.apache.beam:beam-sdks-java-io-hcatalog:jar:2.1.0-SNAPSHOT: Could not transfer
artifact org.apache.hive:hive-exec:jar:2.1.0 from/to central (https://repo.maven.apache.org/maven2):
GET request of: org/apache/hive/hive-exec/2.1.0/hive-exec-2.1.0.jar from central failed
	at org.apache.maven.project.DefaultProjectDependenciesResolver.resolve(DefaultProjectDependenciesResolver.java:211)
	at org.apache.maven.lifecycle.internal.LifecycleDependencyResolver.getDependencies(LifecycleDependencyResolver.java:195)
	... 34 more
Caused by: org.eclipse.aether.resolution.DependencyResolutionException: Could not transfer
artifact org.apache.hive:hive-exec:jar:2.1.0 from/to central (https://repo.maven.apache.org/maven2):
GET request of: org/apache/hive/hive-exec/2.1.0/hive-exec-2.1.0.jar from central failed
	at org.eclipse.aether.internal.impl.DefaultRepositorySystem.resolveDependencies(DefaultRepositorySystem.java:384)
	at org.apache.maven.project.DefaultProjectDependenciesResolver.resolve(DefaultProjectDependenciesResolver.java:205)
	... 35 more
Caused by: org.eclipse.aether.resolution.ArtifactResolutionException: Could not transfer artifact
org.apache.hive:hive-exec:jar:2.1.0 from/to central (https://repo.maven.apache.org/maven2):
GET request of: org/apache/hive/hive-exec/2.1.0/hive-exec-2.1.0.jar from central failed
	at org.eclipse.aether.internal.impl.DefaultArtifactResolver.resolve(DefaultArtifactResolver.java:444)
	at org.eclipse.aether.internal.impl.DefaultArtifactResolver.resolveArtifacts(DefaultArtifactResolver.java:246)
	at org.eclipse.aether.internal.impl.DefaultRepositorySystem.resolveDependencies(DefaultRepositorySystem.java:367)
	... 36 more
Caused by: org.eclipse.aether.transfer.ArtifactTransferException: Could not transfer artifact
org.apache.hive:hive-exec:jar:2.1.0 from/to central (https://repo.maven.apache.org/maven2):
GET request of: org/apache/hive/hive-exec/2.1.0/hive-exec-2.1.0.jar from central failed
	at org.eclipse.aether.connector.basic.ArtifactTransportListener.transferFailed(ArtifactTransportListener.java:43)
	at org.eclipse.aether.connector.basic.BasicRepositoryConnector$TaskRunner.run(BasicRepositoryConnector.java:355)
	at org.eclipse.aether.util.concurrency.RunnableErrorForwarder$1.run(RunnableErrorForwarder.java:67)
	... 3 more
Caused by: org.apache.maven.wagon.TransferFailedException: GET request of: org/apache/hive/hive-exec/2.1.0/hive-exec-2.1.0.jar
from central failed
	at org.apache.maven.wagon.AbstractWagon.getTransfer(AbstractWagon.java:363)
	at org.apache.maven.wagon.AbstractWagon.getTransfer(AbstractWagon.java:316)
	at org.apache.maven.wagon.AbstractWagon.getTransfer(AbstractWagon.java:285)
	at org.apache.maven.wagon.StreamWagon.getIfNewer(StreamWagon.java:97)
	at org.apache.maven.wagon.StreamWagon.get(StreamWagon.java:61)
	at org.eclipse.aether.transport.wagon.WagonTransporter$GetTaskRunner.run(WagonTransporter.java:560)
	at org.eclipse.aether.transport.wagon.WagonTransporter.execute(WagonTransporter.java:427)
	at org.eclipse.aether.transport.wagon.WagonTransporter.get(WagonTransporter.java:404)
	at org.eclipse.aether.connector.basic.BasicRepositoryConnector$GetTaskRunner.runTask(BasicRepositoryConnector.java:447)
	at org.eclipse.aether.connector.basic.BasicRepositoryConnector$TaskRunner.run(BasicRepositoryConnector.java:350)
	... 4 more
Caused by: java.net.SocketException: Connection reset
	at java.net.SocketInputStream.read(SocketInputStream.java:210)
	at java.net.SocketInputStream.read(SocketInputStream.java:141)
	at sun.security.ssl.InputRecord.readFully(InputRecord.java:465)
	at sun.security.ssl.InputRecord.readV3Record(InputRecord.java:593)
	at sun.security.ssl.InputRecord.read(InputRecord.java:532)
	at sun.security.ssl.SSLSocketImpl.readRecord(SSLSocketImpl.java:973)
	at sun.security.ssl.SSLSocketImpl.readDataRecord(SSLSocketImpl.java:930)
	at sun.security.ssl.AppInputStream.read(AppInputStream.java:105)
	at org.apache.maven.wagon.providers.http.httpclient.impl.io.SessionInputBufferImpl.streamRead(SessionInputBufferImpl.java:136)
	at org.apache.maven.wagon.providers.http.httpclient.impl.io.SessionInputBufferImpl.read(SessionInputBufferImpl.java:195)
	at org.apache.maven.wagon.providers.http.httpclient.impl.io.ContentLengthInputStream.read(ContentLengthInputStream.java:178)
	at org.apache.maven.wagon.providers.http.httpclient.conn.EofSensorInputStream.read(EofSensorInputStream.java:137)
	at org.apache.maven.wagon.AbstractWagon.transfer(AbstractWagon.java:531)
	at org.apache.maven.wagon.AbstractWagon.getTransfer(AbstractWagon.java:353)
	... 13 more
2017-07-02T06:29:20.873 [ERROR] 
2017-07-02T06:29:20.873 [ERROR] Re-run Maven using the -X switch to enable full debug logging.
2017-07-02T06:29:20.873 [ERROR] 
2017-07-02T06:29:20.873 [ERROR] For more information about the errors and possible solutions,
please read the following articles:
2017-07-02T06:29:20.873 [ERROR] [Help 1] http://cwiki.apache.org/confluence/display/MAVEN/DependencyResolutionException
2017-07-02T06:29:20.873 [ERROR] 
2017-07-02T06:29:20.873 [ERROR] After correcting the problems, you can resume the build with
the command
2017-07-02T06:29:20.873 [ERROR]   mvn <goals> -rf :beam-sdks-java-io-hcatalog
channel stopped

Mime
View raw message