beam-commits mailing list archives

Site index · List index
Message view « Date » · « Thread »
Top « Date » · « Thread »
From Apache Jenkins Server <jenk...@builds.apache.org>
Subject Build failed in Jenkins: beam_PostCommit_Java_MavenInstall #4399
Date Tue, 18 Jul 2017 20:26:47 GMT
See <https://builds.apache.org/job/beam_PostCommit_Java_MavenInstall/4399/display/redirect>

------------------------------------------
[...truncated 3.40 MB...]
2017-07-18T20:25:53.919 [INFO] Dependency-reduced POM written at: <https://builds.apache.org/job/beam_PostCommit_Java_MavenInstall/ws/runners/spark/dependency-reduced-pom.xml>
2017-07-18T20:25:54.083 [INFO] Downloading: https://repo.maven.apache.org/maven2/net/jpountz/lz4/lz4/1.2.0/lz4-1.2.0.jar
[INFO] I/O exception (java.net.SocketException) caught when processing request to {s}->https://repo.maven.apache.org:443:
Connection reset
[INFO] Retrying request to {s}->https://repo.maven.apache.org:443
[INFO] I/O exception (java.net.SocketException) caught when processing request to {s}->https://repo.maven.apache.org:443:
Connection reset
[INFO] Retrying request to {s}->https://repo.maven.apache.org:443
[INFO] I/O exception (java.net.SocketException) caught when processing request to {s}->https://repo.maven.apache.org:443:
Connection reset
[INFO] Retrying request to {s}->https://repo.maven.apache.org:443
[JENKINS] Archiving disabled
2017-07-18T20:25:55.336 [INFO]                                                           
             
2017-07-18T20:25:55.336 [INFO] ------------------------------------------------------------------------
2017-07-18T20:25:55.336 [INFO] Skipping Apache Beam :: Parent
2017-07-18T20:25:55.336 [INFO] This project has been banned from the build due to previous
failures.
2017-07-18T20:25:55.336 [INFO] ------------------------------------------------------------------------
[JENKINS] Archiving disabled
[JENKINS] Archiving disabled
[JENKINS] Archiving disabled
[JENKINS] Archiving disabled
[JENKINS] Archiving disabled
[JENKINS] Archiving disabled
[JENKINS] Archiving disabled
[JENKINS] Archiving disabled
[JENKINS] Archiving disabled
[JENKINS] Archiving disabled
[JENKINS] Archiving disabled
[JENKINS] Archiving disabled
[JENKINS] Archiving disabled
[JENKINS] Archiving disabled
[JENKINS] Archiving disabled
[JENKINS] Archiving disabled
[JENKINS] Archiving disabled
[JENKINS] Archiving disabled
[JENKINS] Archiving disabled
[JENKINS] Archiving disabled
[JENKINS] Archiving disabled
[JENKINS] Archiving disabled
[JENKINS] Archiving disabled
[JENKINS] Archiving disabled
[JENKINS] Archiving disabled
[JENKINS] Archiving disabled
[JENKINS] Archiving disabled
[JENKINS] Archiving disabled
[JENKINS] Archiving disabled
[JENKINS] Archiving disabled
[JENKINS] Archiving disabled
[JENKINS] Archiving disabled
[JENKINS] Archiving disabled
[JENKINS] Archiving disabled
[JENKINS] Archiving disabled
[JENKINS] Archiving disabled
[JENKINS] Archiving disabled
[JENKINS] Archiving disabled
[JENKINS] Archiving disabled
[JENKINS] Archiving disabled
[JENKINS] Archiving disabled
[JENKINS] Archiving disabled
[JENKINS] Archiving disabled
[JENKINS] Archiving disabled
[JENKINS] Archiving disabled
[JENKINS] Archiving disabled
[JENKINS] Archiving disabled
[JENKINS] Archiving disabled
[JENKINS] Archiving disabled
[JENKINS] Archiving disabled
[JENKINS] Archiving disabled
[JENKINS] Archiving disabled
[JENKINS] Archiving disabled
2017-07-18T20:26:39.737 [INFO] ------------------------------------------------------------------------
2017-07-18T20:26:39.737 [INFO] Reactor Summary:
2017-07-18T20:26:39.737 [INFO] 
2017-07-18T20:26:39.737 [INFO] Apache Beam :: Parent .............................. SUCCESS
[ 31.830 s]
2017-07-18T20:26:39.737 [INFO] Apache Beam :: SDKs :: Java :: Build Tools ......... SUCCESS
[ 16.759 s]
2017-07-18T20:26:39.737 [INFO] Apache Beam :: SDKs ................................ SUCCESS
[  5.511 s]
2017-07-18T20:26:39.737 [INFO] Apache Beam :: SDKs :: Common ...................... SUCCESS
[  2.739 s]
2017-07-18T20:26:39.737 [INFO] Apache Beam :: SDKs :: Common :: Runner API ........ SUCCESS
[ 21.079 s]
2017-07-18T20:26:39.737 [INFO] Apache Beam :: SDKs :: Common :: Fn API ............ SUCCESS
[ 16.084 s]
2017-07-18T20:26:39.737 [INFO] Apache Beam :: SDKs :: Java ........................ SUCCESS
[  2.862 s]
2017-07-18T20:26:39.737 [INFO] Apache Beam :: SDKs :: Java :: Core ................ SUCCESS
[03:29 min]
2017-07-18T20:26:39.738 [INFO] Apache Beam :: Runners ............................. SUCCESS
[  3.155 s]
2017-07-18T20:26:39.738 [INFO] Apache Beam :: Runners :: Core Construction Java ... SUCCESS
[ 43.188 s]
2017-07-18T20:26:39.738 [INFO] Apache Beam :: Runners :: Core Java ................ SUCCESS
[01:06 min]
2017-07-18T20:26:39.738 [INFO] Apache Beam :: Runners :: Direct Java .............. SUCCESS
[04:33 min]
2017-07-18T20:26:39.738 [INFO] Apache Beam :: SDKs :: Java :: IO .................. SUCCESS
[  2.964 s]
2017-07-18T20:26:39.738 [INFO] Apache Beam :: SDKs :: Java :: IO :: AMQP .......... SUCCESS
[ 42.626 s]
2017-07-18T20:26:39.738 [INFO] Apache Beam :: SDKs :: Java :: IO :: Common ........ SUCCESS
[  7.416 s]
2017-07-18T20:26:39.738 [INFO] Apache Beam :: SDKs :: Java :: IO :: Cassandra ..... SUCCESS
[ 35.409 s]
2017-07-18T20:26:39.738 [INFO] Apache Beam :: SDKs :: Java :: IO :: Elasticsearch . SUCCESS
[ 45.413 s]
2017-07-18T20:26:39.738 [INFO] Apache Beam :: SDKs :: Java :: Extensions .......... SUCCESS
[  2.914 s]
2017-07-18T20:26:39.738 [INFO] Apache Beam :: SDKs :: Java :: Extensions :: Google Cloud Platform
Core SUCCESS [ 37.223 s]
2017-07-18T20:26:39.738 [INFO] Apache Beam :: SDKs :: Java :: Extensions :: Protobuf SUCCESS
[ 24.772 s]
2017-07-18T20:26:39.738 [INFO] Apache Beam :: SDKs :: Java :: IO :: Google Cloud Platform
SUCCESS [01:48 min]
2017-07-18T20:26:39.739 [INFO] Apache Beam :: SDKs :: Java :: IO :: Hadoop Common . SUCCESS
[ 26.699 s]
2017-07-18T20:26:39.739 [INFO] Apache Beam :: SDKs :: Java :: IO :: Hadoop File System SUCCESS
[ 54.353 s]
2017-07-18T20:26:39.739 [INFO] Apache Beam :: SDKs :: Java :: IO :: Hadoop ........ SUCCESS
[  5.384 s]
2017-07-18T20:26:39.739 [INFO] Apache Beam :: SDKs :: Java :: IO :: Hadoop :: input-format
SUCCESS [ 28.406 s]
2017-07-18T20:26:39.739 [INFO] Apache Beam :: Runners :: Google Cloud Dataflow .... SUCCESS
[11:43 min]
2017-07-18T20:26:39.739 [INFO] Apache Beam :: SDKs :: Java :: IO :: Hadoop :: jdk1.8-tests
SUCCESS [01:42 min]
2017-07-18T20:26:39.739 [INFO] Apache Beam :: SDKs :: Java :: IO :: HBase ......... SUCCESS
[01:10 min]
2017-07-18T20:26:39.739 [INFO] Apache Beam :: SDKs :: Java :: IO :: HCatalog ...... SUCCESS
[01:26 min]
2017-07-18T20:26:39.739 [INFO] Apache Beam :: SDKs :: Java :: IO :: JDBC .......... SUCCESS
[ 49.897 s]
2017-07-18T20:26:39.739 [INFO] Apache Beam :: SDKs :: Java :: IO :: JMS ........... SUCCESS
[ 30.651 s]
2017-07-18T20:26:39.739 [INFO] Apache Beam :: SDKs :: Java :: IO :: Kafka ......... SUCCESS
[ 40.390 s]
2017-07-18T20:26:39.739 [INFO] Apache Beam :: SDKs :: Java :: IO :: Kinesis ....... SUCCESS
[ 35.408 s]
2017-07-18T20:26:39.739 [INFO] Apache Beam :: SDKs :: Java :: IO :: MongoDB ....... SUCCESS
[ 53.721 s]
2017-07-18T20:26:39.740 [INFO] Apache Beam :: SDKs :: Java :: IO :: MQTT .......... SUCCESS
[ 28.557 s]
2017-07-18T20:26:39.740 [INFO] Apache Beam :: SDKs :: Java :: IO :: XML ........... SUCCESS
[ 32.687 s]
2017-07-18T20:26:39.740 [INFO] Apache Beam :: SDKs :: Java :: Maven Archetypes .... SUCCESS
[  2.480 s]
2017-07-18T20:26:39.740 [INFO] Apache Beam :: SDKs :: Java :: Maven Archetypes :: Starter
SUCCESS [ 18.973 s]
2017-07-18T20:26:39.740 [INFO] Apache Beam :: Examples ............................ SUCCESS
[  3.251 s]
2017-07-18T20:26:39.740 [INFO] Apache Beam :: Examples :: Java .................... SUCCESS
[08:12 min]
2017-07-18T20:26:39.740 [INFO] Apache Beam :: SDKs :: Java :: Maven Archetypes :: Examples
SUCCESS [ 41.561 s]
2017-07-18T20:26:39.740 [INFO] Apache Beam :: Examples :: Java 8 .................. SUCCESS
[ 29.071 s]
2017-07-18T20:26:39.740 [INFO] Apache Beam :: SDKs :: Java :: Maven Archetypes :: Examples
- Java 8 SUCCESS [ 43.000 s]
2017-07-18T20:26:39.740 [INFO] Apache Beam :: SDKs :: Java :: Extensions :: Jackson SUCCESS
[ 22.442 s]
2017-07-18T20:26:39.740 [INFO] Apache Beam :: SDKs :: Java :: Extensions :: Join library SUCCESS
[ 25.047 s]
2017-07-18T20:26:39.740 [INFO] Apache Beam :: SDKs :: Java :: Extensions :: Sorter  SUCCESS
[ 50.115 s]
2017-07-18T20:26:39.740 [INFO] Apache Beam :: SDKs :: Java :: Harness ............. SUCCESS
[ 47.077 s]
2017-07-18T20:26:39.740 [INFO] Apache Beam :: SDKs :: Java :: Java 8 Tests ........ SUCCESS
[ 18.053 s]
2017-07-18T20:26:39.740 [INFO] Apache Beam :: SDKs :: Python ...................... SUCCESS
[25:52 min]
2017-07-18T20:26:39.741 [INFO] Apache Beam :: Runners :: Flink .................... SUCCESS
[01:04 min]
2017-07-18T20:26:39.741 [INFO] Apache Beam :: Runners :: Spark .................... FAILURE
[03:06 min]
2017-07-18T20:26:39.741 [INFO] Apache Beam :: Runners :: Apex ..................... SKIPPED
2017-07-18T20:26:39.741 [INFO] Apache Beam :: SDKs :: Java :: Aggregated Javadoc .. SKIPPED
2017-07-18T20:26:39.741 [INFO] ------------------------------------------------------------------------
2017-07-18T20:26:39.741 [INFO] BUILD FAILURE
2017-07-18T20:26:39.741 [INFO] ------------------------------------------------------------------------
2017-07-18T20:26:39.741 [INFO] Total time: 01:24 h
2017-07-18T20:26:39.741 [INFO] Finished at: 2017-07-18T20:26:39+00:00
2017-07-18T20:26:40.855 [INFO] Final Memory: 292M/1955M
2017-07-18T20:26:40.855 [INFO] ------------------------------------------------------------------------
2017-07-18T20:26:40.868 [ERROR] Failed to execute goal org.apache.maven.plugins:maven-shade-plugin:3.0.0:shade
(bundle-and-repackage) on project beam-runners-spark: Error creating shaded jar: Could not
resolve following dependencies: [net.jpountz.lz4:lz4:jar:1.2.0 (test)]: Could not resolve
dependencies for project org.apache.beam:beam-runners-spark:jar:2.2.0-SNAPSHOT: Could not
transfer artifact net.jpountz.lz4:lz4:jar:1.2.0 from/to central (https://repo.maven.apache.org/maven2):
Connection reset -> [Help 1]
org.apache.maven.lifecycle.LifecycleExecutionException: Failed to execute goal org.apache.maven.plugins:maven-shade-plugin:3.0.0:shade
(bundle-and-repackage) on project beam-runners-spark: Error creating shaded jar: Could not
resolve following dependencies: [net.jpountz.lz4:lz4:jar:1.2.0 (test)]
	at org.apache.maven.lifecycle.internal.MojoExecutor.execute(MojoExecutor.java:216)
	at org.apache.maven.lifecycle.internal.MojoExecutor.execute(MojoExecutor.java:153)
	at org.apache.maven.lifecycle.internal.MojoExecutor.execute(MojoExecutor.java:145)
	at org.apache.maven.lifecycle.internal.LifecycleModuleBuilder.buildProject(LifecycleModuleBuilder.java:116)
	at org.apache.maven.lifecycle.internal.LifecycleModuleBuilder.buildProject(LifecycleModuleBuilder.java:80)
	at org.apache.maven.lifecycle.internal.builder.singlethreaded.SingleThreadedBuilder.build(SingleThreadedBuilder.java:51)
	at org.apache.maven.lifecycle.internal.LifecycleStarter.execute(LifecycleStarter.java:128)
	at org.apache.maven.DefaultMaven.doExecute(DefaultMaven.java:307)
	at org.apache.maven.DefaultMaven.doExecute(DefaultMaven.java:193)
	at org.apache.maven.DefaultMaven.execute(DefaultMaven.java:106)
	at org.jvnet.hudson.maven3.launcher.Maven33Launcher.main(Maven33Launcher.java:129)
	at sun.reflect.NativeMethodAccessorImpl.invoke0(Native Method)
	at sun.reflect.NativeMethodAccessorImpl.invoke(NativeMethodAccessorImpl.java:62)
	at sun.reflect.DelegatingMethodAccessorImpl.invoke(DelegatingMethodAccessorImpl.java:43)
	at java.lang.reflect.Method.invoke(Method.java:498)
	at org.codehaus.plexus.classworlds.launcher.Launcher.launchStandard(Launcher.java:330)
	at org.codehaus.plexus.classworlds.launcher.Launcher.launch(Launcher.java:238)
	at jenkins.maven3.agent.Maven33Main.launch(Maven33Main.java:176)
	at sun.reflect.NativeMethodAccessorImpl.invoke0(Native Method)
	at sun.reflect.NativeMethodAccessorImpl.invoke(NativeMethodAccessorImpl.java:62)
	at sun.reflect.DelegatingMethodAccessorImpl.invoke(DelegatingMethodAccessorImpl.java:43)
	at java.lang.reflect.Method.invoke(Method.java:498)
	at hudson.maven.Maven3Builder.call(Maven3Builder.java:139)
	at hudson.maven.Maven3Builder.call(Maven3Builder.java:70)
	at hudson.remoting.UserRequest.perform(UserRequest.java:153)
	at hudson.remoting.UserRequest.perform(UserRequest.java:50)
	at hudson.remoting.Request$2.run(Request.java:336)
	at hudson.remoting.InterceptingExecutorService$1.call(InterceptingExecutorService.java:68)
	at java.util.concurrent.FutureTask.run(FutureTask.java:266)
	at java.util.concurrent.ThreadPoolExecutor.runWorker(ThreadPoolExecutor.java:1142)
	at java.util.concurrent.ThreadPoolExecutor$Worker.run(ThreadPoolExecutor.java:617)
	at java.lang.Thread.run(Thread.java:748)
Caused by: org.apache.maven.plugin.MojoExecutionException: Error creating shaded jar: Could
not resolve following dependencies: [net.jpountz.lz4:lz4:jar:1.2.0 (test)]
	at org.apache.maven.plugins.shade.mojo.ShadeMojo.execute(ShadeMojo.java:546)
	at org.apache.maven.plugin.DefaultBuildPluginManager.executeMojo(DefaultBuildPluginManager.java:134)
	at org.apache.maven.lifecycle.internal.MojoExecutor.execute(MojoExecutor.java:208)
	... 31 more
Caused by: org.apache.maven.shared.dependency.graph.DependencyGraphBuilderException: Could
not resolve following dependencies: [net.jpountz.lz4:lz4:jar:1.2.0 (test)]
	at org.apache.maven.shared.dependency.graph.internal.Maven31DependencyGraphBuilder.resolveDependencies(Maven31DependencyGraphBuilder.java:133)
	at org.apache.maven.shared.dependency.graph.internal.Maven31DependencyGraphBuilder.buildDependencyGraph(Maven31DependencyGraphBuilder.java:113)
	at org.apache.maven.shared.dependency.graph.internal.DefaultDependencyGraphBuilder.buildDependencyGraph(DefaultDependencyGraphBuilder.java:91)
	at org.apache.maven.shared.dependency.graph.internal.DefaultDependencyGraphBuilder.buildDependencyGraph(DefaultDependencyGraphBuilder.java:66)
	at org.apache.maven.plugins.shade.mojo.ShadeMojo.updateExcludesInDeps(ShadeMojo.java:1133)
	at org.apache.maven.plugins.shade.mojo.ShadeMojo.rewriteDependencyReducedPomIfWeHaveReduction(ShadeMojo.java:1060)
	at org.apache.maven.plugins.shade.mojo.ShadeMojo.createDependencyReducedPom(ShadeMojo.java:970)
	at org.apache.maven.plugins.shade.mojo.ShadeMojo.execute(ShadeMojo.java:538)
	... 33 more
Caused by: org.apache.maven.project.DependencyResolutionException: Could not resolve dependencies
for project org.apache.beam:beam-runners-spark:jar:2.2.0-SNAPSHOT: Could not transfer artifact
net.jpountz.lz4:lz4:jar:1.2.0 from/to central (https://repo.maven.apache.org/maven2): Connection
reset
	at org.apache.maven.project.DefaultProjectDependenciesResolver.resolve(DefaultProjectDependenciesResolver.java:211)
	at org.apache.maven.shared.dependency.graph.internal.Maven31DependencyGraphBuilder.resolveDependencies(Maven31DependencyGraphBuilder.java:127)
	... 40 more
Caused by: org.eclipse.aether.resolution.DependencyResolutionException: Could not transfer
artifact net.jpountz.lz4:lz4:jar:1.2.0 from/to central (https://repo.maven.apache.org/maven2):
Connection reset
	at org.eclipse.aether.internal.impl.DefaultRepositorySystem.resolveDependencies(DefaultRepositorySystem.java:384)
	at org.apache.maven.project.DefaultProjectDependenciesResolver.resolve(DefaultProjectDependenciesResolver.java:205)
	... 41 more
Caused by: org.eclipse.aether.resolution.ArtifactResolutionException: Could not transfer artifact
net.jpountz.lz4:lz4:jar:1.2.0 from/to central (https://repo.maven.apache.org/maven2): Connection
reset
	at org.eclipse.aether.internal.impl.DefaultArtifactResolver.resolve(DefaultArtifactResolver.java:444)
	at org.eclipse.aether.internal.impl.DefaultArtifactResolver.resolveArtifacts(DefaultArtifactResolver.java:246)
	at org.eclipse.aether.internal.impl.DefaultRepositorySystem.resolveDependencies(DefaultRepositorySystem.java:367)
	... 42 more
Caused by: org.eclipse.aether.transfer.ArtifactTransferException: Could not transfer artifact
net.jpountz.lz4:lz4:jar:1.2.0 from/to central (https://repo.maven.apache.org/maven2): Connection
reset
	at org.eclipse.aether.connector.basic.ArtifactTransportListener.transferFailed(ArtifactTransportListener.java:43)
	at org.eclipse.aether.connector.basic.BasicRepositoryConnector$TaskRunner.run(BasicRepositoryConnector.java:355)
	at org.eclipse.aether.util.concurrency.RunnableErrorForwarder$1.run(RunnableErrorForwarder.java:67)
	at org.eclipse.aether.connector.basic.BasicRepositoryConnector$DirectExecutor.execute(BasicRepositoryConnector.java:581)
	at org.eclipse.aether.connector.basic.BasicRepositoryConnector.get(BasicRepositoryConnector.java:249)
	at org.eclipse.aether.internal.impl.DefaultArtifactResolver.performDownloads(DefaultArtifactResolver.java:520)
	at org.eclipse.aether.internal.impl.DefaultArtifactResolver.resolve(DefaultArtifactResolver.java:421)
	... 44 more
Caused by: org.apache.maven.wagon.TransferFailedException: Connection reset
	at org.apache.maven.wagon.providers.http.AbstractHttpClientWagon.fillInputData(AbstractHttpClientWagon.java:1066)
	at org.apache.maven.wagon.providers.http.AbstractHttpClientWagon.fillInputData(AbstractHttpClientWagon.java:960)
	at org.apache.maven.wagon.StreamWagon.getInputStream(StreamWagon.java:116)
	at org.apache.maven.wagon.StreamWagon.getIfNewer(StreamWagon.java:88)
	at org.apache.maven.wagon.StreamWagon.get(StreamWagon.java:61)
	at org.eclipse.aether.transport.wagon.WagonTransporter$GetTaskRunner.run(WagonTransporter.java:560)
	at org.eclipse.aether.transport.wagon.WagonTransporter.execute(WagonTransporter.java:427)
	at org.eclipse.aether.transport.wagon.WagonTransporter.get(WagonTransporter.java:404)
	at org.eclipse.aether.connector.basic.BasicRepositoryConnector$GetTaskRunner.runTask(BasicRepositoryConnector.java:447)
	at org.eclipse.aether.connector.basic.BasicRepositoryConnector$TaskRunner.run(BasicRepositoryConnector.java:350)
	... 49 more
Caused by: java.net.SocketException: Connection reset
	at java.net.SocketInputStream.read(SocketInputStream.java:210)
	at java.net.SocketInputStream.read(SocketInputStream.java:141)
	at sun.security.ssl.InputRecord.readFully(InputRecord.java:465)
	at sun.security.ssl.InputRecord.read(InputRecord.java:503)
	at sun.security.ssl.SSLSocketImpl.readRecord(SSLSocketImpl.java:973)
	at sun.security.ssl.SSLSocketImpl.readDataRecord(SSLSocketImpl.java:930)
	at sun.security.ssl.AppInputStream.read(AppInputStream.java:105)
	at org.apache.maven.wagon.providers.http.httpclient.impl.io.SessionInputBufferImpl.streamRead(SessionInputBufferImpl.java:136)
	at org.apache.maven.wagon.providers.http.httpclient.impl.io.SessionInputBufferImpl.fillBuffer(SessionInputBufferImpl.java:152)
	at org.apache.maven.wagon.providers.http.httpclient.impl.io.SessionInputBufferImpl.readLine(SessionInputBufferImpl.java:270)
	at org.apache.maven.wagon.providers.http.httpclient.impl.conn.DefaultHttpResponseParser.parseHead(DefaultHttpResponseParser.java:140)
	at org.apache.maven.wagon.providers.http.httpclient.impl.conn.DefaultHttpResponseParser.parseHead(DefaultHttpResponseParser.java:57)
	at org.apache.maven.wagon.providers.http.httpclient.impl.io.AbstractMessageParser.parse(AbstractMessageParser.java:260)
	at org.apache.maven.wagon.providers.http.httpclient.impl.DefaultBHttpClientConnection.receiveResponseHeader(DefaultBHttpClientConnection.java:161)
	at org.apache.maven.wagon.providers.http.httpclient.impl.conn.CPoolProxy.receiveResponseHeader(CPoolProxy.java:153)
	at org.apache.maven.wagon.providers.http.httpclient.protocol.HttpRequestExecutor.doReceiveResponse(HttpRequestExecutor.java:271)
	at org.apache.maven.wagon.providers.http.httpclient.protocol.HttpRequestExecutor.execute(HttpRequestExecutor.java:123)
	at org.apache.maven.wagon.providers.http.httpclient.impl.execchain.MainClientExec.execute(MainClientExec.java:254)
	at org.apache.maven.wagon.providers.http.httpclient.impl.execchain.ProtocolExec.execute(ProtocolExec.java:195)
	at org.apache.maven.wagon.providers.http.httpclient.impl.execchain.RetryExec.execute(RetryExec.java:86)
	at org.apache.maven.wagon.providers.http.httpclient.impl.execchain.RedirectExec.execute(RedirectExec.java:108)
	at org.apache.maven.wagon.providers.http.httpclient.impl.client.InternalHttpClient.doExecute(InternalHttpClient.java:184)
	at org.apache.maven.wagon.providers.http.httpclient.impl.client.CloseableHttpClient.execute(CloseableHttpClient.java:82)
	at org.apache.maven.wagon.providers.http.AbstractHttpClientWagon.execute(AbstractHttpClientWagon.java:832)
	at org.apache.maven.wagon.providers.http.AbstractHttpClientWagon.fillInputData(AbstractHttpClientWagon.java:983)
	... 58 more
2017-07-18T20:26:40.882 [ERROR] 
2017-07-18T20:26:40.882 [ERROR] Re-run Maven using the -X switch to enable full debug logging.
2017-07-18T20:26:40.882 [ERROR] 
2017-07-18T20:26:40.882 [ERROR] For more information about the errors and possible solutions,
please read the following articles:
2017-07-18T20:26:40.882 [ERROR] [Help 1] http://cwiki.apache.org/confluence/display/MAVEN/MojoExecutionException
2017-07-18T20:26:40.883 [ERROR] 
2017-07-18T20:26:40.883 [ERROR] After correcting the problems, you can resume the build with
the command
2017-07-18T20:26:40.883 [ERROR]   mvn <goals> -rf :beam-runners-spark
channel stopped

Mime
View raw message