beam-commits mailing list archives

Site index · List index
Message view « Date » · « Thread »
Top « Date » · « Thread »
From Apache Jenkins Server <jenk...@builds.apache.org>
Subject Build failed in Jenkins: beam_PostCommit_Java_MavenInstall #4175
Date Wed, 21 Jun 2017 21:50:30 GMT
See <https://builds.apache.org/job/beam_PostCommit_Java_MavenInstall/4175/display/redirect?page=changes>

Changes:

[altay] Allow production of unprocessed bundles, introduce TestStream evaluator

------------------------------------------
[...truncated 3.34 MB...]
2017-06-21T21:49:42.429 [INFO] Downloaded: https://repo.maven.apache.org/maven2/javax/servlet/javax.servlet-api/3.0.1/javax.servlet-api-3.0.1.jar
(84 KB at 40.3 KB/sec)
2017-06-21T21:49:42.429 [INFO] Downloading: https://repo.maven.apache.org/maven2/org/glassfish/grizzly/grizzly-framework/2.1.2/grizzly-framework-2.1.2.jar
2017-06-21T21:49:42.435 [INFO] Downloaded: https://repo.maven.apache.org/maven2/com/sun/jersey/jersey-grizzly2/1.9/jersey-grizzly2-1.9.jar
(18 KB at 8.3 KB/sec)
2017-06-21T21:49:42.435 [INFO] Downloading: https://repo.maven.apache.org/maven2/org/glassfish/gmbal/gmbal-api-only/3.0.0-b023/gmbal-api-only-3.0.0-b023.jar
2017-06-21T21:49:42.449 [INFO] Downloaded: https://repo.maven.apache.org/maven2/org/apache/hadoop/hadoop-common/2.2.0/hadoop-common-2.2.0.jar
(2672 KB at 1279.4 KB/sec)
2017-06-21T21:49:42.449 [INFO] Downloading: https://repo.maven.apache.org/maven2/org/glassfish/external/management-api/3.0.0-b012/management-api-3.0.0-b012.jar
2017-06-21T21:49:42.463 [INFO] Downloaded: https://repo.maven.apache.org/maven2/org/glassfish/gmbal/gmbal-api-only/3.0.0-b023/gmbal-api-only-3.0.0-b023.jar
(22 KB at 10.1 KB/sec)
2017-06-21T21:49:42.463 [INFO] Downloading: https://repo.maven.apache.org/maven2/org/glassfish/grizzly/grizzly-http-server/2.1.2/grizzly-http-server-2.1.2.jar
2017-06-21T21:49:42.470 [INFO] Downloaded: https://repo.maven.apache.org/maven2/org/apache/hadoop/hadoop-yarn-common/2.2.0/hadoop-yarn-common-2.2.0.jar
(1272 KB at 602.7 KB/sec)
2017-06-21T21:49:42.470 [INFO] Downloading: https://repo.maven.apache.org/maven2/org/glassfish/grizzly/grizzly-rcm/2.1.2/grizzly-rcm-2.1.2.jar
2017-06-21T21:49:42.496 [INFO] Downloaded: https://repo.maven.apache.org/maven2/org/glassfish/external/management-api/3.0.0-b012/management-api-3.0.0-b012.jar
(42 KB at 19.3 KB/sec)
2017-06-21T21:49:42.496 [INFO] Downloading: https://repo.maven.apache.org/maven2/org/glassfish/grizzly/grizzly-http-servlet/2.1.2/grizzly-http-servlet-2.1.2.jar
2017-06-21T21:49:42.500 [INFO] Downloaded: https://repo.maven.apache.org/maven2/org/glassfish/grizzly/grizzly-rcm/2.1.2/grizzly-rcm-2.1.2.jar
(8 KB at 3.7 KB/sec)
2017-06-21T21:49:42.500 [INFO] Downloading: https://repo.maven.apache.org/maven2/org/glassfish/javax.servlet/3.1/javax.servlet-3.1.jar
2017-06-21T21:49:42.518 [INFO] Downloaded: https://repo.maven.apache.org/maven2/org/glassfish/grizzly/grizzly-http/2.1.2/grizzly-http-2.1.2.jar
(248 KB at 114.6 KB/sec)
2017-06-21T21:49:42.519 [INFO] Downloading: https://repo.maven.apache.org/maven2/com/fasterxml/jackson/core/jackson-core/2.4.4/jackson-core-2.4.4.jar
2017-06-21T21:49:42.521 [INFO] Downloaded: https://repo.maven.apache.org/maven2/org/glassfish/grizzly/grizzly-http-server/2.1.2/grizzly-http-server-2.1.2.jar
(194 KB at 89.7 KB/sec)
2017-06-21T21:49:42.521 [INFO] Downloading: https://repo.maven.apache.org/maven2/com/fasterxml/jackson/core/jackson-annotations/2.4.4/jackson-annotations-2.4.4.jar
2017-06-21T21:49:42.536 [INFO] Downloaded: https://repo.maven.apache.org/maven2/org/glassfish/grizzly/grizzly-framework/2.1.2/grizzly-framework-2.1.2.jar
(675 KB at 310.2 KB/sec)
2017-06-21T21:49:42.538 [INFO] Downloading: https://repo.maven.apache.org/maven2/com/fasterxml/jackson/core/jackson-databind/2.4.4/jackson-databind-2.4.4.jar
2017-06-21T21:49:42.536 [INFO] Downloaded: https://repo.maven.apache.org/maven2/org/glassfish/javax.servlet/3.1/javax.servlet-3.1.jar
(82 KB at 37.7 KB/sec)
2017-06-21T21:49:42.538 [INFO] Downloading: https://repo.maven.apache.org/maven2/org/scala-lang/scala-library/2.10.5/scala-library-2.10.5.jar
2017-06-21T21:49:42.553 [INFO] Downloaded: https://repo.maven.apache.org/maven2/com/fasterxml/jackson/core/jackson-annotations/2.4.4/jackson-annotations-2.4.4.jar
(38 KB at 17.2 KB/sec)
2017-06-21T21:49:42.553 [INFO] Downloading: https://repo.maven.apache.org/maven2/org/apache/kafka/kafka-clients/0.9.0.1/kafka-clients-0.9.0.1.jar
2017-06-21T21:49:42.594 [INFO] Downloaded: https://repo.maven.apache.org/maven2/org/glassfish/grizzly/grizzly-http-servlet/2.1.2/grizzly-http-servlet-2.1.2.jar
(330 KB at 147.5 KB/sec)
2017-06-21T21:49:42.594 [INFO] Downloading: https://repo.maven.apache.org/maven2/org/apache/kafka/kafka_2.10/0.9.0.1/kafka_2.10-0.9.0.1.jar
2017-06-21T21:49:42.606 [INFO] Downloaded: https://repo.maven.apache.org/maven2/com/fasterxml/jackson/core/jackson-core/2.4.4/jackson-core-2.4.4.jar
(221 KB at 98.0 KB/sec)
2017-06-21T21:49:42.606 [INFO] Downloading: https://repo.maven.apache.org/maven2/com/101tec/zkclient/0.7/zkclient-0.7.jar
2017-06-21T21:49:42.647 [INFO] Downloaded: https://repo.maven.apache.org/maven2/com/101tec/zkclient/0.7/zkclient-0.7.jar
(73 KB at 31.5 KB/sec)
2017-06-21T21:49:42.647 [INFO] Downloading: https://repo.maven.apache.org/maven2/net/sf/jopt-simple/jopt-simple/3.2/jopt-simple-3.2.jar
2017-06-21T21:49:42.684 [INFO] Downloaded: https://repo.maven.apache.org/maven2/net/sf/jopt-simple/jopt-simple/3.2/jopt-simple-3.2.jar
(52 KB at 22.4 KB/sec)
2017-06-21T21:49:42.684 [INFO] Downloading: https://repo.maven.apache.org/maven2/com/fasterxml/jackson/dataformat/jackson-dataformat-yaml/2.4.4/jackson-dataformat-yaml-2.4.4.jar
2017-06-21T21:49:42.694 [INFO] Downloaded: https://repo.maven.apache.org/maven2/org/apache/kafka/kafka-clients/0.9.0.1/kafka-clients-0.9.0.1.jar
(627 KB at 268.6 KB/sec)
2017-06-21T21:49:42.694 [INFO] Downloading: https://repo.maven.apache.org/maven2/org/yaml/snakeyaml/1.12/snakeyaml-1.12.jar
2017-06-21T21:49:42.763 [INFO] Downloaded: https://repo.maven.apache.org/maven2/com/fasterxml/jackson/core/jackson-databind/2.4.4/jackson-databind-2.4.4.jar
(1052 KB at 438.0 KB/sec)
2017-06-21T21:49:42.780 [INFO] Downloaded: https://repo.maven.apache.org/maven2/com/fasterxml/jackson/dataformat/jackson-dataformat-yaml/2.4.4/jackson-dataformat-yaml-2.4.4.jar
(314 KB at 129.5 KB/sec)
2017-06-21T21:49:42.781 [INFO] Downloaded: https://repo.maven.apache.org/maven2/org/yaml/snakeyaml/1.12/snakeyaml-1.12.jar
(265 KB at 109.3 KB/sec)
2017-06-21T21:49:43.234 [INFO] Downloaded: https://repo.maven.apache.org/maven2/org/scala-lang/scala-library/2.10.5/scala-library-2.10.5.jar
(6964 KB at 2424.7 KB/sec)
2017-06-21T21:49:43.273 [INFO] Downloaded: https://repo.maven.apache.org/maven2/org/apache/kafka/kafka_2.10/0.9.0.1/kafka_2.10-0.9.0.1.jar
(4859 KB at 1668.9 KB/sec)
[JENKINS] Archiving disabled
2017-06-21T21:49:43.918 [INFO]                                                           
             
2017-06-21T21:49:43.918 [INFO] ------------------------------------------------------------------------
2017-06-21T21:49:43.918 [INFO] Skipping Apache Beam :: Parent
2017-06-21T21:49:43.918 [INFO] This project has been banned from the build due to previous
failures.
2017-06-21T21:49:43.918 [INFO] ------------------------------------------------------------------------
[JENKINS] Archiving disabled
[JENKINS] Archiving disabled
[JENKINS] Archiving disabled
[JENKINS] Archiving disabled
[JENKINS] Archiving disabled
[JENKINS] Archiving disabled
[JENKINS] Archiving disabled
[JENKINS] Archiving disabled
[JENKINS] Archiving disabled
[JENKINS] Archiving disabled
[JENKINS] Archiving disabled
[JENKINS] Archiving disabled
[JENKINS] Archiving disabled
[JENKINS] Archiving disabled
[JENKINS] Archiving disabled
[JENKINS] Archiving disabled
[JENKINS] Archiving disabled
[JENKINS] Archiving disabled
[JENKINS] Archiving disabled
[JENKINS] Archiving disabled
[JENKINS] Archiving disabled
[JENKINS] Archiving disabled
[JENKINS] Archiving disabled
[JENKINS] Archiving disabled
[JENKINS] Archiving disabled
[JENKINS] Archiving disabled
[JENKINS] Archiving disabled
[JENKINS] Archiving disabled
[JENKINS] Archiving disabled
[JENKINS] Archiving disabled
[JENKINS] Archiving disabled
[JENKINS] Archiving disabled
[JENKINS] Archiving disabled
[JENKINS] Archiving disabled
[JENKINS] Archiving disabled
[JENKINS] Archiving disabled
[JENKINS] Archiving disabled
[JENKINS] Archiving disabled
[JENKINS] Archiving disabled
[JENKINS] Archiving disabled
[JENKINS] Archiving disabled
[JENKINS] Archiving disabled
[JENKINS] Archiving disabled
[JENKINS] Archiving disabled
[JENKINS] Archiving disabled
[JENKINS] Archiving disabled
[JENKINS] Archiving disabled
[JENKINS] Archiving disabled
2017-06-21T21:50:08.183 [INFO] ------------------------------------------------------------------------
2017-06-21T21:50:08.183 [INFO] Reactor Summary:
2017-06-21T21:50:08.183 [INFO] 
2017-06-21T21:50:08.183 [INFO] Apache Beam :: Parent .............................. SUCCESS
[ 32.464 s]
2017-06-21T21:50:08.183 [INFO] Apache Beam :: SDKs :: Java :: Build Tools ......... SUCCESS
[  7.736 s]
2017-06-21T21:50:08.183 [INFO] Apache Beam :: SDKs ................................ SUCCESS
[  4.164 s]
2017-06-21T21:50:08.183 [INFO] Apache Beam :: SDKs :: Common ...................... SUCCESS
[  1.783 s]
2017-06-21T21:50:08.183 [INFO] Apache Beam :: SDKs :: Common :: Runner API ........ SUCCESS
[ 13.827 s]
2017-06-21T21:50:08.183 [INFO] Apache Beam :: SDKs :: Common :: Fn API ............ SUCCESS
[ 15.149 s]
2017-06-21T21:50:08.183 [INFO] Apache Beam :: SDKs :: Java ........................ SUCCESS
[  1.585 s]
2017-06-21T21:50:08.183 [INFO] Apache Beam :: SDKs :: Java :: Core ................ SUCCESS
[02:12 min]
2017-06-21T21:50:08.183 [INFO] Apache Beam :: Runners ............................. SUCCESS
[  1.831 s]
2017-06-21T21:50:08.183 [INFO] Apache Beam :: Runners :: Core Construction Java ... SUCCESS
[ 26.990 s]
2017-06-21T21:50:08.183 [INFO] Apache Beam :: Runners :: Core Java ................ SUCCESS
[ 42.906 s]
2017-06-21T21:50:08.183 [INFO] Apache Beam :: Runners :: Direct Java .............. SUCCESS
[03:25 min]
2017-06-21T21:50:08.183 [INFO] Apache Beam :: SDKs :: Java :: IO .................. SUCCESS
[  1.902 s]
2017-06-21T21:50:08.183 [INFO] Apache Beam :: SDKs :: Java :: IO :: Common ........ SUCCESS
[  5.062 s]
2017-06-21T21:50:08.183 [INFO] Apache Beam :: SDKs :: Java :: IO :: Cassandra ..... SUCCESS
[ 23.541 s]
2017-06-21T21:50:08.183 [INFO] Apache Beam :: SDKs :: Java :: IO :: Elasticsearch . SUCCESS
[ 33.155 s]
2017-06-21T21:50:08.183 [INFO] Apache Beam :: SDKs :: Java :: Extensions .......... SUCCESS
[  1.606 s]
2017-06-21T21:50:08.183 [INFO] Apache Beam :: SDKs :: Java :: Extensions :: Google Cloud Platform
Core SUCCESS [ 33.440 s]
2017-06-21T21:50:08.183 [INFO] Apache Beam :: SDKs :: Java :: Extensions :: Protobuf SUCCESS
[ 17.751 s]
2017-06-21T21:50:08.183 [INFO] Apache Beam :: SDKs :: Java :: IO :: Google Cloud Platform
SUCCESS [01:09 min]
2017-06-21T21:50:08.183 [INFO] Apache Beam :: SDKs :: Java :: IO :: Hadoop Common . SUCCESS
[ 19.187 s]
2017-06-21T21:50:08.183 [INFO] Apache Beam :: SDKs :: Java :: IO :: Hadoop File System SUCCESS
[ 33.651 s]
2017-06-21T21:50:08.183 [INFO] Apache Beam :: SDKs :: Java :: IO :: Hadoop ........ SUCCESS
[  4.280 s]
2017-06-21T21:50:08.183 [INFO] Apache Beam :: SDKs :: Java :: IO :: Hadoop :: input-format
SUCCESS [ 19.549 s]
2017-06-21T21:50:08.183 [INFO] Apache Beam :: Runners :: Google Cloud Dataflow .... SUCCESS
[04:58 min]
2017-06-21T21:50:08.183 [INFO] Apache Beam :: SDKs :: Java :: IO :: Hadoop :: jdk1.8-tests
SUCCESS [01:13 min]
2017-06-21T21:50:08.183 [INFO] Apache Beam :: SDKs :: Java :: IO :: HBase ......... SUCCESS
[ 57.960 s]
2017-06-21T21:50:08.184 [INFO] Apache Beam :: SDKs :: Java :: IO :: HCatalog ...... SUCCESS
[ 56.982 s]
2017-06-21T21:50:08.184 [INFO] Apache Beam :: SDKs :: Java :: IO :: JDBC .......... SUCCESS
[ 24.354 s]
2017-06-21T21:50:08.184 [INFO] Apache Beam :: SDKs :: Java :: IO :: JMS ........... SUCCESS
[ 19.708 s]
2017-06-21T21:50:08.184 [INFO] Apache Beam :: SDKs :: Java :: IO :: Kafka ......... SUCCESS
[ 23.507 s]
2017-06-21T21:50:08.184 [INFO] Apache Beam :: SDKs :: Java :: IO :: Kinesis ....... SUCCESS
[ 25.210 s]
2017-06-21T21:50:08.184 [INFO] Apache Beam :: SDKs :: Java :: IO :: MongoDB ....... SUCCESS
[ 38.479 s]
2017-06-21T21:50:08.184 [INFO] Apache Beam :: SDKs :: Java :: IO :: MQTT .......... SUCCESS
[ 29.929 s]
2017-06-21T21:50:08.184 [INFO] Apache Beam :: SDKs :: Java :: IO :: XML ........... SUCCESS
[ 44.337 s]
2017-06-21T21:50:08.184 [INFO] Apache Beam :: SDKs :: Java :: Maven Archetypes .... SUCCESS
[  1.916 s]
2017-06-21T21:50:08.184 [INFO] Apache Beam :: SDKs :: Java :: Maven Archetypes :: Starter
SUCCESS [ 14.092 s]
2017-06-21T21:50:08.184 [INFO] Apache Beam :: Examples ............................ SUCCESS
[  1.619 s]
2017-06-21T21:50:08.184 [INFO] Apache Beam :: Examples :: Java .................... SUCCESS
[05:34 min]
2017-06-21T21:50:08.184 [INFO] Apache Beam :: SDKs :: Java :: Maven Archetypes :: Examples
SUCCESS [ 49.367 s]
2017-06-21T21:50:08.184 [INFO] Apache Beam :: Examples :: Java 8 .................. SUCCESS
[ 27.920 s]
2017-06-21T21:50:08.184 [INFO] Apache Beam :: SDKs :: Java :: Maven Archetypes :: Examples
- Java 8 SUCCESS [ 49.911 s]
2017-06-21T21:50:08.184 [INFO] Apache Beam :: SDKs :: Java :: Extensions :: Jackson SUCCESS
[ 28.704 s]
2017-06-21T21:50:08.184 [INFO] Apache Beam :: SDKs :: Java :: Extensions :: Join library SUCCESS
[ 22.378 s]
2017-06-21T21:50:08.184 [INFO] Apache Beam :: SDKs :: Java :: Extensions :: Sorter  SUCCESS
[ 35.098 s]
2017-06-21T21:50:08.184 [INFO] Apache Beam :: SDKs :: Java :: Harness ............. SUCCESS
[ 43.527 s]
2017-06-21T21:50:08.184 [INFO] Apache Beam :: SDKs :: Java :: Java 8 Tests ........ SUCCESS
[ 14.840 s]
2017-06-21T21:50:08.184 [INFO] Apache Beam :: SDKs :: Python ...................... SUCCESS
[26:25 min]
2017-06-21T21:50:08.184 [INFO] Apache Beam :: Runners :: Flink .................... SUCCESS
[01:00 min]
2017-06-21T21:50:08.184 [INFO] Apache Beam :: Runners :: Spark .................... FAILURE
[  5.671 s]
2017-06-21T21:50:08.184 [INFO] Apache Beam :: Runners :: Apex ..................... SKIPPED
2017-06-21T21:50:08.184 [INFO] Apache Beam :: SDKs :: Java :: Aggregated Javadoc .. SKIPPED
2017-06-21T21:50:08.184 [INFO] ------------------------------------------------------------------------
2017-06-21T21:50:08.184 [INFO] BUILD FAILURE
2017-06-21T21:50:08.184 [INFO] ------------------------------------------------------------------------
2017-06-21T21:50:08.184 [INFO] Total time: 01:03 h
2017-06-21T21:50:08.184 [INFO] Finished at: 2017-06-21T21:50:08+00:00
2017-06-21T21:50:09.109 [INFO] Final Memory: 291M/1987M
2017-06-21T21:50:09.109 [INFO] ------------------------------------------------------------------------
Waiting for Jenkins to finish collecting data
2017-06-21T21:50:22.720 [ERROR] Failed to execute goal on project beam-runners-spark: Could
not resolve dependencies for project org.apache.beam:beam-runners-spark:jar:2.1.0-SNAPSHOT:
Could not transfer artifact org.apache.hadoop:hadoop-mapreduce-client-core:jar:2.2.0 from/to
central (https://repo.maven.apache.org/maven2): GET request of: org/apache/hadoop/hadoop-mapreduce-client-core/2.2.0/hadoop-mapreduce-client-core-2.2.0.jar
from central failed: Connection reset -> [Help 1]
org.apache.maven.lifecycle.LifecycleExecutionException: Failed to execute goal on project
beam-runners-spark: Could not resolve dependencies for project org.apache.beam:beam-runners-spark:jar:2.1.0-SNAPSHOT:
Could not transfer artifact org.apache.hadoop:hadoop-mapreduce-client-core:jar:2.2.0 from/to
central (https://repo.maven.apache.org/maven2): GET request of: org/apache/hadoop/hadoop-mapreduce-client-core/2.2.0/hadoop-mapreduce-client-core-2.2.0.jar
from central failed
	at org.apache.maven.lifecycle.internal.LifecycleDependencyResolver.getDependencies(LifecycleDependencyResolver.java:221)
	at org.apache.maven.lifecycle.internal.LifecycleDependencyResolver.resolveProjectDependencies(LifecycleDependencyResolver.java:127)
	at org.apache.maven.lifecycle.internal.MojoExecutor.ensureDependenciesAreResolved(MojoExecutor.java:257)
	at org.apache.maven.lifecycle.internal.MojoExecutor.execute(MojoExecutor.java:200)
	at org.apache.maven.lifecycle.internal.MojoExecutor.execute(MojoExecutor.java:153)
	at org.apache.maven.lifecycle.internal.MojoExecutor.execute(MojoExecutor.java:145)
	at org.apache.maven.lifecycle.internal.LifecycleModuleBuilder.buildProject(LifecycleModuleBuilder.java:116)
	at org.apache.maven.lifecycle.internal.LifecycleModuleBuilder.buildProject(LifecycleModuleBuilder.java:80)
	at org.apache.maven.lifecycle.internal.builder.singlethreaded.SingleThreadedBuilder.build(SingleThreadedBuilder.java:51)
	at org.apache.maven.lifecycle.internal.LifecycleStarter.execute(LifecycleStarter.java:128)
	at org.apache.maven.DefaultMaven.doExecute(DefaultMaven.java:307)
	at org.apache.maven.DefaultMaven.doExecute(DefaultMaven.java:193)
	at org.apache.maven.DefaultMaven.execute(DefaultMaven.java:106)
	at org.jvnet.hudson.maven3.launcher.Maven33Launcher.main(Maven33Launcher.java:129)
	at sun.reflect.NativeMethodAccessorImpl.invoke0(Native Method)
	at sun.reflect.NativeMethodAccessorImpl.invoke(NativeMethodAccessorImpl.java:62)
	at sun.reflect.DelegatingMethodAccessorImpl.invoke(DelegatingMethodAccessorImpl.java:43)
	at java.lang.reflect.Method.invoke(Method.java:498)
	at org.codehaus.plexus.classworlds.launcher.Launcher.launchStandard(Launcher.java:330)
	at org.codehaus.plexus.classworlds.launcher.Launcher.launch(Launcher.java:238)
	at jenkins.maven3.agent.Maven33Main.launch(Maven33Main.java:176)
	at sun.reflect.NativeMethodAccessorImpl.invoke0(Native Method)
	at sun.reflect.NativeMethodAccessorImpl.invoke(NativeMethodAccessorImpl.java:62)
	at sun.reflect.DelegatingMethodAccessorImpl.invoke(DelegatingMethodAccessorImpl.java:43)
	at java.lang.reflect.Method.invoke(Method.java:498)
	at hudson.maven.Maven3Builder.call(Maven3Builder.java:139)
	at hudson.maven.Maven3Builder.call(Maven3Builder.java:70)
	at hudson.remoting.UserRequest.perform(UserRequest.java:153)
	at hudson.remoting.UserRequest.perform(UserRequest.java:50)
	at hudson.remoting.Request$2.run(Request.java:336)
	at hudson.remoting.InterceptingExecutorService$1.call(InterceptingExecutorService.java:68)
	at java.util.concurrent.FutureTask.run(FutureTask.java:266)
	at java.util.concurrent.ThreadPoolExecutor.runWorker(ThreadPoolExecutor.java:1142)
	at java.util.concurrent.ThreadPoolExecutor$Worker.run(ThreadPoolExecutor.java:617)
	at java.lang.Thread.run(Thread.java:748)
Caused by: org.apache.maven.project.DependencyResolutionException: Could not resolve dependencies
for project org.apache.beam:beam-runners-spark:jar:2.1.0-SNAPSHOT: Could not transfer artifact
org.apache.hadoop:hadoop-mapreduce-client-core:jar:2.2.0 from/to central (https://repo.maven.apache.org/maven2):
GET request of: org/apache/hadoop/hadoop-mapreduce-client-core/2.2.0/hadoop-mapreduce-client-core-2.2.0.jar
from central failed
	at org.apache.maven.project.DefaultProjectDependenciesResolver.resolve(DefaultProjectDependenciesResolver.java:211)
	at org.apache.maven.lifecycle.internal.LifecycleDependencyResolver.getDependencies(LifecycleDependencyResolver.java:195)
	... 34 more
Caused by: org.eclipse.aether.resolution.DependencyResolutionException: Could not transfer
artifact org.apache.hadoop:hadoop-mapreduce-client-core:jar:2.2.0 from/to central (https://repo.maven.apache.org/maven2):
GET request of: org/apache/hadoop/hadoop-mapreduce-client-core/2.2.0/hadoop-mapreduce-client-core-2.2.0.jar
from central failed
	at org.eclipse.aether.internal.impl.DefaultRepositorySystem.resolveDependencies(DefaultRepositorySystem.java:384)
	at org.apache.maven.project.DefaultProjectDependenciesResolver.resolve(DefaultProjectDependenciesResolver.java:205)
	... 35 more
Caused by: org.eclipse.aether.resolution.ArtifactResolutionException: Could not transfer artifact
org.apache.hadoop:hadoop-mapreduce-client-core:jar:2.2.0 from/to central (https://repo.maven.apache.org/maven2):
GET request of: org/apache/hadoop/hadoop-mapreduce-client-core/2.2.0/hadoop-mapreduce-client-core-2.2.0.jar
from central failed
	at org.eclipse.aether.internal.impl.DefaultArtifactResolver.resolve(DefaultArtifactResolver.java:444)
	at org.eclipse.aether.internal.impl.DefaultArtifactResolver.resolveArtifacts(DefaultArtifactResolver.java:246)
	at org.eclipse.aether.internal.impl.DefaultRepositorySystem.resolveDependencies(DefaultRepositorySystem.java:367)
	... 36 more
Caused by: org.eclipse.aether.transfer.ArtifactTransferException: Could not transfer artifact
org.apache.hadoop:hadoop-mapreduce-client-core:jar:2.2.0 from/to central (https://repo.maven.apache.org/maven2):
GET request of: org/apache/hadoop/hadoop-mapreduce-client-core/2.2.0/hadoop-mapreduce-client-core-2.2.0.jar
from central failed
	at org.eclipse.aether.connector.basic.ArtifactTransportListener.transferFailed(ArtifactTransportListener.java:43)
	at org.eclipse.aether.connector.basic.BasicRepositoryConnector$TaskRunner.run(BasicRepositoryConnector.java:355)
	at org.eclipse.aether.util.concurrency.RunnableErrorForwarder$1.run(RunnableErrorForwarder.java:67)
	... 3 more
Caused by: org.apache.maven.wagon.TransferFailedException: GET request of: org/apache/hadoop/hadoop-mapreduce-client-core/2.2.0/hadoop-mapreduce-client-core-2.2.0.jar
from central failed
	at org.apache.maven.wagon.AbstractWagon.getTransfer(AbstractWagon.java:363)
	at org.apache.maven.wagon.AbstractWagon.getTransfer(AbstractWagon.java:316)
	at org.apache.maven.wagon.AbstractWagon.getTransfer(AbstractWagon.java:285)
	at org.apache.maven.wagon.StreamWagon.getIfNewer(StreamWagon.java:97)
	at org.apache.maven.wagon.StreamWagon.get(StreamWagon.java:61)
	at org.eclipse.aether.transport.wagon.WagonTransporter$GetTaskRunner.run(WagonTransporter.java:560)
	at org.eclipse.aether.transport.wagon.WagonTransporter.execute(WagonTransporter.java:427)
	at org.eclipse.aether.transport.wagon.WagonTransporter.get(WagonTransporter.java:404)
	at org.eclipse.aether.connector.basic.BasicRepositoryConnector$GetTaskRunner.runTask(BasicRepositoryConnector.java:447)
	at org.eclipse.aether.connector.basic.BasicRepositoryConnector$TaskRunner.run(BasicRepositoryConnector.java:350)
	... 4 more
Caused by: java.net.SocketException: Connection reset
	at java.net.SocketInputStream.read(SocketInputStream.java:210)
	at java.net.SocketInputStream.read(SocketInputStream.java:141)
	at sun.security.ssl.InputRecord.readFully(InputRecord.java:465)
	at sun.security.ssl.InputRecord.readV3Record(InputRecord.java:593)
	at sun.security.ssl.InputRecord.read(InputRecord.java:532)
	at sun.security.ssl.SSLSocketImpl.readRecord(SSLSocketImpl.java:973)
	at sun.security.ssl.SSLSocketImpl.readDataRecord(SSLSocketImpl.java:930)
	at sun.security.ssl.AppInputStream.read(AppInputStream.java:105)
	at org.apache.maven.wagon.providers.http.httpclient.impl.io.SessionInputBufferImpl.streamRead(SessionInputBufferImpl.java:136)
	at org.apache.maven.wagon.providers.http.httpclient.impl.io.SessionInputBufferImpl.read(SessionInputBufferImpl.java:195)
	at org.apache.maven.wagon.providers.http.httpclient.impl.io.ContentLengthInputStream.read(ContentLengthInputStream.java:178)
	at org.apache.maven.wagon.providers.http.httpclient.conn.EofSensorInputStream.read(EofSensorInputStream.java:137)
	at org.apache.maven.wagon.AbstractWagon.transfer(AbstractWagon.java:531)
	at org.apache.maven.wagon.AbstractWagon.getTransfer(AbstractWagon.java:353)
	... 13 more
2017-06-21T21:50:22.722 [ERROR] 
2017-06-21T21:50:22.722 [ERROR] Re-run Maven using the -X switch to enable full debug logging.
2017-06-21T21:50:22.722 [ERROR] 
2017-06-21T21:50:22.722 [ERROR] For more information about the errors and possible solutions,
please read the following articles:
2017-06-21T21:50:22.722 [ERROR] [Help 1] http://cwiki.apache.org/confluence/display/MAVEN/DependencyResolutionException
2017-06-21T21:50:22.722 [ERROR] 
2017-06-21T21:50:22.722 [ERROR] After correcting the problems, you can resume the build with
the command
2017-06-21T21:50:22.722 [ERROR]   mvn <goals> -rf :beam-runners-spark
channel stopped
Not sending mail to unregistered user github@nakomis.com

Mime
View raw message