beam-commits mailing list archives

Site index · List index
Message view « Date » · « Thread »
Top « Date » · « Thread »
From Apache Jenkins Server <jenk...@builds.apache.org>
Subject Build failed in Jenkins: beam_PostCommit_Java_MavenInstall #3983
Date Thu, 01 Jun 2017 19:12:00 GMT
See <https://builds.apache.org/job/beam_PostCommit_Java_MavenInstall/3983/display/redirect>

------------------------------------------
[...truncated 3.02 MB...]
test_visit_entire_graph (apache_beam.pipeline_test.PipelineTest) ... ok
test_simple (apache_beam.pipeline_test.RunnerApiTest)
Tests serializing, deserializing, and running a simple pipeline. ... ok
test_pvalue_expected_arguments (apache_beam.pvalue_test.PValueTest) ... ok
test_file_checksum_matchcer_invalid_sleep_time (apache_beam.testing.pipeline_verifiers_test.PipelineVerifiersTest)
... <https://builds.apache.org/job/beam_PostCommit_Java_MavenInstall/ws/sdks/python/apache_beam/testing/pipeline_verifiers_test.py>:129:
DeprecationWarning: BaseException.message has been deprecated as of Python 2.6
  self.assertEqual(cm.exception.message,
ok
test_file_checksum_matcher_read_failed (apache_beam.testing.pipeline_verifiers_test.PipelineVerifiersTest)
... ok
test_file_checksum_matcher_service_error (apache_beam.testing.pipeline_verifiers_test.PipelineVerifiersTest)
... ok
test_file_checksum_matcher_sleep_before_verify (apache_beam.testing.pipeline_verifiers_test.PipelineVerifiersTest)
... ok
test_file_checksum_matcher_success (apache_beam.testing.pipeline_verifiers_test.PipelineVerifiersTest)
... ok
test_pipeline_state_matcher_fails (apache_beam.testing.pipeline_verifiers_test.PipelineVerifiersTest)
Test PipelineStateMatcher fails when using default expected state ... ok
test_pipeline_state_matcher_given_state (apache_beam.testing.pipeline_verifiers_test.PipelineVerifiersTest)
Test PipelineStateMatcher successes when matches given state ... ok
test_pipeline_state_matcher_success (apache_beam.testing.pipeline_verifiers_test.PipelineVerifiersTest)
Test PipelineStateMatcher successes when using default expected state ... ok
test_append_extra_options (apache_beam.testing.test_pipeline_test.TestPipelineTest) ... ok
test_append_verifier_in_extra_opt (apache_beam.testing.test_pipeline_test.TestPipelineTest)
... ok
test_create_test_pipeline_options (apache_beam.testing.test_pipeline_test.TestPipelineTest)
... ok
test_empty_option_args_parsing (apache_beam.testing.test_pipeline_test.TestPipelineTest) ...
ok
test_get_option (apache_beam.testing.test_pipeline_test.TestPipelineTest) ... ok
test_option_args_parsing (apache_beam.testing.test_pipeline_test.TestPipelineTest) ... ok
test_skip_IT (apache_beam.testing.test_pipeline_test.TestPipelineTest) ... SKIP: IT is skipped
because --test-pipeline-options is not specified
test_basic_test_stream (apache_beam.testing.test_stream_test.TestStreamTest) ... ok
test_test_stream_errors (apache_beam.testing.test_stream_test.TestStreamTest) ... ok
test_assert_that_fails (apache_beam.testing.util_test.UtilTest) ... ok
test_assert_that_fails_on_empty_expected (apache_beam.testing.util_test.UtilTest) ... ok
test_assert_that_fails_on_empty_input (apache_beam.testing.util_test.UtilTest) ... ok
test_assert_that_passes (apache_beam.testing.util_test.UtilTest) ... ok

----------------------------------------------------------------------
Ran 1185 tests in 315.314s

OK (skipped=17)
___________________________________ summary ____________________________________
  docs: commands succeeded
ERROR:   lint: commands failed
  py27: commands succeeded
  py27cython: commands succeeded
  py27gcp: commands succeeded
2017-06-01T19:10:57.787 [ERROR] Command execution failed.
org.apache.commons.exec.ExecuteException: Process exited with an error: 1 (Exit value: 1)
	at org.apache.commons.exec.DefaultExecutor.executeInternal(DefaultExecutor.java:404)
	at org.apache.commons.exec.DefaultExecutor.execute(DefaultExecutor.java:166)
	at org.codehaus.mojo.exec.ExecMojo.executeCommandLine(ExecMojo.java:764)
	at org.codehaus.mojo.exec.ExecMojo.executeCommandLine(ExecMojo.java:711)
	at org.codehaus.mojo.exec.ExecMojo.execute(ExecMojo.java:289)
	at org.apache.maven.plugin.DefaultBuildPluginManager.executeMojo(DefaultBuildPluginManager.java:134)
	at org.apache.maven.lifecycle.internal.MojoExecutor.execute(MojoExecutor.java:208)
	at org.apache.maven.lifecycle.internal.MojoExecutor.execute(MojoExecutor.java:153)
	at org.apache.maven.lifecycle.internal.MojoExecutor.execute(MojoExecutor.java:145)
	at org.apache.maven.lifecycle.internal.LifecycleModuleBuilder.buildProject(LifecycleModuleBuilder.java:116)
	at org.apache.maven.lifecycle.internal.LifecycleModuleBuilder.buildProject(LifecycleModuleBuilder.java:80)
	at org.apache.maven.lifecycle.internal.builder.singlethreaded.SingleThreadedBuilder.build(SingleThreadedBuilder.java:51)
	at org.apache.maven.lifecycle.internal.LifecycleStarter.execute(LifecycleStarter.java:128)
	at org.apache.maven.DefaultMaven.doExecute(DefaultMaven.java:307)
	at org.apache.maven.DefaultMaven.doExecute(DefaultMaven.java:193)
	at org.apache.maven.DefaultMaven.execute(DefaultMaven.java:106)
	at org.jvnet.hudson.maven3.launcher.Maven33Launcher.main(Maven33Launcher.java:129)
	at sun.reflect.NativeMethodAccessorImpl.invoke0(Native Method)
	at sun.reflect.NativeMethodAccessorImpl.invoke(NativeMethodAccessorImpl.java:62)
	at sun.reflect.DelegatingMethodAccessorImpl.invoke(DelegatingMethodAccessorImpl.java:43)
	at java.lang.reflect.Method.invoke(Method.java:498)
	at org.codehaus.plexus.classworlds.launcher.Launcher.launchStandard(Launcher.java:330)
	at org.codehaus.plexus.classworlds.launcher.Launcher.launch(Launcher.java:238)
	at jenkins.maven3.agent.Maven33Main.launch(Maven33Main.java:176)
	at sun.reflect.NativeMethodAccessorImpl.invoke0(Native Method)
	at sun.reflect.NativeMethodAccessorImpl.invoke(NativeMethodAccessorImpl.java:62)
	at sun.reflect.DelegatingMethodAccessorImpl.invoke(DelegatingMethodAccessorImpl.java:43)
	at java.lang.reflect.Method.invoke(Method.java:498)
	at hudson.maven.Maven3Builder.call(Maven3Builder.java:139)
	at hudson.maven.Maven3Builder.call(Maven3Builder.java:70)
	at hudson.remoting.UserRequest.perform(UserRequest.java:153)
	at hudson.remoting.UserRequest.perform(UserRequest.java:50)
	at hudson.remoting.Request$2.run(Request.java:336)
	at hudson.remoting.InterceptingExecutorService$1.call(InterceptingExecutorService.java:68)
	at java.util.concurrent.FutureTask.run(FutureTask.java:266)
	at java.util.concurrent.ThreadPoolExecutor.runWorker(ThreadPoolExecutor.java:1142)
	at java.util.concurrent.ThreadPoolExecutor$Worker.run(ThreadPoolExecutor.java:617)
	at java.lang.Thread.run(Thread.java:745)
[JENKINS] Archiving disabled
2017-06-01T19:10:58.491 [INFO]                                                           
             
2017-06-01T19:10:58.491 [INFO] ------------------------------------------------------------------------
2017-06-01T19:10:58.491 [INFO] Skipping Apache Beam :: Parent
2017-06-01T19:10:58.491 [INFO] This project has been banned from the build due to previous
failures.
2017-06-01T19:10:58.491 [INFO] ------------------------------------------------------------------------
[JENKINS] Archiving disabled
[JENKINS] Archiving disabled
[JENKINS] Archiving disabled
[JENKINS] Archiving disabled
[JENKINS] Archiving disabled
[JENKINS] Archiving disabled
[JENKINS] Archiving disabled
[JENKINS] Archiving disabled
[JENKINS] Archiving disabled
[JENKINS] Archiving disabled
[JENKINS] Archiving disabled
[JENKINS] Archiving disabled
[JENKINS] Archiving disabled
[JENKINS] Archiving disabled
[JENKINS] Archiving disabled
[JENKINS] Archiving disabled
[JENKINS] Archiving disabled
[JENKINS] Archiving disabled
[JENKINS] Archiving disabled
[JENKINS] Archiving disabled
[JENKINS] Archiving disabled
[JENKINS] Archiving disabled
[JENKINS] Archiving disabled
[JENKINS] Archiving disabled
[JENKINS] Archiving disabled
[JENKINS] Archiving disabled
[JENKINS] Archiving disabled
[JENKINS] Archiving disabled
[JENKINS] Archiving disabled
[JENKINS] Archiving disabled
[JENKINS] Archiving disabled
[JENKINS] Archiving disabled
[JENKINS] Archiving disabled
[JENKINS] Archiving disabled
[JENKINS] Archiving disabled
[JENKINS] Archiving disabled
[JENKINS] Archiving disabled
[JENKINS] Archiving disabled
[JENKINS] Archiving disabled
[JENKINS] Archiving disabled
[JENKINS] Archiving disabled
[JENKINS] Archiving disabled
[JENKINS] Archiving disabled
[JENKINS] Archiving disabled
[JENKINS] Archiving disabled
[JENKINS] Archiving disabled
2017-06-01T19:11:19.424 [INFO] ------------------------------------------------------------------------
2017-06-01T19:11:19.424 [INFO] Reactor Summary:
2017-06-01T19:11:19.424 [INFO] 
2017-06-01T19:11:19.424 [INFO] Apache Beam :: Parent .............................. SUCCESS
[ 32.847 s]
2017-06-01T19:11:19.424 [INFO] Apache Beam :: SDKs :: Java :: Build Tools ......... SUCCESS
[ 10.106 s]
2017-06-01T19:11:19.424 [INFO] Apache Beam :: SDKs ................................ SUCCESS
[  4.652 s]
2017-06-01T19:11:19.424 [INFO] Apache Beam :: SDKs :: Common ...................... SUCCESS
[  1.715 s]
2017-06-01T19:11:19.424 [INFO] Apache Beam :: SDKs :: Common :: Fn API ............ SUCCESS
[ 21.931 s]
2017-06-01T19:11:19.424 [INFO] Apache Beam :: SDKs :: Common :: Runner API ........ SUCCESS
[ 21.310 s]
2017-06-01T19:11:19.424 [INFO] Apache Beam :: SDKs :: Java ........................ SUCCESS
[  3.566 s]
2017-06-01T19:11:19.425 [INFO] Apache Beam :: SDKs :: Java :: Core ................ SUCCESS
[02:35 min]
2017-06-01T19:11:19.425 [INFO] Apache Beam :: SDKs :: Java :: IO .................. SUCCESS
[  1.767 s]
2017-06-01T19:11:19.425 [INFO] Apache Beam :: SDKs :: Java :: IO :: Common ........ SUCCESS
[  4.615 s]
2017-06-01T19:11:19.425 [INFO] Apache Beam :: Runners ............................. SUCCESS
[  1.821 s]
2017-06-01T19:11:19.425 [INFO] Apache Beam :: Runners :: Core Construction Java ... SUCCESS
[ 33.623 s]
2017-06-01T19:11:19.425 [INFO] Apache Beam :: Runners :: Core Java ................ SUCCESS
[ 53.189 s]
2017-06-01T19:11:19.425 [INFO] Apache Beam :: Runners :: Direct Java .............. SUCCESS
[03:02 min]
2017-06-01T19:11:19.425 [INFO] Apache Beam :: SDKs :: Java :: IO :: Elasticsearch . SUCCESS
[ 37.726 s]
2017-06-01T19:11:19.425 [INFO] Apache Beam :: SDKs :: Java :: Extensions .......... SUCCESS
[  2.362 s]
2017-06-01T19:11:19.425 [INFO] Apache Beam :: SDKs :: Java :: Extensions :: Google Cloud Platform
Core SUCCESS [ 49.310 s]
2017-06-01T19:11:19.425 [INFO] Apache Beam :: SDKs :: Java :: Extensions :: Protobuf SUCCESS
[ 26.309 s]
2017-06-01T19:11:19.425 [INFO] Apache Beam :: SDKs :: Java :: IO :: Google Cloud Platform
SUCCESS [01:24 min]
2017-06-01T19:11:19.425 [INFO] Apache Beam :: SDKs :: Java :: IO :: Hadoop Common . SUCCESS
[ 21.400 s]
2017-06-01T19:11:19.425 [INFO] Apache Beam :: SDKs :: Java :: IO :: Hadoop File System SUCCESS
[ 30.770 s]
2017-06-01T19:11:19.425 [INFO] Apache Beam :: SDKs :: Java :: IO :: Hadoop ........ SUCCESS
[  4.204 s]
2017-06-01T19:11:19.425 [INFO] Apache Beam :: SDKs :: Java :: IO :: Hadoop :: input-format
SUCCESS [ 17.778 s]
2017-06-01T19:11:19.425 [INFO] Apache Beam :: Runners :: Google Cloud Dataflow .... SUCCESS
[06:44 min]
2017-06-01T19:11:19.425 [INFO] Apache Beam :: SDKs :: Java :: IO :: Hadoop :: jdk1.8-tests
SUCCESS [01:37 min]
2017-06-01T19:11:19.425 [INFO] Apache Beam :: SDKs :: Java :: IO :: HBase ......... SUCCESS
[01:24 min]
2017-06-01T19:11:19.425 [INFO] Apache Beam :: SDKs :: Java :: IO :: JDBC .......... SUCCESS
[ 36.679 s]
2017-06-01T19:11:19.425 [INFO] Apache Beam :: SDKs :: Java :: IO :: JMS ........... SUCCESS
[ 35.464 s]
2017-06-01T19:11:19.425 [INFO] Apache Beam :: SDKs :: Java :: IO :: Kafka ......... SUCCESS
[ 31.945 s]
2017-06-01T19:11:19.425 [INFO] Apache Beam :: SDKs :: Java :: IO :: Kinesis ....... SUCCESS
[ 38.505 s]
2017-06-01T19:11:19.425 [INFO] Apache Beam :: SDKs :: Java :: IO :: MongoDB ....... SUCCESS
[ 49.607 s]
2017-06-01T19:11:19.425 [INFO] Apache Beam :: SDKs :: Java :: IO :: MQTT .......... SUCCESS
[ 33.816 s]
2017-06-01T19:11:19.425 [INFO] Apache Beam :: SDKs :: Java :: IO :: XML ........... SUCCESS
[ 42.161 s]
2017-06-01T19:11:19.425 [INFO] Apache Beam :: SDKs :: Java :: Maven Archetypes .... SUCCESS
[  2.964 s]
2017-06-01T19:11:19.425 [INFO] Apache Beam :: SDKs :: Java :: Maven Archetypes :: Starter
SUCCESS [ 21.856 s]
2017-06-01T19:11:19.425 [INFO] Apache Beam :: Examples ............................ SUCCESS
[  3.715 s]
2017-06-01T19:11:19.425 [INFO] Apache Beam :: Examples :: Java .................... SUCCESS
[09:30 min]
2017-06-01T19:11:19.425 [INFO] Apache Beam :: SDKs :: Java :: Maven Archetypes :: Examples
SUCCESS [ 49.941 s]
2017-06-01T19:11:19.425 [INFO] Apache Beam :: Examples :: Java 8 .................. SUCCESS
[ 26.441 s]
2017-06-01T19:11:19.425 [INFO] Apache Beam :: SDKs :: Java :: Maven Archetypes :: Examples
- Java 8 SUCCESS [ 50.841 s]
2017-06-01T19:11:19.425 [INFO] Apache Beam :: SDKs :: Java :: Extensions :: Jackson SUCCESS
[ 25.055 s]
2017-06-01T19:11:19.426 [INFO] Apache Beam :: SDKs :: Java :: Extensions :: Join library SUCCESS
[ 31.882 s]
2017-06-01T19:11:19.426 [INFO] Apache Beam :: SDKs :: Java :: Extensions :: Sorter  SUCCESS
[ 54.204 s]
2017-06-01T19:11:19.426 [INFO] Apache Beam :: SDKs :: Java :: Harness ............. SUCCESS
[ 46.472 s]
2017-06-01T19:11:19.426 [INFO] Apache Beam :: SDKs :: Java :: Java 8 Tests ........ SUCCESS
[ 16.835 s]
2017-06-01T19:11:19.426 [INFO] Apache Beam :: SDKs :: Python ...................... FAILURE
[24:49 min]
2017-06-01T19:11:19.426 [INFO] Apache Beam :: Runners :: Flink .................... SKIPPED
2017-06-01T19:11:19.426 [INFO] Apache Beam :: Runners :: Spark .................... SKIPPED
2017-06-01T19:11:19.426 [INFO] Apache Beam :: Runners :: Apex ..................... SKIPPED
2017-06-01T19:11:19.426 [INFO] Apache Beam :: SDKs :: Java :: Aggregated Javadoc .. SKIPPED
2017-06-01T19:11:19.426 [INFO] ------------------------------------------------------------------------
2017-06-01T19:11:19.426 [INFO] BUILD FAILURE
2017-06-01T19:11:19.426 [INFO] ------------------------------------------------------------------------
2017-06-01T19:11:19.426 [INFO] Total time: 01:09 h
2017-06-01T19:11:19.426 [INFO] Finished at: 2017-06-01T19:11:19+00:00
2017-06-01T19:11:20.894 [INFO] Final Memory: 244M/2072M
2017-06-01T19:11:20.894 [INFO] ------------------------------------------------------------------------
Waiting for Jenkins to finish collecting data
2017-06-01T19:11:52.103 [ERROR] Failed to execute goal org.codehaus.mojo:exec-maven-plugin:1.5.0:exec
(setuptools-test) on project beam-sdks-python: Command execution failed. Process exited with
an error: 1 (Exit value: 1) -> [Help 1]
org.apache.maven.lifecycle.LifecycleExecutionException: Failed to execute goal org.codehaus.mojo:exec-maven-plugin:1.5.0:exec
(setuptools-test) on project beam-sdks-python: Command execution failed.
	at org.apache.maven.lifecycle.internal.MojoExecutor.execute(MojoExecutor.java:216)
	at org.apache.maven.lifecycle.internal.MojoExecutor.execute(MojoExecutor.java:153)
	at org.apache.maven.lifecycle.internal.MojoExecutor.execute(MojoExecutor.java:145)
	at org.apache.maven.lifecycle.internal.LifecycleModuleBuilder.buildProject(LifecycleModuleBuilder.java:116)
	at org.apache.maven.lifecycle.internal.LifecycleModuleBuilder.buildProject(LifecycleModuleBuilder.java:80)
	at org.apache.maven.lifecycle.internal.builder.singlethreaded.SingleThreadedBuilder.build(SingleThreadedBuilder.java:51)
	at org.apache.maven.lifecycle.internal.LifecycleStarter.execute(LifecycleStarter.java:128)
	at org.apache.maven.DefaultMaven.doExecute(DefaultMaven.java:307)
	at org.apache.maven.DefaultMaven.doExecute(DefaultMaven.java:193)
	at org.apache.maven.DefaultMaven.execute(DefaultMaven.java:106)
	at org.jvnet.hudson.maven3.launcher.Maven33Launcher.main(Maven33Launcher.java:129)
	at sun.reflect.NativeMethodAccessorImpl.invoke0(Native Method)
	at sun.reflect.NativeMethodAccessorImpl.invoke(NativeMethodAccessorImpl.java:62)
	at sun.reflect.DelegatingMethodAccessorImpl.invoke(DelegatingMethodAccessorImpl.java:43)
	at java.lang.reflect.Method.invoke(Method.java:498)
	at org.codehaus.plexus.classworlds.launcher.Launcher.launchStandard(Launcher.java:330)
	at org.codehaus.plexus.classworlds.launcher.Launcher.launch(Launcher.java:238)
	at jenkins.maven3.agent.Maven33Main.launch(Maven33Main.java:176)
	at sun.reflect.NativeMethodAccessorImpl.invoke0(Native Method)
	at sun.reflect.NativeMethodAccessorImpl.invoke(NativeMethodAccessorImpl.java:62)
	at sun.reflect.DelegatingMethodAccessorImpl.invoke(DelegatingMethodAccessorImpl.java:43)
	at java.lang.reflect.Method.invoke(Method.java:498)
	at hudson.maven.Maven3Builder.call(Maven3Builder.java:139)
	at hudson.maven.Maven3Builder.call(Maven3Builder.java:70)
	at hudson.remoting.UserRequest.perform(UserRequest.java:153)
	at hudson.remoting.UserRequest.perform(UserRequest.java:50)
	at hudson.remoting.Request$2.run(Request.java:336)
	at hudson.remoting.InterceptingExecutorService$1.call(InterceptingExecutorService.java:68)
	at java.util.concurrent.FutureTask.run(FutureTask.java:266)
	at java.util.concurrent.ThreadPoolExecutor.runWorker(ThreadPoolExecutor.java:1142)
	at java.util.concurrent.ThreadPoolExecutor$Worker.run(ThreadPoolExecutor.java:617)
	at java.lang.Thread.run(Thread.java:745)
Caused by: org.apache.maven.plugin.MojoExecutionException: Command execution failed.
	at org.codehaus.mojo.exec.ExecMojo.execute(ExecMojo.java:302)
	at org.apache.maven.plugin.DefaultBuildPluginManager.executeMojo(DefaultBuildPluginManager.java:134)
	at org.apache.maven.lifecycle.internal.MojoExecutor.execute(MojoExecutor.java:208)
	... 31 more
Caused by: org.apache.commons.exec.ExecuteException: Process exited with an error: 1 (Exit
value: 1)
	at org.apache.commons.exec.DefaultExecutor.executeInternal(DefaultExecutor.java:404)
	at org.apache.commons.exec.DefaultExecutor.execute(DefaultExecutor.java:166)
	at org.codehaus.mojo.exec.ExecMojo.executeCommandLine(ExecMojo.java:764)
	at org.codehaus.mojo.exec.ExecMojo.executeCommandLine(ExecMojo.java:711)
	at org.codehaus.mojo.exec.ExecMojo.execute(ExecMojo.java:289)
	... 33 more
2017-06-01T19:11:52.109 [ERROR] 
2017-06-01T19:11:52.109 [ERROR] Re-run Maven using the -X switch to enable full debug logging.
2017-06-01T19:11:52.109 [ERROR] 
2017-06-01T19:11:52.109 [ERROR] For more information about the errors and possible solutions,
please read the following articles:
2017-06-01T19:11:52.109 [ERROR] [Help 1] http://cwiki.apache.org/confluence/display/MAVEN/MojoExecutionException
2017-06-01T19:11:52.110 [ERROR] 
2017-06-01T19:11:52.110 [ERROR] After correcting the problems, you can resume the build with
the command
2017-06-01T19:11:52.110 [ERROR]   mvn <goals> -rf :beam-sdks-python
channel stopped

Mime
View raw message