beam-commits mailing list archives

Site index · List index
Message view « Date » · « Thread »
Top « Date » · « Thread »
From Apache Jenkins Server <jenk...@builds.apache.org>
Subject Build failed in Jenkins: beam_PostCommit_Java_MavenInstall_Windows #150
Date Mon, 19 Jun 2017 00:34:49 GMT
See <https://builds.apache.org/job/beam_PostCommit_Java_MavenInstall_Windows/150/display/redirect>

------------------------------------------
[...truncated 2.65 MB...]
2017-06-19T00:33:19.331 [INFO] Downloading: https://repo.maven.apache.org/maven2/org/sonatype/gossip/gossip/1.8/gossip-1.8.pom
2017-06-19T00:33:19.341 [INFO] Downloaded: https://repo.maven.apache.org/maven2/org/sonatype/gossip/gossip/1.8/gossip-1.8.pom
(12 KB at 1125.6 KB/sec)
2017-06-19T00:33:19.345 [INFO] Downloading: https://repo.maven.apache.org/maven2/org/sonatype/forge/forge-parent/9/forge-parent-9.pom
2017-06-19T00:33:19.355 [INFO] Downloaded: https://repo.maven.apache.org/maven2/org/sonatype/forge/forge-parent/9/forge-parent-9.pom
(13 KB at 1283.4 KB/sec)
2017-06-19T00:33:19.359 [INFO] Downloading: https://repo.maven.apache.org/maven2/org/sonatype/gossip/gossip-core/1.8/gossip-core-1.8.pom
2017-06-19T00:33:19.368 [INFO] Downloaded: https://repo.maven.apache.org/maven2/org/sonatype/gossip/gossip-core/1.8/gossip-core-1.8.pom
(3 KB at 241.4 KB/sec)
2017-06-19T00:33:19.372 [INFO] Downloading: https://repo.maven.apache.org/maven2/org/sonatype/gossip/gossip-bootstrap/1.8/gossip-bootstrap-1.8.pom
2017-06-19T00:33:19.381 [INFO] Downloaded: https://repo.maven.apache.org/maven2/org/sonatype/gossip/gossip-bootstrap/1.8/gossip-bootstrap-1.8.pom
(2 KB at 174.8 KB/sec)
2017-06-19T00:33:19.385 [INFO] Downloading: https://repo.maven.apache.org/maven2/com/google/guava/guava/14.0.1/guava-14.0.1.pom
2017-06-19T00:33:19.393 [INFO] Downloaded: https://repo.maven.apache.org/maven2/com/google/guava/guava/14.0.1/guava-14.0.1.pom
(6 KB at 656.2 KB/sec)
2017-06-19T00:33:19.397 [INFO] Downloading: https://repo.maven.apache.org/maven2/com/google/guava/guava-parent/14.0.1/guava-parent-14.0.1.pom
2017-06-19T00:33:19.404 [INFO] Downloaded: https://repo.maven.apache.org/maven2/com/google/guava/guava-parent/14.0.1/guava-parent-14.0.1.pom
(3 KB at 356.4 KB/sec)
2017-06-19T00:33:19.409 [INFO] Downloading: https://repo.maven.apache.org/maven2/org/codehaus/plexus/plexus-classworlds/2.4.2/plexus-classworlds-2.4.2.pom
2017-06-19T00:33:19.416 [INFO] Downloaded: https://repo.maven.apache.org/maven2/org/codehaus/plexus/plexus-classworlds/2.4.2/plexus-classworlds-2.4.2.pom
(4 KB at 489.5 KB/sec)
2017-06-19T00:33:19.421 [INFO] Downloading: https://repo.maven.apache.org/maven2/org/codehaus/plexus/plexus-interpolation/1.16/plexus-interpolation-1.16.pom
2017-06-19T00:33:19.428 [INFO] Downloaded: https://repo.maven.apache.org/maven2/org/codehaus/plexus/plexus-interpolation/1.16/plexus-interpolation-1.16.pom
(2 KB at 143.3 KB/sec)
2017-06-19T00:33:19.432 [INFO] Downloading: https://repo.maven.apache.org/maven2/org/eclipse/aether/aether-api/0.9.0.M2/aether-api-0.9.0.M2.pom
2017-06-19T00:33:19.440 [INFO] Downloaded: https://repo.maven.apache.org/maven2/org/eclipse/aether/aether-api/0.9.0.M2/aether-api-0.9.0.M2.pom
(2 KB at 212.0 KB/sec)
2017-06-19T00:33:19.445 [INFO] Downloading: https://repo.maven.apache.org/maven2/org/codehaus/gmaven/gmaven-adapter-api/2.0/gmaven-adapter-api-2.0.pom
2017-06-19T00:33:19.452 [INFO] Downloaded: https://repo.maven.apache.org/maven2/org/codehaus/gmaven/gmaven-adapter-api/2.0/gmaven-adapter-api-2.0.pom
(2 KB at 252.0 KB/sec)
2017-06-19T00:33:19.457 [INFO] Downloading: https://repo.maven.apache.org/maven2/org/codehaus/gmaven/gmaven-adapter-impl/2.0/gmaven-adapter-impl-2.0.pom
2017-06-19T00:33:19.465 [INFO] Downloaded: https://repo.maven.apache.org/maven2/org/codehaus/gmaven/gmaven-adapter-impl/2.0/gmaven-adapter-impl-2.0.pom
(3 KB at 331.8 KB/sec)
2017-06-19T00:33:19.470 [INFO] Downloading: https://repo.maven.apache.org/maven2/org/codehaus/groovy/groovy-all/2.1.5/groovy-all-2.1.5.pom
2017-06-19T00:33:19.483 [INFO] Downloaded: https://repo.maven.apache.org/maven2/org/codehaus/groovy/groovy-all/2.1.5/groovy-all-2.1.5.pom
(18 KB at 1355.1 KB/sec)
2017-06-19T00:33:19.487 [INFO] Downloading: https://repo.maven.apache.org/maven2/org/apache/ant/ant/1.8.4/ant-1.8.4.pom
2017-06-19T00:33:19.496 [INFO] Downloaded: https://repo.maven.apache.org/maven2/org/apache/ant/ant/1.8.4/ant-1.8.4.pom
(10 KB at 1047.5 KB/sec)
2017-06-19T00:33:19.500 [INFO] Downloading: https://repo.maven.apache.org/maven2/org/apache/ant/ant-parent/1.8.4/ant-parent-1.8.4.pom
2017-06-19T00:33:19.508 [INFO] Downloaded: https://repo.maven.apache.org/maven2/org/apache/ant/ant-parent/1.8.4/ant-parent-1.8.4.pom
(5 KB at 556.8 KB/sec)
2017-06-19T00:33:19.512 [INFO] Downloading: https://repo.maven.apache.org/maven2/org/apache/ant/ant-launcher/1.8.4/ant-launcher-1.8.4.pom
2017-06-19T00:33:19.520 [INFO] Downloaded: https://repo.maven.apache.org/maven2/org/apache/ant/ant-launcher/1.8.4/ant-launcher-1.8.4.pom
(3 KB at 288.2 KB/sec)
2017-06-19T00:33:19.524 [INFO] Downloading: https://repo.maven.apache.org/maven2/org/fusesource/jansi/jansi/1.11/jansi-1.11.pom
2017-06-19T00:33:19.535 [INFO] Downloaded: https://repo.maven.apache.org/maven2/org/fusesource/jansi/jansi/1.11/jansi-1.11.pom
(4 KB at 319.7 KB/sec)
2017-06-19T00:33:19.539 [INFO] Downloading: https://repo.maven.apache.org/maven2/org/fusesource/jansi/jansi-project/1.11/jansi-project-1.11.pom
2017-06-19T00:33:19.547 [INFO] Downloaded: https://repo.maven.apache.org/maven2/org/fusesource/jansi/jansi-project/1.11/jansi-project-1.11.pom
(12 KB at 1397.3 KB/sec)
2017-06-19T00:33:19.551 [INFO] Downloading: https://repo.maven.apache.org/maven2/org/fusesource/fusesource-pom/1.8/fusesource-pom-1.8.pom
2017-06-19T00:33:19.559 [INFO] Downloaded: https://repo.maven.apache.org/maven2/org/fusesource/fusesource-pom/1.8/fusesource-pom-1.8.pom
(15 KB at 1788.9 KB/sec)
2017-06-19T00:33:19.574 [INFO] Downloading: https://repo.maven.apache.org/maven2/org/sonatype/gossip/gossip-slf4j/1.8/gossip-slf4j-1.8.jar
2017-06-19T00:33:19.574 [INFO] Downloading: https://repo.maven.apache.org/maven2/org/sonatype/gossip/gossip-bootstrap/1.8/gossip-bootstrap-1.8.jar
2017-06-19T00:33:19.574 [INFO] Downloading: https://repo.maven.apache.org/maven2/com/google/guava/guava/14.0.1/guava-14.0.1.jar
2017-06-19T00:33:19.574 [INFO] Downloading: https://repo.maven.apache.org/maven2/org/sonatype/gossip/gossip-core/1.8/gossip-core-1.8.jar
2017-06-19T00:33:19.575 [INFO] Downloading: https://repo.maven.apache.org/maven2/org/codehaus/plexus/plexus-classworlds/2.4.2/plexus-classworlds-2.4.2.jar
2017-06-19T00:33:19.588 [INFO] Downloaded: https://repo.maven.apache.org/maven2/org/sonatype/gossip/gossip-slf4j/1.8/gossip-slf4j-1.8.jar
(5 KB at 275.2 KB/sec)
2017-06-19T00:33:19.588 [INFO] Downloading: https://repo.maven.apache.org/maven2/org/codehaus/plexus/plexus-interpolation/1.16/plexus-interpolation-1.16.jar
2017-06-19T00:33:19.596 [INFO] Downloaded: https://repo.maven.apache.org/maven2/org/sonatype/gossip/gossip-bootstrap/1.8/gossip-bootstrap-1.8.jar
(20 KB at 838.9 KB/sec)
2017-06-19T00:33:19.596 [INFO] Downloading: https://repo.maven.apache.org/maven2/org/eclipse/aether/aether-api/0.9.0.M2/aether-api-0.9.0.M2.jar
2017-06-19T00:33:19.597 [INFO] Downloaded: https://repo.maven.apache.org/maven2/org/sonatype/gossip/gossip-core/1.8/gossip-core-1.8.jar
(57 KB at 2352.5 KB/sec)
2017-06-19T00:33:19.597 [INFO] Downloading: https://repo.maven.apache.org/maven2/org/codehaus/gmaven/gmaven-adapter-api/2.0/gmaven-adapter-api-2.0.jar
2017-06-19T00:33:19.598 [INFO] Downloaded: https://repo.maven.apache.org/maven2/org/codehaus/plexus/plexus-classworlds/2.4.2/plexus-classworlds-2.4.2.jar
(46 KB at 1911.2 KB/sec)
2017-06-19T00:33:19.598 [INFO] Downloading: https://repo.maven.apache.org/maven2/org/codehaus/gmaven/gmaven-adapter-impl/2.0/gmaven-adapter-impl-2.0.jar
2017-06-19T00:33:19.608 [INFO] Downloaded: https://repo.maven.apache.org/maven2/org/codehaus/plexus/plexus-interpolation/1.16/plexus-interpolation-1.16.jar
(60 KB at 1760.9 KB/sec)
2017-06-19T00:33:19.608 [INFO] Downloading: https://repo.maven.apache.org/maven2/org/codehaus/groovy/groovy-all/2.1.5/groovy-all-2.1.5.jar
2017-06-19T00:33:19.612 [INFO] Downloaded: https://repo.maven.apache.org/maven2/org/codehaus/gmaven/gmaven-adapter-impl/2.0/gmaven-adapter-impl-2.0.jar
(16 KB at 426.8 KB/sec)
2017-06-19T00:33:19.612 [INFO] Downloading: https://repo.maven.apache.org/maven2/org/apache/ant/ant/1.8.4/ant-1.8.4.jar
2017-06-19T00:33:19.612 [INFO] Downloaded: https://repo.maven.apache.org/maven2/org/codehaus/gmaven/gmaven-adapter-api/2.0/gmaven-adapter-api-2.0.jar
(7 KB at 181.9 KB/sec)
2017-06-19T00:33:19.612 [INFO] Downloading: https://repo.maven.apache.org/maven2/org/apache/ant/ant-launcher/1.8.4/ant-launcher-1.8.4.jar
2017-06-19T00:33:19.632 [INFO] Downloaded: https://repo.maven.apache.org/maven2/org/eclipse/aether/aether-api/0.9.0.M2/aether-api-0.9.0.M2.jar
(131 KB at 2255.5 KB/sec)
2017-06-19T00:33:19.632 [INFO] Downloading: https://repo.maven.apache.org/maven2/org/fusesource/jansi/jansi/1.11/jansi-1.11.jar
2017-06-19T00:33:19.636 [INFO] Downloaded: https://repo.maven.apache.org/maven2/org/apache/ant/ant-launcher/1.8.4/ant-launcher-1.8.4.jar
(18 KB at 290.3 KB/sec)
2017-06-19T00:33:19.654 [INFO] Downloaded: https://repo.maven.apache.org/maven2/org/fusesource/jansi/jansi/1.11/jansi-1.11.jar
(112 KB at 1396.7 KB/sec)
2017-06-19T00:33:19.861 [INFO] Downloaded: https://repo.maven.apache.org/maven2/org/apache/ant/ant/1.8.4/ant-1.8.4.jar
(1897 KB at 6630.1 KB/sec)
2017-06-19T00:33:19.907 [INFO] Downloaded: https://repo.maven.apache.org/maven2/com/google/guava/guava/14.0.1/guava-14.0.1.jar
(2138 KB at 6400.6 KB/sec)
2017-06-19T00:33:20.258 [INFO] Downloaded: https://repo.maven.apache.org/maven2/org/codehaus/groovy/groovy-all/2.1.5/groovy-all-2.1.5.jar
(6219 KB at 9091.0 KB/sec)
[JENKINS] Archiving disabled
2017-06-19T00:33:23.532 [INFO]                                                           
             
2017-06-19T00:33:23.532 [INFO] ------------------------------------------------------------------------
2017-06-19T00:33:23.532 [INFO] Skipping Apache Beam :: Parent
2017-06-19T00:33:23.532 [INFO] This project has been banned from the build due to previous
failures.
2017-06-19T00:33:23.532 [INFO] ------------------------------------------------------------------------
[JENKINS] Archiving disabled
[JENKINS] Archiving disabled
[JENKINS] Archiving disabled
[JENKINS] Archiving disabled
[JENKINS] Archiving disabled
[JENKINS] Archiving disabled
[JENKINS] Archiving disabled
[JENKINS] Archiving disabled
[JENKINS] Archiving disabled
[JENKINS] Archiving disabled
[JENKINS] Archiving disabled
[JENKINS] Archiving disabled
[JENKINS] Archiving disabled
[JENKINS] Archiving disabled
[JENKINS] Archiving disabled
[JENKINS] Archiving disabled
[JENKINS] Archiving disabled
[JENKINS] Archiving disabled
[JENKINS] Archiving disabled
[JENKINS] Archiving disabled
[JENKINS] Archiving disabled
[JENKINS] Archiving disabled
[JENKINS] Archiving disabled
[JENKINS] Archiving disabled
[JENKINS] Archiving disabled
[JENKINS] Archiving disabled
[JENKINS] Archiving disabled
[JENKINS] Archiving disabled
[JENKINS] Archiving disabled
[JENKINS] Archiving disabled
[JENKINS] Archiving disabled
[JENKINS] Archiving disabled
[JENKINS] Archiving disabled
[JENKINS] Archiving disabled
[JENKINS] Archiving disabled
[JENKINS] Archiving disabled
[JENKINS] Archiving disabled
[JENKINS] Archiving disabled
[JENKINS] Archiving disabled
[JENKINS] Archiving disabled
[JENKINS] Archiving disabled
[JENKINS] Archiving disabled
[JENKINS] Archiving disabled
[JENKINS] Archiving disabled
[JENKINS] Archiving disabled
[JENKINS] Archiving disabled
[JENKINS] Archiving disabled
[JENKINS] Archiving disabled
[JENKINS] Archiving disabled
[JENKINS] Archiving disabled
2017-06-19T00:34:22.162 [INFO] ------------------------------------------------------------------------
2017-06-19T00:34:22.162 [INFO] Reactor Summary:
2017-06-19T00:34:22.162 [INFO] 
2017-06-19T00:34:22.162 [INFO] Apache Beam :: Parent .............................. SUCCESS
[ 26.226 s]
2017-06-19T00:34:22.163 [INFO] Apache Beam :: SDKs :: Java :: Build Tools ......... SUCCESS
[ 16.712 s]
2017-06-19T00:34:22.163 [INFO] Apache Beam :: SDKs ................................ SUCCESS
[  8.500 s]
2017-06-19T00:34:22.163 [INFO] Apache Beam :: SDKs :: Common ...................... SUCCESS
[  5.307 s]
2017-06-19T00:34:22.163 [INFO] Apache Beam :: SDKs :: Common :: Runner API ........ SUCCESS
[ 24.073 s]
2017-06-19T00:34:22.163 [INFO] Apache Beam :: SDKs :: Common :: Fn API ............ SUCCESS
[ 22.757 s]
2017-06-19T00:34:22.163 [INFO] Apache Beam :: SDKs :: Java ........................ SUCCESS
[  5.674 s]
2017-06-19T00:34:22.163 [INFO] Apache Beam :: SDKs :: Java :: Core ................ SUCCESS
[04:16 min]
2017-06-19T00:34:22.163 [INFO] Apache Beam :: Runners ............................. SUCCESS
[  5.537 s]
2017-06-19T00:34:22.163 [INFO] Apache Beam :: Runners :: Core Construction Java ... SUCCESS
[ 49.325 s]
2017-06-19T00:34:22.163 [INFO] Apache Beam :: Runners :: Core Java ................ SUCCESS
[01:11 min]
2017-06-19T00:34:22.163 [INFO] Apache Beam :: Runners :: Direct Java .............. SUCCESS
[03:39 min]
2017-06-19T00:34:22.163 [INFO] Apache Beam :: SDKs :: Java :: IO .................. SUCCESS
[ 10.302 s]
2017-06-19T00:34:22.163 [INFO] Apache Beam :: SDKs :: Java :: IO :: Common ........ SUCCESS
[ 13.978 s]
2017-06-19T00:34:22.164 [INFO] Apache Beam :: SDKs :: Java :: IO :: Cassandra ..... SUCCESS
[ 40.305 s]
2017-06-19T00:34:22.164 [INFO] Apache Beam :: SDKs :: Java :: IO :: Elasticsearch . SUCCESS
[ 55.574 s]
2017-06-19T00:34:22.164 [INFO] Apache Beam :: SDKs :: Java :: Extensions .......... SUCCESS
[  5.348 s]
2017-06-19T00:34:22.164 [INFO] Apache Beam :: SDKs :: Java :: Extensions :: Google Cloud Platform
Core SUCCESS [ 55.105 s]
2017-06-19T00:34:22.164 [INFO] Apache Beam :: SDKs :: Java :: Extensions :: Protobuf SUCCESS
[ 30.775 s]
2017-06-19T00:34:22.164 [INFO] Apache Beam :: SDKs :: Java :: IO :: Google Cloud Platform
SUCCESS [01:34 min]
2017-06-19T00:34:22.164 [INFO] Apache Beam :: SDKs :: Java :: IO :: Hadoop Common . SUCCESS
[ 31.618 s]
2017-06-19T00:34:22.164 [INFO] Apache Beam :: SDKs :: Java :: IO :: Hadoop File System SUCCESS
[ 41.146 s]
2017-06-19T00:34:22.164 [INFO] Apache Beam :: SDKs :: Java :: IO :: Hadoop ........ SUCCESS
[  9.283 s]
2017-06-19T00:34:22.164 [INFO] Apache Beam :: SDKs :: Java :: IO :: Hadoop :: input-format
SUCCESS [ 37.424 s]
2017-06-19T00:34:22.164 [INFO] Apache Beam :: SDKs :: Java :: IO :: Hadoop :: jdk1.8-tests
SUCCESS [01:38 min]
2017-06-19T00:34:22.164 [INFO] Apache Beam :: SDKs :: Java :: IO :: HBase ......... SUCCESS
[ 42.218 s]
2017-06-19T00:34:22.164 [INFO] Apache Beam :: SDKs :: Java :: IO :: HCatalog ...... SUCCESS
[01:01 min]
2017-06-19T00:34:22.165 [INFO] Apache Beam :: SDKs :: Java :: IO :: JDBC .......... SUCCESS
[ 37.001 s]
2017-06-19T00:34:22.165 [INFO] Apache Beam :: SDKs :: Java :: IO :: JMS ........... SUCCESS
[ 31.482 s]
2017-06-19T00:34:22.165 [INFO] Apache Beam :: SDKs :: Java :: IO :: Kafka ......... SUCCESS
[ 44.186 s]
2017-06-19T00:34:22.165 [INFO] Apache Beam :: SDKs :: Java :: IO :: Kinesis ....... SUCCESS
[ 36.236 s]
2017-06-19T00:34:22.165 [INFO] Apache Beam :: SDKs :: Java :: IO :: MongoDB ....... SUCCESS
[ 46.870 s]
2017-06-19T00:34:22.165 [INFO] Apache Beam :: SDKs :: Java :: IO :: MQTT .......... SUCCESS
[ 31.822 s]
2017-06-19T00:34:22.165 [INFO] Apache Beam :: SDKs :: Java :: IO :: XML ........... SUCCESS
[ 29.397 s]
2017-06-19T00:34:22.165 [INFO] Apache Beam :: SDKs :: Java :: Maven Archetypes .... SUCCESS
[  4.853 s]
2017-06-19T00:34:22.165 [INFO] Apache Beam :: SDKs :: Java :: Maven Archetypes :: Starter
SUCCESS [ 25.255 s]
2017-06-19T00:34:22.165 [INFO] Apache Beam :: SDKs :: Java :: Extensions :: Jackson SUCCESS
[ 27.015 s]
2017-06-19T00:34:22.165 [INFO] Apache Beam :: SDKs :: Java :: Extensions :: Join library SUCCESS
[ 28.450 s]
2017-06-19T00:34:22.165 [INFO] Apache Beam :: SDKs :: Java :: Extensions :: Sorter  SUCCESS
[ 36.932 s]
2017-06-19T00:34:22.165 [INFO] Apache Beam :: Runners :: Google Cloud Dataflow .... SUCCESS
[ 50.955 s]
2017-06-19T00:34:22.165 [INFO] Apache Beam :: SDKs :: Java :: Harness ............. SUCCESS
[ 55.846 s]
2017-06-19T00:34:22.165 [INFO] Apache Beam :: SDKs :: Java :: Java 8 Tests ........ SUCCESS
[ 23.600 s]
2017-06-19T00:34:22.165 [INFO] Apache Beam :: SDKs :: Python ...................... FAILURE
[  3.857 s]
2017-06-19T00:34:22.166 [INFO] Apache Beam :: Runners :: Flink .................... SKIPPED
2017-06-19T00:34:22.166 [INFO] Apache Beam :: Runners :: Spark .................... SKIPPED
2017-06-19T00:34:22.166 [INFO] Apache Beam :: Runners :: Apex ..................... SKIPPED
2017-06-19T00:34:22.166 [INFO] Apache Beam :: Examples ............................ SKIPPED
2017-06-19T00:34:22.166 [INFO] Apache Beam :: Examples :: Java .................... SKIPPED
2017-06-19T00:34:22.166 [INFO] Apache Beam :: Examples :: Java 8 .................. SKIPPED
2017-06-19T00:34:22.166 [INFO] Apache Beam :: SDKs :: Java :: Aggregated Javadoc .. SKIPPED
2017-06-19T00:34:22.166 [INFO] ------------------------------------------------------------------------
2017-06-19T00:34:22.166 [INFO] BUILD FAILURE
2017-06-19T00:34:22.166 [INFO] ------------------------------------------------------------------------
2017-06-19T00:34:22.166 [INFO] Total time: 33:41 min
2017-06-19T00:34:22.166 [INFO] Finished at: 2017-06-19T00:34:22+00:00
2017-06-19T00:34:23.626 [INFO] Final Memory: 325M/2472M
2017-06-19T00:34:23.627 [INFO] ------------------------------------------------------------------------
2017-06-19T00:34:23.642 [ERROR] Failed to execute goal org.codehaus.gmaven:groovy-maven-plugin:2.0:execute
(find-supported-python-for-clean) on project beam-sdks-python: Unable to find Python 2.7 in
path -> [Help 1]
org.apache.maven.lifecycle.LifecycleExecutionException: Failed to execute goal org.codehaus.gmaven:groovy-maven-plugin:2.0:execute
(find-supported-python-for-clean) on project beam-sdks-python: Unable to find Python 2.7 in
path
	at org.apache.maven.lifecycle.internal.MojoExecutor.execute(MojoExecutor.java:212)
	at org.apache.maven.lifecycle.internal.MojoExecutor.execute(MojoExecutor.java:153)
	at org.apache.maven.lifecycle.internal.MojoExecutor.execute(MojoExecutor.java:145)
	at org.apache.maven.lifecycle.internal.LifecycleModuleBuilder.buildProject(LifecycleModuleBuilder.java:116)
	at org.apache.maven.lifecycle.internal.LifecycleModuleBuilder.buildProject(LifecycleModuleBuilder.java:80)
	at org.apache.maven.lifecycle.internal.builder.singlethreaded.SingleThreadedBuilder.build(SingleThreadedBuilder.java:51)
	at org.apache.maven.lifecycle.internal.LifecycleStarter.execute(LifecycleStarter.java:128)
	at org.apache.maven.DefaultMaven.doExecute(DefaultMaven.java:307)
	at org.apache.maven.DefaultMaven.doExecute(DefaultMaven.java:193)
	at org.apache.maven.DefaultMaven.execute(DefaultMaven.java:106)
	at org.jvnet.hudson.maven3.launcher.Maven33Launcher.main(Maven33Launcher.java:129)
	at sun.reflect.NativeMethodAccessorImpl.invoke0(Native Method)
	at sun.reflect.NativeMethodAccessorImpl.invoke(NativeMethodAccessorImpl.java:62)
	at sun.reflect.DelegatingMethodAccessorImpl.invoke(DelegatingMethodAccessorImpl.java:43)
	at java.lang.reflect.Method.invoke(Method.java:498)
	at org.codehaus.plexus.classworlds.launcher.Launcher.launchStandard(Launcher.java:330)
	at org.codehaus.plexus.classworlds.launcher.Launcher.launch(Launcher.java:238)
	at jenkins.maven3.agent.Maven33Main.launch(Maven33Main.java:176)
	at sun.reflect.NativeMethodAccessorImpl.invoke0(Native Method)
	at sun.reflect.NativeMethodAccessorImpl.invoke(NativeMethodAccessorImpl.java:62)
	at sun.reflect.DelegatingMethodAccessorImpl.invoke(DelegatingMethodAccessorImpl.java:43)
	at java.lang.reflect.Method.invoke(Method.java:498)
	at hudson.maven.Maven3Builder.call(Maven3Builder.java:139)
	at hudson.maven.Maven3Builder.call(Maven3Builder.java:70)
	at hudson.remoting.UserRequest.perform(UserRequest.java:120)
	at hudson.remoting.UserRequest.perform(UserRequest.java:48)
	at hudson.remoting.Request$2.run(Request.java:326)
	at hudson.remoting.InterceptingExecutorService$1.call(InterceptingExecutorService.java:68)
	at java.util.concurrent.FutureTask.run(FutureTask.java:266)
	at java.util.concurrent.ThreadPoolExecutor.runWorker(ThreadPoolExecutor.java:1142)
	at java.util.concurrent.ThreadPoolExecutor$Worker.run(ThreadPoolExecutor.java:617)
	at java.lang.Thread.run(Thread.java:745)
Caused by: org.apache.maven.plugin.MojoFailureException: Unable to find Python 2.7 in path
	at sun.reflect.NativeConstructorAccessorImpl.newInstance0(Native Method)
	at sun.reflect.NativeConstructorAccessorImpl.newInstance(NativeConstructorAccessorImpl.java:62)
	at sun.reflect.DelegatingConstructorAccessorImpl.newInstance(DelegatingConstructorAccessorImpl.java:45)
	at java.lang.reflect.Constructor.newInstance(Constructor.java:423)
	at org.codehaus.groovy.reflection.CachedConstructor.invoke(CachedConstructor.java:77)
	at org.codehaus.groovy.runtime.callsite.ConstructorSite$ConstructorSiteNoUnwrapNoCoerce.callConstructor(ConstructorSite.java:102)
	at org.codehaus.groovy.runtime.callsite.CallSiteArray.defaultCallConstructor(CallSiteArray.java:57)
	at org.codehaus.groovy.runtime.callsite.AbstractCallSite.callConstructor(AbstractCallSite.java:182)
	at org.codehaus.groovy.runtime.callsite.AbstractCallSite.callConstructor(AbstractCallSite.java:190)
	at findSupportedPython.run(findSupportedPython.groovy:70)
	at groovy.lang.GroovyShell.evaluate(GroovyShell.java:518)
	at org.codehaus.gmaven.adapter.impl.ScriptExecutorImpl.execute(ScriptExecutorImpl.java:80)
	at org.codehaus.gmaven.plugin.ExecuteMojo$1.run(ExecuteMojo.java:100)
	at org.codehaus.gmaven.plugin.util.SystemNoExitGuard.run(SystemNoExitGuard.java:45)
	at org.codehaus.gmaven.plugin.ExecuteMojo.run(ExecuteMojo.java:96)
	at org.codehaus.gmaven.plugin.MojoSupport.execute(MojoSupport.java:45)
	at org.apache.maven.plugin.DefaultBuildPluginManager.executeMojo(DefaultBuildPluginManager.java:134)
	at org.apache.maven.lifecycle.internal.MojoExecutor.execute(MojoExecutor.java:208)
	... 31 more
2017-06-19T00:34:23.646 [ERROR] 
2017-06-19T00:34:23.646 [ERROR] Re-run Maven using the -X switch to enable full debug logging.
2017-06-19T00:34:23.646 [ERROR] 
2017-06-19T00:34:23.646 [ERROR] For more information about the errors and possible solutions,
please read the following articles:
2017-06-19T00:34:23.646 [ERROR] [Help 1] http://cwiki.apache.org/confluence/display/MAVEN/MojoFailureException
2017-06-19T00:34:23.647 [ERROR] 
2017-06-19T00:34:23.647 [ERROR] After correcting the problems, you can resume the build with
the command
2017-06-19T00:34:23.647 [ERROR]   mvn <goals> -rf :beam-sdks-python
channel stopped
Not sending mail to unregistered user aljoscha.krettek@gmail.com
Not sending mail to unregistered user github@nakomis.com
Not sending mail to unregistered user hepei.hp@alibaba-inc.com
Not sending mail to unregistered user sourabhbajaj@google.com
Not sending mail to unregistered user klk@google.com
Not sending mail to unregistered user ccy@google.com
Not sending mail to unregistered user kirpichov@google.com
Not sending mail to unregistered user mingmxu@ebay.com

Mime
View raw message