beam-commits mailing list archives

Site index · List index
Message view « Date » · « Thread »
Top « Date » · « Thread »
From Apache Jenkins Server <jenk...@builds.apache.org>
Subject Build failed in Jenkins: beam_PostCommit_Java_JDK_Versions_Test » JDK 1.7 (latest),beam #48
Date Mon, 05 Jun 2017 20:53:30 GMT
See <https://builds.apache.org/job/beam_PostCommit_Java_JDK_Versions_Test/jdk=JDK%201.7%20(latest),label=beam/48/display/redirect>

------------------------------------------
[...truncated 1.42 MB...]
  [javadoc] <https://builds.apache.org/job/beam_PostCommit_Java_JDK_Versions_Test/jdk=JDK%201.7%20(latest),label=beam/ws/sdks/java/javadoc/target/collected/org/apache/beam/sdk/io/FileSystem.java>:80:
warning - Tag @link: reference not found: ResourceIdT
  [javadoc] <https://builds.apache.org/job/beam_PostCommit_Java_JDK_Versions_Test/jdk=JDK%201.7%20(latest),label=beam/ws/sdks/java/javadoc/target/collected/org/apache/beam/sdk/io/FileSystem.java>:70:
warning - Tag @link: reference not found: ResourceIdT ResourceIds
  [javadoc] <https://builds.apache.org/job/beam_PostCommit_Java_JDK_Versions_Test/jdk=JDK%201.7%20(latest),label=beam/ws/sdks/java/javadoc/target/collected/org/apache/beam/sdk/io/FileSystem.java>:93:
warning - Tag @link: reference not found: ResourceIdT
  [javadoc] <https://builds.apache.org/job/beam_PostCommit_Java_JDK_Versions_Test/jdk=JDK%201.7%20(latest),label=beam/ws/sdks/java/javadoc/target/collected/org/apache/beam/sdk/io/FileSystem.java>:70:
warning - Tag @link: reference not found: ResourceIdT ResourceIds
  [javadoc] <https://builds.apache.org/job/beam_PostCommit_Java_JDK_Versions_Test/jdk=JDK%201.7%20(latest),label=beam/ws/sdks/java/javadoc/target/collected/org/apache/beam/sdk/io/FileSystem.java>:70:
warning - Tag @link: reference not found: ResourceIdT
  [javadoc] <https://builds.apache.org/job/beam_PostCommit_Java_JDK_Versions_Test/jdk=JDK%201.7%20(latest),label=beam/ws/sdks/java/javadoc/target/collected/org/apache/beam/sdk/io/FileSystem.java>:70:
warning - Tag @link: reference not found: ResourceIdT
  [javadoc] <https://builds.apache.org/job/beam_PostCommit_Java_JDK_Versions_Test/jdk=JDK%201.7%20(latest),label=beam/ws/sdks/java/javadoc/target/collected/org/apache/beam/sdk/io/FileSystem.java>:80:
warning - Tag @link: reference not found: ResourceIdT
  [javadoc] <https://builds.apache.org/job/beam_PostCommit_Java_JDK_Versions_Test/jdk=JDK%201.7%20(latest),label=beam/ws/sdks/java/javadoc/target/collected/org/apache/beam/sdk/io/FileSystem.java>:93:
warning - Tag @link: reference not found: ResourceIdT
  [javadoc] <https://builds.apache.org/job/beam_PostCommit_Java_JDK_Versions_Test/jdk=JDK%201.7%20(latest),label=beam/ws/sdks/java/javadoc/target/collected/org/apache/beam/sdk/io/OffsetBasedSource.java>:295:
warning - Tag @link: reference not found: BoundedReader#start
  [javadoc] <https://builds.apache.org/job/beam_PostCommit_Java_JDK_Versions_Test/jdk=JDK%201.7%20(latest),label=beam/ws/sdks/java/javadoc/target/collected/org/apache/beam/sdk/io/OffsetBasedSource.java>:295:
warning - Tag @see: reference not found: BoundedReader#start
  [javadoc] <https://builds.apache.org/job/beam_PostCommit_Java_JDK_Versions_Test/jdk=JDK%201.7%20(latest),label=beam/ws/sdks/java/javadoc/target/collected/org/apache/beam/sdk/io/OffsetBasedSource.java>:309:
warning - Tag @link: reference not found: BoundedReader#advance
  [javadoc] <https://builds.apache.org/job/beam_PostCommit_Java_JDK_Versions_Test/jdk=JDK%201.7%20(latest),label=beam/ws/sdks/java/javadoc/target/collected/org/apache/beam/sdk/io/OffsetBasedSource.java>:309:
warning - Tag @see: reference not found: BoundedReader#advance
  [javadoc] <https://builds.apache.org/job/beam_PostCommit_Java_JDK_Versions_Test/jdk=JDK%201.7%20(latest),label=beam/ws/sdks/java/javadoc/target/collected/org/apache/beam/sdk/io/TextIO.java>:314:
warning - Tag @link: can't find withFilenamePolicy(FilenamePolicy) in org.apache.beam.sdk.io.TextIO.Write
  [javadoc] <https://builds.apache.org/job/beam_PostCommit_Java_JDK_Versions_Test/jdk=JDK%201.7%20(latest),label=beam/ws/sdks/java/javadoc/target/collected/org/apache/beam/sdk/io/TextIO.java>:295:
warning - Tag @link: can't find withFilenamePolicy(FilenamePolicy) in org.apache.beam.sdk.io.TextIO.Write
  [javadoc] <https://builds.apache.org/job/beam_PostCommit_Java_JDK_Versions_Test/jdk=JDK%201.7%20(latest),label=beam/ws/sdks/java/javadoc/target/collected/org/apache/beam/sdk/io/TextIO.java>:346:
warning - Tag @link: can't find withFilenamePolicy(FilenamePolicy) in org.apache.beam.sdk.io.TextIO.Write
  [javadoc] <https://builds.apache.org/job/beam_PostCommit_Java_JDK_Versions_Test/jdk=JDK%201.7%20(latest),label=beam/ws/sdks/java/javadoc/target/collected/org/apache/beam/sdk/io/TextIO.java>:357:
warning - Tag @link: can't find withFilenamePolicy(FilenamePolicy) in org.apache.beam.sdk.io.TextIO.Write
  [javadoc] <https://builds.apache.org/job/beam_PostCommit_Java_JDK_Versions_Test/jdk=JDK%201.7%20(latest),label=beam/ws/sdks/java/javadoc/target/collected/org/apache/beam/sdk/io/gcp/bigquery/DynamicDestinations.java>:136:
warning - Tag @link: reference not found: DestinationT
  [javadoc] <https://builds.apache.org/job/beam_PostCommit_Java_JDK_Versions_Test/jdk=JDK%201.7%20(latest),label=beam/ws/sdks/java/javadoc/target/collected/org/apache/beam/sdk/io/gcp/bigquery/DynamicDestinations.java>:136:
warning - Tag @link: reference not found: DestinationT
  [javadoc] <https://builds.apache.org/job/beam_PostCommit_Java_JDK_Versions_Test/jdk=JDK%201.7%20(latest),label=beam/ws/sdks/java/javadoc/target/collected/org/apache/beam/sdk/io/gcp/bigquery/DynamicDestinations.java>:136:
warning - Tag @link: reference not found: DestinationT
  [javadoc] <https://builds.apache.org/job/beam_PostCommit_Java_JDK_Versions_Test/jdk=JDK%201.7%20(latest),label=beam/ws/sdks/java/javadoc/target/collected/org/apache/beam/sdk/io/gcp/datastore/DatastoreV1.java>:472:
warning - Tag @link: reference not found: Query.Builder#setLimit
  [javadoc] <https://builds.apache.org/job/beam_PostCommit_Java_JDK_Versions_Test/jdk=JDK%201.7%20(latest),label=beam/ws/sdks/java/javadoc/target/collected/org/apache/beam/sdk/io/gcp/pubsub/PubsubUnboundedSource.java>:110:
warning - Tag @link: reference not found: UnboundedSource.UnboundedReader
  [javadoc] <https://builds.apache.org/job/beam_PostCommit_Java_JDK_Versions_Test/jdk=JDK%201.7%20(latest),label=beam/ws/sdks/java/javadoc/target/collected/org/apache/beam/sdk/io/kafka/KafkaIO.java>:239:
warning - Tag @link: reference not found: org.apache.kafka.common.serialization
  [javadoc] <https://builds.apache.org/job/beam_PostCommit_Java_JDK_Versions_Test/jdk=JDK%201.7%20(latest),label=beam/ws/sdks/java/javadoc/target/collected/org/apache/beam/sdk/io/kafka/KafkaIO.java>:239:
warning - Tag @link: reference not found: UnboundedKafkaSource#split(int, PipelineOptions)
  [javadoc] <https://builds.apache.org/job/beam_PostCommit_Java_JDK_Versions_Test/jdk=JDK%201.7%20(latest),label=beam/ws/sdks/java/javadoc/target/collected/org/apache/beam/sdk/io/kafka/KafkaIO.java>:350:
warning - Tag @link: reference not found: UnboundedKafkaSource#split(int, PipelineOptions)
  [javadoc] <https://builds.apache.org/job/beam_PostCommit_Java_JDK_Versions_Test/jdk=JDK%201.7%20(latest),label=beam/ws/sdks/java/javadoc/target/collected/org/apache/beam/sdk/io/kafka/KafkaIO.java>:361:
warning - Tag @link: reference not found: UnboundedKafkaSource#split(int, PipelineOptions)
  [javadoc] <https://builds.apache.org/job/beam_PostCommit_Java_JDK_Versions_Test/jdk=JDK%201.7%20(latest),label=beam/ws/sdks/java/javadoc/target/collected/org/apache/beam/sdk/io/kafka/KafkaIO.java>:374:
warning - Tag @link: reference not found: UnboundedKafkaSource#split(int, PipelineOptions)
  [javadoc] <https://builds.apache.org/job/beam_PostCommit_Java_JDK_Versions_Test/jdk=JDK%201.7%20(latest),label=beam/ws/sdks/java/javadoc/target/collected/org/apache/beam/sdk/options/PipelineOptions.java>:199:
warning - Tag @link: reference not found: DoFn.ProcessContext Context
  [javadoc] <https://builds.apache.org/job/beam_PostCommit_Java_JDK_Versions_Test/jdk=JDK%201.7%20(latest),label=beam/ws/sdks/java/javadoc/target/collected/org/apache/beam/sdk/state/StateSpecs.java>:73:
warning - Tag @see: can't find combining(Coder, CombineFn) in org.apache.beam.sdk.state.StateSpecs
  [javadoc] <https://builds.apache.org/job/beam_PostCommit_Java_JDK_Versions_Test/jdk=JDK%201.7%20(latest),label=beam/ws/sdks/java/javadoc/target/collected/org/apache/beam/sdk/state/StateSpecs.java>:91:
warning - Tag @see: can't find combining(Coder, CombineFnWithContext) in org.apache.beam.sdk.state.StateSpecs
  [javadoc] <https://builds.apache.org/job/beam_PostCommit_Java_JDK_Versions_Test/jdk=JDK%201.7%20(latest),label=beam/ws/sdks/java/javadoc/target/collected/org/apache/beam/sdk/state/StateSpecs.java>:102:
warning - Tag @link: can't find combining(CombineFn) in org.apache.beam.sdk.state.StateSpecs
  [javadoc] <https://builds.apache.org/job/beam_PostCommit_Java_JDK_Versions_Test/jdk=JDK%201.7%20(latest),label=beam/ws/sdks/java/javadoc/target/collected/org/apache/beam/sdk/state/StateSpecs.java>:120:
warning - Tag @link: can't find combining(CombineFnWithContext) in org.apache.beam.sdk.state.StateSpecs
  [javadoc] <https://builds.apache.org/job/beam_PostCommit_Java_JDK_Versions_Test/jdk=JDK%201.7%20(latest),label=beam/ws/sdks/java/javadoc/target/collected/org/apache/beam/sdk/state/Timer.java>:45:
warning - Tag @link: reference not found: DoFn.TimerId
  [javadoc] <https://builds.apache.org/job/beam_PostCommit_Java_JDK_Versions_Test/jdk=JDK%201.7%20(latest),label=beam/ws/sdks/java/javadoc/target/collected/org/apache/beam/sdk/testing/SourceTestUtils.java>:80:
warning - Tag @link: reference not found: BoundedSource.BoundedReader#splitAtFraction
  [javadoc] <https://builds.apache.org/job/beam_PostCommit_Java_JDK_Versions_Test/jdk=JDK%201.7%20(latest),label=beam/ws/sdks/java/javadoc/target/collected/org/apache/beam/sdk/testing/SourceTestUtils.java>:552:
warning - Tag @link: reference not found: BoundedSource.BoundedReader#splitAtFraction
  [javadoc] <https://builds.apache.org/job/beam_PostCommit_Java_JDK_Versions_Test/jdk=JDK%201.7%20(latest),label=beam/ws/sdks/java/javadoc/target/collected/org/apache/beam/sdk/testing/SourceTestUtils.java>:450:
warning - Tag @link: reference not found: BoundedSource.BoundedReader#splitAtFraction
  [javadoc] <https://builds.apache.org/job/beam_PostCommit_Java_JDK_Versions_Test/jdk=JDK%201.7%20(latest),label=beam/ws/sdks/java/javadoc/target/collected/org/apache/beam/sdk/testing/SourceTestUtils.java>:152:
warning - Tag @link: reference not found: Source.Reader
  [javadoc] <https://builds.apache.org/job/beam_PostCommit_Java_JDK_Versions_Test/jdk=JDK%201.7%20(latest),label=beam/ws/sdks/java/javadoc/target/collected/org/apache/beam/sdk/testing/SourceTestUtils.java>:145:
warning - Tag @link: reference not found: Source.Reader
  [javadoc] <https://builds.apache.org/job/beam_PostCommit_Java_JDK_Versions_Test/jdk=JDK%201.7%20(latest),label=beam/ws/sdks/java/javadoc/target/collected/org/apache/beam/sdk/testing/SourceTestUtils.java>:168:
warning - Tag @link: reference not found: Source.Reader
  [javadoc] <https://builds.apache.org/job/beam_PostCommit_Java_JDK_Versions_Test/jdk=JDK%201.7%20(latest),label=beam/ws/sdks/java/javadoc/target/collected/org/apache/beam/sdk/testing/SourceTestUtils.java>:168:
warning - Tag @link: reference not found: Source.Reader#start
  [javadoc] <https://builds.apache.org/job/beam_PostCommit_Java_JDK_Versions_Test/jdk=JDK%201.7%20(latest),label=beam/ws/sdks/java/javadoc/target/collected/org/apache/beam/sdk/testing/SourceTestUtils.java>:159:
warning - Tag @link: reference not found: Source.Reader
  [javadoc] <https://builds.apache.org/job/beam_PostCommit_Java_JDK_Versions_Test/jdk=JDK%201.7%20(latest),label=beam/ws/sdks/java/javadoc/target/collected/org/apache/beam/sdk/testing/SourceTestUtils.java>:200:
warning - Tag @link: reference not found: Source.Reader
  [javadoc] <https://builds.apache.org/job/beam_PostCommit_Java_JDK_Versions_Test/jdk=JDK%201.7%20(latest),label=beam/ws/sdks/java/javadoc/target/collected/org/apache/beam/sdk/testing/SourceTestUtils.java>:145:
warning - Tag @link: reference not found: Source.Reader
  [javadoc] <https://builds.apache.org/job/beam_PostCommit_Java_JDK_Versions_Test/jdk=JDK%201.7%20(latest),label=beam/ws/sdks/java/javadoc/target/collected/org/apache/beam/sdk/testing/SourceTestUtils.java>:152:
warning - Tag @link: reference not found: Source.Reader
  [javadoc] <https://builds.apache.org/job/beam_PostCommit_Java_JDK_Versions_Test/jdk=JDK%201.7%20(latest),label=beam/ws/sdks/java/javadoc/target/collected/org/apache/beam/sdk/testing/SourceTestUtils.java>:159:
warning - Tag @link: reference not found: Source.Reader
  [javadoc] <https://builds.apache.org/job/beam_PostCommit_Java_JDK_Versions_Test/jdk=JDK%201.7%20(latest),label=beam/ws/sdks/java/javadoc/target/collected/org/apache/beam/sdk/testing/SourceTestUtils.java>:168:
warning - Tag @link: reference not found: Source.Reader
  [javadoc] <https://builds.apache.org/job/beam_PostCommit_Java_JDK_Versions_Test/jdk=JDK%201.7%20(latest),label=beam/ws/sdks/java/javadoc/target/collected/org/apache/beam/sdk/testing/SourceTestUtils.java>:168:
warning - Tag @link: reference not found: Source.Reader#start
  [javadoc] <https://builds.apache.org/job/beam_PostCommit_Java_JDK_Versions_Test/jdk=JDK%201.7%20(latest),label=beam/ws/sdks/java/javadoc/target/collected/org/apache/beam/sdk/testing/SourceTestUtils.java>:200:
warning - Tag @link: reference not found: Source.Reader
  [javadoc] <https://builds.apache.org/job/beam_PostCommit_Java_JDK_Versions_Test/jdk=JDK%201.7%20(latest),label=beam/ws/sdks/java/javadoc/target/collected/org/apache/beam/sdk/testing/SourceTestUtils.java>:450:
warning - Tag @link: reference not found: BoundedSource.BoundedReader#splitAtFraction
  [javadoc] <https://builds.apache.org/job/beam_PostCommit_Java_JDK_Versions_Test/jdk=JDK%201.7%20(latest),label=beam/ws/sdks/java/javadoc/target/collected/org/apache/beam/sdk/testing/SourceTestUtils.java>:552:
warning - Tag @link: reference not found: BoundedSource.BoundedReader#splitAtFraction
  [javadoc] <https://builds.apache.org/job/beam_PostCommit_Java_JDK_Versions_Test/jdk=JDK%201.7%20(latest),label=beam/ws/sdks/java/javadoc/target/collected/org/apache/beam/sdk/transforms/PTransform.java>:208:
warning - Tag @link: reference not found: InputT
  [javadoc] <https://builds.apache.org/job/beam_PostCommit_Java_JDK_Versions_Test/jdk=JDK%201.7%20(latest),label=beam/ws/sdks/java/javadoc/target/collected/org/apache/beam/sdk/transforms/PTransform.java>:208:
warning - Tag @link: reference not found: InputT
  [javadoc] <https://builds.apache.org/job/beam_PostCommit_Java_JDK_Versions_Test/jdk=JDK%201.7%20(latest),label=beam/ws/sdks/java/javadoc/target/collected/org/apache/beam/sdk/transforms/splittabledofn/RestrictionTracker.java>:47:
warning - Tag @link: reference not found: DoFn.ProcessElement
  [javadoc] <https://builds.apache.org/job/beam_PostCommit_Java_JDK_Versions_Test/jdk=JDK%201.7%20(latest),label=beam/ws/sdks/java/javadoc/target/collected/org/apache/beam/sdk/transforms/splittabledofn/RestrictionTracker.java>:39:
warning - Tag @link: reference not found: DoFn.ProcessElement
  [javadoc] <https://builds.apache.org/job/beam_PostCommit_Java_JDK_Versions_Test/jdk=JDK%201.7%20(latest),label=beam/ws/sdks/java/javadoc/target/collected/org/apache/beam/sdk/transforms/splittabledofn/RestrictionTracker.java>:31:
warning - Tag @link: reference not found: DoFn.ProcessElement
  [javadoc] <https://builds.apache.org/job/beam_PostCommit_Java_JDK_Versions_Test/jdk=JDK%201.7%20(latest),label=beam/ws/sdks/java/javadoc/target/collected/org/apache/beam/sdk/transforms/splittabledofn/RestrictionTracker.java>:31:
warning - Tag @link: reference not found: DoFn.ProcessElement
  [javadoc] <https://builds.apache.org/job/beam_PostCommit_Java_JDK_Versions_Test/jdk=JDK%201.7%20(latest),label=beam/ws/sdks/java/javadoc/target/collected/org/apache/beam/sdk/transforms/splittabledofn/RestrictionTracker.java>:39:
warning - Tag @link: reference not found: DoFn.ProcessElement
  [javadoc] <https://builds.apache.org/job/beam_PostCommit_Java_JDK_Versions_Test/jdk=JDK%201.7%20(latest),label=beam/ws/sdks/java/javadoc/target/collected/org/apache/beam/sdk/transforms/splittabledofn/RestrictionTracker.java>:47:
warning - Tag @link: reference not found: DoFn.ProcessElement
  [javadoc] <https://builds.apache.org/job/beam_PostCommit_Java_JDK_Versions_Test/jdk=JDK%201.7%20(latest),label=beam/ws/sdks/java/javadoc/target/collected/org/apache/beam/sdk/transforms/splittabledofn/RestrictionTracker.java>:47:
warning - Tag @link: reference not found: DoFn.ProcessElement
  [javadoc] <https://builds.apache.org/job/beam_PostCommit_Java_JDK_Versions_Test/jdk=JDK%201.7%20(latest),label=beam/ws/sdks/java/javadoc/target/collected/org/apache/beam/sdk/transforms/splittabledofn/RestrictionTracker.java>:39:
warning - Tag @link: reference not found: DoFn.ProcessElement
  [javadoc] <https://builds.apache.org/job/beam_PostCommit_Java_JDK_Versions_Test/jdk=JDK%201.7%20(latest),label=beam/ws/sdks/java/javadoc/target/collected/org/apache/beam/sdk/transforms/splittabledofn/RestrictionTracker.java>:31:
warning - Tag @link: reference not found: DoFn.ProcessElement
  [javadoc] <https://builds.apache.org/job/beam_PostCommit_Java_JDK_Versions_Test/jdk=JDK%201.7%20(latest),label=beam/ws/sdks/java/javadoc/target/collected/org/apache/beam/sdk/transforms/splittabledofn/RestrictionTracker.java>:31:
warning - Tag @link: reference not found: DoFn.ProcessElement
  [javadoc] <https://builds.apache.org/job/beam_PostCommit_Java_JDK_Versions_Test/jdk=JDK%201.7%20(latest),label=beam/ws/sdks/java/javadoc/target/collected/org/apache/beam/sdk/transforms/splittabledofn/RestrictionTracker.java>:39:
warning - Tag @link: reference not found: DoFn.ProcessElement
  [javadoc] <https://builds.apache.org/job/beam_PostCommit_Java_JDK_Versions_Test/jdk=JDK%201.7%20(latest),label=beam/ws/sdks/java/javadoc/target/collected/org/apache/beam/sdk/transforms/splittabledofn/RestrictionTracker.java>:47:
warning - Tag @link: reference not found: DoFn.ProcessElement
  [javadoc] <https://builds.apache.org/job/beam_PostCommit_Java_JDK_Versions_Test/jdk=JDK%201.7%20(latest),label=beam/ws/sdks/java/javadoc/target/collected/org/apache/beam/sdk/transforms/windowing/PaneInfo.java>:44:
warning - Tag @link: reference not found: DoFn.ProcessContext#pane
  [javadoc] <https://builds.apache.org/job/beam_PostCommit_Java_JDK_Versions_Test/jdk=JDK%201.7%20(latest),label=beam/ws/sdks/java/javadoc/target/collected/org/apache/beam/sdk/transforms/windowing/PaneInfo.java>:44:
warning - Tag @link: reference not found: DoFn.ProcessElement
  [javadoc] <https://builds.apache.org/job/beam_PostCommit_Java_JDK_Versions_Test/jdk=JDK%201.7%20(latest),label=beam/ws/sdks/java/javadoc/target/collected/org/apache/beam/runners/dataflow/PrimitiveParDoSingleFactory.java>:40:
warning - Tag @link: reference not found: ParDo.SingleOutput
  [javadoc] <https://builds.apache.org/job/beam_PostCommit_Java_JDK_Versions_Test/jdk=JDK%201.7%20(latest),label=beam/ws/sdks/java/javadoc/target/collected/org/apache/beam/runners/direct/package-info.java>:25:
warning - Tag @link: reference not found: org.apache.beam.sdk.runners
  [javadoc] <https://builds.apache.org/job/beam_PostCommit_Java_JDK_Versions_Test/jdk=JDK%201.7%20(latest),label=beam/ws/sdks/java/javadoc/target/collected/org/apache/beam/runners/flink/metrics/ReaderInvocationUtil.java>:34:
warning - Tag @link: reference not found: Source.Reader
  [javadoc] Building index for all the packages and classes...
  [javadoc] <https://builds.apache.org/job/beam_PostCommit_Java_JDK_Versions_Test/jdk=JDK%201.7%20(latest),label=beam/ws/sdks/java/javadoc/target/collected/org/apache/beam/sdk/testing/SourceTestUtils.java>:552:
warning - Tag @link: reference not found: BoundedSource.BoundedReader#splitAtFraction
  [javadoc] <https://builds.apache.org/job/beam_PostCommit_Java_JDK_Versions_Test/jdk=JDK%201.7%20(latest),label=beam/ws/sdks/java/javadoc/target/collected/org/apache/beam/sdk/testing/SourceTestUtils.java>:450:
warning - Tag @link: reference not found: BoundedSource.BoundedReader#splitAtFraction
  [javadoc] <https://builds.apache.org/job/beam_PostCommit_Java_JDK_Versions_Test/jdk=JDK%201.7%20(latest),label=beam/ws/sdks/java/javadoc/target/collected/org/apache/beam/sdk/transforms/splittabledofn/RestrictionTracker.java>:47:
warning - Tag @link: reference not found: DoFn.ProcessElement
  [javadoc] <https://builds.apache.org/job/beam_PostCommit_Java_JDK_Versions_Test/jdk=JDK%201.7%20(latest),label=beam/ws/sdks/java/javadoc/target/collected/org/apache/beam/sdk/transforms/splittabledofn/RestrictionTracker.java>:39:
warning - Tag @link: reference not found: DoFn.ProcessElement
  [javadoc] <https://builds.apache.org/job/beam_PostCommit_Java_JDK_Versions_Test/jdk=JDK%201.7%20(latest),label=beam/ws/sdks/java/javadoc/target/collected/org/apache/beam/sdk/io/FileSystem.java>:80:
warning - Tag @link: reference not found: ResourceIdT
  [javadoc] <https://builds.apache.org/job/beam_PostCommit_Java_JDK_Versions_Test/jdk=JDK%201.7%20(latest),label=beam/ws/sdks/java/javadoc/target/collected/org/apache/beam/sdk/transforms/splittabledofn/RestrictionTracker.java>:31:
warning - Tag @link: reference not found: DoFn.ProcessElement
  [javadoc] <https://builds.apache.org/job/beam_PostCommit_Java_JDK_Versions_Test/jdk=JDK%201.7%20(latest),label=beam/ws/sdks/java/javadoc/target/collected/org/apache/beam/sdk/transforms/PTransform.java>:208:
warning - Tag @link: reference not found: InputT
  [javadoc] <https://builds.apache.org/job/beam_PostCommit_Java_JDK_Versions_Test/jdk=JDK%201.7%20(latest),label=beam/ws/sdks/java/javadoc/target/collected/org/apache/beam/sdk/io/gcp/bigquery/DynamicDestinations.java>:136:
warning - Tag @link: reference not found: DestinationT
  [javadoc] <https://builds.apache.org/job/beam_PostCommit_Java_JDK_Versions_Test/jdk=JDK%201.7%20(latest),label=beam/ws/sdks/java/javadoc/target/collected/org/apache/beam/sdk/io/FileSystem.java>:70:
warning - Tag @link: reference not found: ResourceIdT ResourceIds
  [javadoc] <https://builds.apache.org/job/beam_PostCommit_Java_JDK_Versions_Test/jdk=JDK%201.7%20(latest),label=beam/ws/sdks/java/javadoc/target/collected/org/apache/beam/sdk/io/FileSystem.java>:93:
warning - Tag @link: reference not found: ResourceIdT
  [javadoc] <https://builds.apache.org/job/beam_PostCommit_Java_JDK_Versions_Test/jdk=JDK%201.7%20(latest),label=beam/ws/sdks/java/javadoc/target/collected/org/apache/beam/runners/dataflow/PrimitiveParDoSingleFactory.java>:40:
warning - Tag @link: reference not found: ParDo.SingleOutput
  [javadoc] <https://builds.apache.org/job/beam_PostCommit_Java_JDK_Versions_Test/jdk=JDK%201.7%20(latest),label=beam/ws/sdks/java/javadoc/target/collected/org/apache/beam/runners/flink/metrics/ReaderInvocationUtil.java>:34:
warning - Tag @link: reference not found: Source.Reader
  [javadoc] <https://builds.apache.org/job/beam_PostCommit_Java_JDK_Versions_Test/jdk=JDK%201.7%20(latest),label=beam/ws/sdks/java/javadoc/target/collected/org/apache/beam/sdk/testing/SourceTestUtils.java>:152:
warning - Tag @link: reference not found: Source.Reader
  [javadoc] <https://builds.apache.org/job/beam_PostCommit_Java_JDK_Versions_Test/jdk=JDK%201.7%20(latest),label=beam/ws/sdks/java/javadoc/target/collected/org/apache/beam/sdk/testing/SourceTestUtils.java>:145:
warning - Tag @link: reference not found: Source.Reader
  [javadoc] <https://builds.apache.org/job/beam_PostCommit_Java_JDK_Versions_Test/jdk=JDK%201.7%20(latest),label=beam/ws/sdks/java/javadoc/target/collected/org/apache/beam/sdk/testing/SourceTestUtils.java>:168:
warning - Tag @link: reference not found: Source.Reader
  [javadoc] <https://builds.apache.org/job/beam_PostCommit_Java_JDK_Versions_Test/jdk=JDK%201.7%20(latest),label=beam/ws/sdks/java/javadoc/target/collected/org/apache/beam/sdk/testing/SourceTestUtils.java>:168:
warning - Tag @link: reference not found: Source.Reader#start
  [javadoc] <https://builds.apache.org/job/beam_PostCommit_Java_JDK_Versions_Test/jdk=JDK%201.7%20(latest),label=beam/ws/sdks/java/javadoc/target/collected/org/apache/beam/sdk/testing/SourceTestUtils.java>:159:
warning - Tag @link: reference not found: Source.Reader
  [javadoc] <https://builds.apache.org/job/beam_PostCommit_Java_JDK_Versions_Test/jdk=JDK%201.7%20(latest),label=beam/ws/sdks/java/javadoc/target/collected/org/apache/beam/sdk/testing/SourceTestUtils.java>:200:
warning - Tag @link: reference not found: Source.Reader
  [javadoc] <https://builds.apache.org/job/beam_PostCommit_Java_JDK_Versions_Test/jdk=JDK%201.7%20(latest),label=beam/ws/sdks/java/javadoc/target/collected/org/apache/beam/sdk/io/CompressedSource.java>:534:
warning - Tag @link: reference not found: FileBasedReader#startReading(ReadableByteChannel)
  [javadoc] Building index for all classes...
  [javadoc] Generating <https://builds.apache.org/job/beam_PostCommit_Java_JDK_Versions_Test/jdk=JDK%201.7%20(latest),label=beam/ws/sdks/java/target/site/javadoc/help-doc.html...>
  [javadoc] 15 errors
  [javadoc] 115 warnings
2017-06-05\T\20:53:27.171 [INFO] ------------------------------------------------------------------------
2017-06-05\T\20:53:27.171 [INFO] Reactor Summary:
2017-06-05\T\20:53:27.171 [INFO] 
2017-06-05\T\20:53:27.171 [INFO] Apache Beam :: Parent .............................. SUCCESS
[ 17.556 s]
2017-06-05\T\20:53:27.171 [INFO] Apache Beam :: SDKs :: Java :: Build Tools ......... SUCCESS
[  4.939 s]
2017-06-05\T\20:53:27.171 [INFO] Apache Beam :: SDKs ................................ SUCCESS
[  0.423 s]
2017-06-05\T\20:53:27.171 [INFO] Apache Beam :: SDKs :: Common ...................... SUCCESS
[  0.404 s]
2017-06-05\T\20:53:27.171 [INFO] Apache Beam :: SDKs :: Common :: Runner API ........ SUCCESS
[  6.035 s]
2017-06-05\T\20:53:27.171 [INFO] Apache Beam :: SDKs :: Common :: Fn API ............ SUCCESS
[  4.136 s]
2017-06-05\T\20:53:27.171 [INFO] Apache Beam :: SDKs :: Java ........................ SUCCESS
[  0.396 s]
2017-06-05\T\20:53:27.171 [INFO] Apache Beam :: SDKs :: Java :: Core ................ SUCCESS
[01:11 min]
2017-06-05\T\20:53:27.171 [INFO] Apache Beam :: SDKs :: Java :: IO .................. SUCCESS
[  0.396 s]
2017-06-05\T\20:53:27.171 [INFO] Apache Beam :: SDKs :: Java :: IO :: Common ........ SUCCESS
[  2.549 s]
2017-06-05\T\20:53:27.171 [INFO] Apache Beam :: Runners ............................. SUCCESS
[  0.378 s]
2017-06-05\T\20:53:27.171 [INFO] Apache Beam :: Runners :: Core Construction Java ... SUCCESS
[ 10.712 s]
2017-06-05\T\20:53:27.171 [INFO] Apache Beam :: Runners :: Core Java ................ SUCCESS
[ 23.598 s]
2017-06-05\T\20:53:27.171 [INFO] Apache Beam :: Runners :: Direct Java .............. SUCCESS
[02:42 min]
2017-06-05\T\20:53:27.171 [INFO] Apache Beam :: SDKs :: Java :: IO :: Elasticsearch . SUCCESS
[ 24.220 s]
2017-06-05\T\20:53:27.171 [INFO] Apache Beam :: SDKs :: Java :: Extensions .......... SUCCESS
[  0.390 s]
2017-06-05\T\20:53:27.171 [INFO] Apache Beam :: SDKs :: Java :: Extensions :: Google Cloud
Platform Core SUCCESS [ 19.529 s]
2017-06-05\T\20:53:27.171 [INFO] Apache Beam :: SDKs :: Java :: Extensions :: Protobuf SUCCESS
[  7.901 s]
2017-06-05\T\20:53:27.171 [INFO] Apache Beam :: SDKs :: Java :: IO :: Google Cloud Platform
SUCCESS [ 52.638 s]
2017-06-05\T\20:53:27.171 [INFO] Apache Beam :: SDKs :: Java :: IO :: Hadoop Common . SUCCESS
[ 10.580 s]
2017-06-05\T\20:53:27.171 [INFO] Apache Beam :: SDKs :: Java :: IO :: Hadoop File System SUCCESS
[ 21.344 s]
2017-06-05\T\20:53:27.171 [INFO] Apache Beam :: SDKs :: Java :: IO :: Hadoop ........ SUCCESS
[  2.650 s]
2017-06-05\T\20:53:27.171 [INFO] Apache Beam :: SDKs :: Java :: IO :: Hadoop :: input-format
SUCCESS [  9.121 s]
2017-06-05\T\20:53:27.171 [INFO] Apache Beam :: SDKs :: Java :: IO :: HBase ......... SUCCESS
[ 50.229 s]
2017-06-05\T\20:53:27.171 [INFO] Apache Beam :: Runners :: Google Cloud Dataflow .... SUCCESS
[06:01 min]
2017-06-05\T\20:53:27.171 [INFO] Apache Beam :: SDKs :: Java :: IO :: JDBC .......... SUCCESS
[ 17.405 s]
2017-06-05\T\20:53:27.171 [INFO] Apache Beam :: SDKs :: Java :: IO :: JMS ........... SUCCESS
[  9.389 s]
2017-06-05\T\20:53:27.171 [INFO] Apache Beam :: SDKs :: Java :: IO :: Kafka ......... SUCCESS
[ 24.034 s]
2017-06-05\T\20:53:27.171 [INFO] Apache Beam :: SDKs :: Java :: IO :: Kinesis ....... SUCCESS
[ 10.853 s]
2017-06-05\T\20:53:27.171 [INFO] Apache Beam :: SDKs :: Java :: IO :: MongoDB ....... SUCCESS
[ 21.168 s]
2017-06-05\T\20:53:27.172 [INFO] Apache Beam :: SDKs :: Java :: IO :: MQTT .......... SUCCESS
[  9.817 s]
2017-06-05\T\20:53:27.172 [INFO] Apache Beam :: SDKs :: Java :: IO :: XML ........... SUCCESS
[ 12.460 s]
2017-06-05\T\20:53:27.172 [INFO] Apache Beam :: SDKs :: Java :: Maven Archetypes .... SUCCESS
[  0.391 s]
2017-06-05\T\20:53:27.172 [INFO] Apache Beam :: SDKs :: Java :: Maven Archetypes :: Starter
SUCCESS [ 10.130 s]
2017-06-05\T\20:53:27.172 [INFO] Apache Beam :: Examples ............................ SUCCESS
[  0.387 s]
2017-06-05\T\20:53:27.172 [INFO] Apache Beam :: Examples :: Java .................... SUCCESS
[08:17 min]
2017-06-05\T\20:53:27.172 [INFO] Apache Beam :: SDKs :: Java :: Maven Archetypes :: Examples
SUCCESS [ 23.568 s]
2017-06-05\T\20:53:27.172 [INFO] Apache Beam :: SDKs :: Java :: Extensions :: Jackson SUCCESS
[  5.905 s]
2017-06-05\T\20:53:27.172 [INFO] Apache Beam :: SDKs :: Java :: Extensions :: Join library
SUCCESS [  8.116 s]
2017-06-05\T\20:53:27.172 [INFO] Apache Beam :: SDKs :: Java :: Extensions :: Sorter  SUCCESS
[ 20.498 s]
2017-06-05\T\20:53:27.172 [INFO] Apache Beam :: Runners :: Flink .................... SUCCESS
[ 17.659 s]
2017-06-05\T\20:53:27.172 [INFO] Apache Beam :: Runners :: Spark .................... SUCCESS
[02:35 min]
2017-06-05\T\20:53:27.172 [INFO] Apache Beam :: SDKs :: Java :: Aggregated Javadoc .. FAILURE
[ 31.181 s]
2017-06-05\T\20:53:27.172 [INFO] ------------------------------------------------------------------------
2017-06-05\T\20:53:27.172 [INFO] BUILD FAILURE
2017-06-05\T\20:53:27.172 [INFO] ------------------------------------------------------------------------
2017-06-05\T\20:53:27.172 [INFO] Total time: 29:05 min
2017-06-05\T\20:53:27.172 [INFO] Finished at: 2017-06-05T20:53:27+00:00
2017-06-05\T\20:53:27.730 [INFO] Final Memory: 174M/1774M
2017-06-05\T\20:53:27.730 [INFO] ------------------------------------------------------------------------
2017-06-05\T\20:53:27.731 [ERROR] Failed to execute goal org.apache.maven.plugins:maven-antrun-plugin:1.8:run
(document) on project beam-sdks-java-javadoc: An Ant BuildException has occured: The following
error occurred while executing this line:
2017-06-05\T\20:53:27.731 [ERROR] java.lang.OutOfMemoryError: PermGen space
2017-06-05\T\20:53:27.731 [ERROR] around Ant part ...<ant antfile="<https://builds.apache.org/job/beam_PostCommit_Java_JDK_Versions_Test/jdk=JDK%201.7%20(latest),label=beam/ws/sdks/java/javadoc/ant.xml">...>
@ 8:153 in <https://builds.apache.org/job/beam_PostCommit_Java_JDK_Versions_Test/jdk=JDK%201.7%20(latest),label=beam/ws/sdks/java/javadoc/target/antrun/build-main.xml>
2017-06-05\T\20:53:27.731 [ERROR] -> [Help 1]
org.apache.maven.lifecycle.LifecycleExecutionException: Failed to execute goal org.apache.maven.plugins:maven-antrun-plugin:1.8:run
(document) on project beam-sdks-java-javadoc: An Ant BuildException has occured: The following
error occurred while executing this line:
java.lang.OutOfMemoryError: PermGen space
around Ant part ...<ant antfile="<https://builds.apache.org/job/beam_PostCommit_Java_JDK_Versions_Test/jdk=JDK%201.7%20(latest),label=beam/ws/sdks/java/javadoc/ant.xml">...>
@ 8:153 in <https://builds.apache.org/job/beam_PostCommit_Java_JDK_Versions_Test/jdk=JDK%201.7%20(latest),label=beam/ws/sdks/java/javadoc/target/antrun/build-main.xml>
	at org.apache.maven.lifecycle.internal.MojoExecutor.execute(MojoExecutor.java:216)
	at org.apache.maven.lifecycle.internal.MojoExecutor.execute(MojoExecutor.java:153)
	at org.apache.maven.lifecycle.internal.MojoExecutor.execute(MojoExecutor.java:145)
	at org.apache.maven.lifecycle.internal.LifecycleModuleBuilder.buildProject(LifecycleModuleBuilder.java:116)
	at org.apache.maven.lifecycle.internal.LifecycleModuleBuilder.buildProject(LifecycleModuleBuilder.java:80)
	at org.apache.maven.lifecycle.internal.builder.singlethreaded.SingleThreadedBuilder.build(SingleThreadedBuilder.java:51)
	at org.apache.maven.lifecycle.internal.LifecycleStarter.execute(LifecycleStarter.java:128)
	at org.apache.maven.DefaultMaven.doExecute(DefaultMaven.java:307)
	at org.apache.maven.DefaultMaven.doExecute(DefaultMaven.java:193)
	at org.apache.maven.DefaultMaven.execute(DefaultMaven.java:106)
	at org.apache.maven.cli.MavenCli.execute(MavenCli.java:862)
	at org.apache.maven.cli.MavenCli.doMain(MavenCli.java:286)
	at org.apache.maven.cli.MavenCli.main(MavenCli.java:197)
	at sun.reflect.NativeMethodAccessorImpl.invoke0(Native Method)
	at sun.reflect.NativeMethodAccessorImpl.invoke(NativeMethodAccessorImpl.java:57)
	at sun.reflect.DelegatingMethodAccessorImpl.invoke(DelegatingMethodAccessorImpl.java:43)
	at java.lang.reflect.Method.invoke(Method.java:606)
	at org.codehaus.plexus.classworlds.launcher.Launcher.launchEnhanced(Launcher.java:289)
	at org.codehaus.plexus.classworlds.launcher.Launcher.launch(Launcher.java:229)
	at org.codehaus.plexus.classworlds.launcher.Launcher.mainWithExitCode(Launcher.java:415)
	at org.codehaus.plexus.classworlds.launcher.Launcher.main(Launcher.java:356)
Caused by: org.apache.maven.plugin.MojoExecutionException: An Ant BuildException has occured:
The following error occurred while executing this line:
java.lang.OutOfMemoryError: PermGen space
around Ant part ...<ant antfile="<https://builds.apache.org/job/beam_PostCommit_Java_JDK_Versions_Test/jdk=JDK%201.7%20(latest),label=beam/ws/sdks/java/javadoc/ant.xml">...>
@ 8:153 in <https://builds.apache.org/job/beam_PostCommit_Java_JDK_Versions_Test/jdk=JDK%201.7%20(latest),label=beam/ws/sdks/java/javadoc/target/antrun/build-main.xml>
	at org.apache.maven.plugin.antrun.AntRunMojo.execute(AntRunMojo.java:342)
	at org.apache.maven.plugin.DefaultBuildPluginManager.executeMojo(DefaultBuildPluginManager.java:134)
	at org.apache.maven.lifecycle.internal.MojoExecutor.execute(MojoExecutor.java:208)
	... 20 more
Caused by: <https://builds.apache.org/job/beam_PostCommit_Java_JDK_Versions_Test/jdk=JDK%201.7%20(latest),label=beam/ws/sdks/java/javadoc/target/antrun/build-main.xml>:8:
The following error occurred while executing this line:
java.lang.OutOfMemoryError: PermGen space
	at org.apache.tools.ant.ProjectHelper.addLocationToBuildException(ProjectHelper.java:568)
	at org.apache.tools.ant.taskdefs.Ant.execute(Ant.java:443)
	at org.apache.tools.ant.UnknownElement.execute(UnknownElement.java:292)
	at sun.reflect.NativeMethodAccessorImpl.invoke0(Native Method)
	at sun.reflect.NativeMethodAccessorImpl.invoke(NativeMethodAccessorImpl.java:57)
	at sun.reflect.DelegatingMethodAccessorImpl.invoke(DelegatingMethodAccessorImpl.java:43)
	at java.lang.reflect.Method.invoke(Method.java:606)
	at org.apache.tools.ant.dispatch.DispatchUtils.execute(DispatchUtils.java:106)
	at org.apache.tools.ant.Task.perform(Task.java:348)
	at org.apache.tools.ant.Target.execute(Target.java:435)
	at org.apache.tools.ant.Target.performTasks(Target.java:456)
	at org.apache.tools.ant.Project.executeSortedTargets(Project.java:1393)
	at org.apache.tools.ant.Project.executeTarget(Project.java:1364)
	at org.apache.maven.plugin.antrun.AntRunMojo.execute(AntRunMojo.java:313)
	... 22 more
Caused by: java.lang.OutOfMemoryError: PermGen space
	at org.apache.tools.ant.Project.executeSortedTargets(Project.java:1402)
	at org.apache.tools.ant.helper.SingleCheckExecutor.executeTargets(SingleCheckExecutor.java:38)
	at org.apache.tools.ant.Project.executeTargets(Project.java:1248)
	at org.apache.tools.ant.taskdefs.Ant.execute(Ant.java:441)
	... 34 more
Caused by: java.lang.OutOfMemoryError: PermGen space
	at java.lang.ClassLoader.defineClass1(Native Method)
	at java.lang.ClassLoader.defineClass(ClassLoader.java:800)
	at java.security.SecureClassLoader.defineClass(SecureClassLoader.java:142)
	at java.net.URLClassLoader.defineClass(URLClassLoader.java:449)
	at java.net.URLClassLoader.access$100(URLClassLoader.java:71)
	at java.net.URLClassLoader$1.run(URLClassLoader.java:361)
	at java.net.URLClassLoader$1.run(URLClassLoader.java:355)
	at java.security.AccessController.doPrivileged(Native Method)
	at java.net.URLClassLoader.findClass(URLClassLoader.java:354)
	at org.codehaus.plexus.classworlds.realm.ClassRealm.loadClassFromSelf(ClassRealm.java:401)
	at org.codehaus.plexus.classworlds.strategy.SelfFirstStrategy.loadClass(SelfFirstStrategy.java:42)
	at org.codehaus.plexus.classworlds.realm.ClassRealm.unsynchronizedLoadClass(ClassRealm.java:271)
	at org.codehaus.plexus.classworlds.realm.ClassRealm.loadClass(ClassRealm.java:247)
	at org.codehaus.plexus.classworlds.realm.ClassRealm.loadClass(ClassRealm.java:239)
	at java.lang.ClassLoader.defineClass1(Native Method)
	at java.lang.ClassLoader.defineClass(ClassLoader.java:800)
	at java.security.SecureClassLoader.defineClass(SecureClassLoader.java:142)
	at java.net.URLClassLoader.defineClass(URLClassLoader.java:449)
	at java.net.URLClassLoader.access$100(URLClassLoader.java:71)
	at java.net.URLClassLoader$1.run(URLClassLoader.java:361)
	at java.net.URLClassLoader$1.run(URLClassLoader.java:355)
	at java.security.AccessController.doPrivileged(Native Method)
	at java.net.URLClassLoader.findClass(URLClassLoader.java:354)
	at org.codehaus.plexus.classworlds.realm.ClassRealm.loadClassFromSelf(ClassRealm.java:401)
	at org.codehaus.plexus.classworlds.strategy.SelfFirstStrategy.loadClass(SelfFirstStrategy.java:42)
	at org.codehaus.plexus.classworlds.realm.ClassRealm.unsynchronizedLoadClass(ClassRealm.java:271)
	at org.codehaus.plexus.classworlds.realm.ClassRealm.loadClass(ClassRealm.java:247)
	at org.codehaus.plexus.classworlds.realm.ClassRealm.loadClass(ClassRealm.java:239)
	at java.lang.Class.forName0(Native Method)
	at java.lang.Class.forName(Class.java:195)
	at org.apache.tools.ant.AntTypeDefinition.innerGetTypeClass(AntTypeDefinition.java:192)
	at org.apache.tools.ant.AntTypeDefinition.getTypeClass(AntTypeDefinition.java:168)
2017-06-05\T\20:53:27.732 [ERROR] 
2017-06-05\T\20:53:27.732 [ERROR] Re-run Maven using the -X switch to enable full debug logging.
2017-06-05\T\20:53:27.732 [ERROR] 
2017-06-05\T\20:53:27.732 [ERROR] For more information about the errors and possible solutions,
please read the following articles:
2017-06-05\T\20:53:27.732 [ERROR] [Help 1] http://cwiki.apache.org/confluence/display/MAVEN/MojoExecutionException
2017-06-05\T\20:53:27.732 [ERROR] 
2017-06-05\T\20:53:27.732 [ERROR] After correcting the problems, you can resume the build
with the command
2017-06-05\T\20:53:27.732 [ERROR]   mvn <goals> -rf :beam-sdks-java-javadoc
Build step 'Invoke top-level Maven targets' marked build as failure
Not sending mail to unregistered user kirpichov@google.com
Not sending mail to unregistered user aljoscha.krettek@gmail.com
Not sending mail to unregistered user klk@google.com
Not sending mail to unregistered user hepei.hp@alibaba-inc.com

Mime
View raw message