beam-commits mailing list archives

Site index · List index
Message view « Date » · « Thread »
Top « Date » · « Thread »
From Apache Jenkins Server <jenk...@builds.apache.org>
Subject Build failed in Jenkins: beam_PostCommit_Java_MavenInstall_Windows #110
Date Fri, 09 Jun 2017 00:39:51 GMT
See <https://builds.apache.org/job/beam_PostCommit_Java_MavenInstall_Windows/110/display/redirect?page=changes>

Changes:

[klk] Add Runner API oriented PTransformMatchers for DirectRunner overrides

[klk] DirectRunner override matchers using Runner API

[robertwb] Use inner module for non-public coders.

[kirpichov] Implements HCatalogIO

[kirpichov] Slight debuggability improvements in BigtableIO

[chamikara] Move Runner API protos to portability/runners/api

------------------------------------------
[...truncated 2.65 MB...]
2017-06-09T00:38:16.342 [INFO] Downloaded: https://repo.maven.apache.org/maven2/org/sonatype/gossip/gossip/1.8/gossip-1.8.pom
(12 KB at 938.0 KB/sec)
2017-06-09T00:38:16.346 [INFO] Downloading: https://repo.maven.apache.org/maven2/org/sonatype/forge/forge-parent/9/forge-parent-9.pom
2017-06-09T00:38:16.355 [INFO] Downloaded: https://repo.maven.apache.org/maven2/org/sonatype/forge/forge-parent/9/forge-parent-9.pom
(13 KB at 1426.0 KB/sec)
2017-06-09T00:38:16.359 [INFO] Downloading: https://repo.maven.apache.org/maven2/org/sonatype/gossip/gossip-core/1.8/gossip-core-1.8.pom
2017-06-09T00:38:16.368 [INFO] Downloaded: https://repo.maven.apache.org/maven2/org/sonatype/gossip/gossip-core/1.8/gossip-core-1.8.pom
(3 KB at 241.4 KB/sec)
2017-06-09T00:38:16.373 [INFO] Downloading: https://repo.maven.apache.org/maven2/org/sonatype/gossip/gossip-bootstrap/1.8/gossip-bootstrap-1.8.pom
2017-06-09T00:38:16.381 [INFO] Downloaded: https://repo.maven.apache.org/maven2/org/sonatype/gossip/gossip-bootstrap/1.8/gossip-bootstrap-1.8.pom
(2 KB at 196.7 KB/sec)
2017-06-09T00:38:16.385 [INFO] Downloading: https://repo.maven.apache.org/maven2/com/google/guava/guava/14.0.1/guava-14.0.1.pom
2017-06-09T00:38:16.393 [INFO] Downloaded: https://repo.maven.apache.org/maven2/com/google/guava/guava/14.0.1/guava-14.0.1.pom
(6 KB at 656.2 KB/sec)
2017-06-09T00:38:16.396 [INFO] Downloading: https://repo.maven.apache.org/maven2/com/google/guava/guava-parent/14.0.1/guava-parent-14.0.1.pom
2017-06-09T00:38:16.405 [INFO] Downloaded: https://repo.maven.apache.org/maven2/com/google/guava/guava-parent/14.0.1/guava-parent-14.0.1.pom
(3 KB at 277.2 KB/sec)
2017-06-09T00:38:16.409 [INFO] Downloading: https://repo.maven.apache.org/maven2/org/codehaus/plexus/plexus-classworlds/2.4.2/plexus-classworlds-2.4.2.pom
2017-06-09T00:38:16.417 [INFO] Downloaded: https://repo.maven.apache.org/maven2/org/codehaus/plexus/plexus-classworlds/2.4.2/plexus-classworlds-2.4.2.pom
(4 KB at 428.3 KB/sec)
2017-06-09T00:38:16.422 [INFO] Downloading: https://repo.maven.apache.org/maven2/org/codehaus/plexus/plexus-interpolation/1.16/plexus-interpolation-1.16.pom
2017-06-09T00:38:16.430 [INFO] Downloaded: https://repo.maven.apache.org/maven2/org/codehaus/plexus/plexus-interpolation/1.16/plexus-interpolation-1.16.pom
(2 KB at 125.4 KB/sec)
2017-06-09T00:38:16.436 [INFO] Downloading: https://repo.maven.apache.org/maven2/org/eclipse/aether/aether-api/0.9.0.M2/aether-api-0.9.0.M2.pom
2017-06-09T00:38:16.445 [INFO] Downloaded: https://repo.maven.apache.org/maven2/org/eclipse/aether/aether-api/0.9.0.M2/aether-api-0.9.0.M2.pom
(2 KB at 188.5 KB/sec)
2017-06-09T00:38:16.450 [INFO] Downloading: https://repo.maven.apache.org/maven2/org/codehaus/gmaven/gmaven-adapter-api/2.0/gmaven-adapter-api-2.0.pom
2017-06-09T00:38:16.459 [INFO] Downloaded: https://repo.maven.apache.org/maven2/org/codehaus/gmaven/gmaven-adapter-api/2.0/gmaven-adapter-api-2.0.pom
(2 KB at 196.0 KB/sec)
2017-06-09T00:38:16.464 [INFO] Downloading: https://repo.maven.apache.org/maven2/org/codehaus/gmaven/gmaven-adapter-impl/2.0/gmaven-adapter-impl-2.0.pom
2017-06-09T00:38:16.472 [INFO] Downloaded: https://repo.maven.apache.org/maven2/org/codehaus/gmaven/gmaven-adapter-impl/2.0/gmaven-adapter-impl-2.0.pom
(3 KB at 331.8 KB/sec)
2017-06-09T00:38:16.477 [INFO] Downloading: https://repo.maven.apache.org/maven2/org/codehaus/groovy/groovy-all/2.1.5/groovy-all-2.1.5.pom
2017-06-09T00:38:16.486 [INFO] Downloaded: https://repo.maven.apache.org/maven2/org/codehaus/groovy/groovy-all/2.1.5/groovy-all-2.1.5.pom
(18 KB at 1957.4 KB/sec)
2017-06-09T00:38:16.490 [INFO] Downloading: https://repo.maven.apache.org/maven2/org/apache/ant/ant/1.8.4/ant-1.8.4.pom
2017-06-09T00:38:16.500 [INFO] Downloaded: https://repo.maven.apache.org/maven2/org/apache/ant/ant/1.8.4/ant-1.8.4.pom
(10 KB at 942.8 KB/sec)
2017-06-09T00:38:16.504 [INFO] Downloading: https://repo.maven.apache.org/maven2/org/apache/ant/ant-parent/1.8.4/ant-parent-1.8.4.pom
2017-06-09T00:38:16.513 [INFO] Downloaded: https://repo.maven.apache.org/maven2/org/apache/ant/ant-parent/1.8.4/ant-parent-1.8.4.pom
(5 KB at 494.9 KB/sec)
2017-06-09T00:38:16.517 [INFO] Downloading: https://repo.maven.apache.org/maven2/org/apache/ant/ant-launcher/1.8.4/ant-launcher-1.8.4.pom
2017-06-09T00:38:16.526 [INFO] Downloaded: https://repo.maven.apache.org/maven2/org/apache/ant/ant-launcher/1.8.4/ant-launcher-1.8.4.pom
(3 KB at 256.2 KB/sec)
2017-06-09T00:38:16.530 [INFO] Downloading: https://repo.maven.apache.org/maven2/org/fusesource/jansi/jansi/1.11/jansi-1.11.pom
2017-06-09T00:38:16.538 [INFO] Downloaded: https://repo.maven.apache.org/maven2/org/fusesource/jansi/jansi/1.11/jansi-1.11.pom
(4 KB at 439.6 KB/sec)
2017-06-09T00:38:16.541 [INFO] Downloading: https://repo.maven.apache.org/maven2/org/fusesource/jansi/jansi-project/1.11/jansi-project-1.11.pom
2017-06-09T00:38:16.550 [INFO] Downloaded: https://repo.maven.apache.org/maven2/org/fusesource/jansi/jansi-project/1.11/jansi-project-1.11.pom
(12 KB at 1242.1 KB/sec)
2017-06-09T00:38:16.554 [INFO] Downloading: https://repo.maven.apache.org/maven2/org/fusesource/fusesource-pom/1.8/fusesource-pom-1.8.pom
2017-06-09T00:38:16.562 [INFO] Downloaded: https://repo.maven.apache.org/maven2/org/fusesource/fusesource-pom/1.8/fusesource-pom-1.8.pom
(15 KB at 1788.9 KB/sec)
2017-06-09T00:38:16.575 [INFO] Downloading: https://repo.maven.apache.org/maven2/org/sonatype/gossip/gossip-core/1.8/gossip-core-1.8.jar
2017-06-09T00:38:16.575 [INFO] Downloading: https://repo.maven.apache.org/maven2/org/sonatype/gossip/gossip-slf4j/1.8/gossip-slf4j-1.8.jar
2017-06-09T00:38:16.577 [INFO] Downloading: https://repo.maven.apache.org/maven2/com/google/guava/guava/14.0.1/guava-14.0.1.jar
2017-06-09T00:38:16.577 [INFO] Downloading: https://repo.maven.apache.org/maven2/org/sonatype/gossip/gossip-bootstrap/1.8/gossip-bootstrap-1.8.jar
2017-06-09T00:38:16.578 [INFO] Downloading: https://repo.maven.apache.org/maven2/org/codehaus/plexus/plexus-classworlds/2.4.2/plexus-classworlds-2.4.2.jar
2017-06-09T00:38:16.590 [INFO] Downloaded: https://repo.maven.apache.org/maven2/org/sonatype/gossip/gossip-slf4j/1.8/gossip-slf4j-1.8.jar
(5 KB at 275.2 KB/sec)
2017-06-09T00:38:16.590 [INFO] Downloading: https://repo.maven.apache.org/maven2/org/codehaus/plexus/plexus-interpolation/1.16/plexus-interpolation-1.16.jar
2017-06-09T00:38:16.597 [INFO] Downloaded: https://repo.maven.apache.org/maven2/org/sonatype/gossip/gossip-bootstrap/1.8/gossip-bootstrap-1.8.jar
(20 KB at 877.0 KB/sec)
2017-06-09T00:38:16.597 [INFO] Downloading: https://repo.maven.apache.org/maven2/org/eclipse/aether/aether-api/0.9.0.M2/aether-api-0.9.0.M2.jar
2017-06-09T00:38:16.598 [INFO] Downloaded: https://repo.maven.apache.org/maven2/org/sonatype/gossip/gossip-core/1.8/gossip-core-1.8.jar
(57 KB at 2454.7 KB/sec)
2017-06-09T00:38:16.598 [INFO] Downloading: https://repo.maven.apache.org/maven2/org/codehaus/gmaven/gmaven-adapter-api/2.0/gmaven-adapter-api-2.0.jar
2017-06-09T00:38:16.597 [INFO] Downloaded: https://repo.maven.apache.org/maven2/org/codehaus/plexus/plexus-classworlds/2.4.2/plexus-classworlds-2.4.2.jar
(46 KB at 2184.2 KB/sec)
2017-06-09T00:38:16.598 [INFO] Downloading: https://repo.maven.apache.org/maven2/org/codehaus/gmaven/gmaven-adapter-impl/2.0/gmaven-adapter-impl-2.0.jar
2017-06-09T00:38:16.611 [INFO] Downloaded: https://repo.maven.apache.org/maven2/org/codehaus/plexus/plexus-interpolation/1.16/plexus-interpolation-1.16.jar
(60 KB at 1760.9 KB/sec)
2017-06-09T00:38:16.611 [INFO] Downloading: https://repo.maven.apache.org/maven2/org/codehaus/groovy/groovy-all/2.1.5/groovy-all-2.1.5.jar
2017-06-09T00:38:16.612 [INFO] Downloaded: https://repo.maven.apache.org/maven2/org/codehaus/gmaven/gmaven-adapter-api/2.0/gmaven-adapter-api-2.0.jar
(7 KB at 197.5 KB/sec)
2017-06-09T00:38:16.612 [INFO] Downloading: https://repo.maven.apache.org/maven2/org/apache/ant/ant/1.8.4/ant-1.8.4.jar
2017-06-09T00:38:16.613 [INFO] Downloaded: https://repo.maven.apache.org/maven2/org/codehaus/gmaven/gmaven-adapter-impl/2.0/gmaven-adapter-impl-2.0.jar
(16 KB at 438.7 KB/sec)
2017-06-09T00:38:16.613 [INFO] Downloading: https://repo.maven.apache.org/maven2/org/apache/ant/ant-launcher/1.8.4/ant-launcher-1.8.4.jar
2017-06-09T00:38:16.621 [INFO] Downloaded: https://repo.maven.apache.org/maven2/org/eclipse/aether/aether-api/0.9.0.M2/aether-api-0.9.0.M2.jar
(131 KB at 2973.1 KB/sec)
2017-06-09T00:38:16.621 [INFO] Downloading: https://repo.maven.apache.org/maven2/org/fusesource/jansi/jansi/1.11/jansi-1.11.jar
2017-06-09T00:38:16.644 [INFO] Downloaded: https://repo.maven.apache.org/maven2/org/apache/ant/ant-launcher/1.8.4/ant-launcher-1.8.4.jar
(18 KB at 268.6 KB/sec)
2017-06-09T00:38:16.650 [INFO] Downloaded: https://repo.maven.apache.org/maven2/org/fusesource/jansi/jansi/1.11/jansi-1.11.jar
(112 KB at 1530.6 KB/sec)
2017-06-09T00:38:16.795 [INFO] Downloaded: https://repo.maven.apache.org/maven2/com/google/guava/guava/14.0.1/guava-14.0.1.jar
(2138 KB at 9717.3 KB/sec)
2017-06-09T00:38:16.813 [INFO] Downloaded: https://repo.maven.apache.org/maven2/org/apache/ant/ant/1.8.4/ant-1.8.4.jar
(1897 KB at 8034.8 KB/sec)
2017-06-09T00:38:17.227 [INFO] Downloaded: https://repo.maven.apache.org/maven2/org/codehaus/groovy/groovy-all/2.1.5/groovy-all-2.1.5.jar
(6219 KB at 9566.6 KB/sec)
[JENKINS] Archiving disabled
2017-06-09T00:38:20.923 [INFO]                                                           
             
2017-06-09T00:38:20.923 [INFO] ------------------------------------------------------------------------
2017-06-09T00:38:20.923 [INFO] Skipping Apache Beam :: Parent
2017-06-09T00:38:20.923 [INFO] This project has been banned from the build due to previous
failures.
2017-06-09T00:38:20.923 [INFO] ------------------------------------------------------------------------
[JENKINS] Archiving disabled
[JENKINS] Archiving disabled
[JENKINS] Archiving disabled
[JENKINS] Archiving disabled
[JENKINS] Archiving disabled
[JENKINS] Archiving disabled
[JENKINS] Archiving disabled
[JENKINS] Archiving disabled
[JENKINS] Archiving disabled
[JENKINS] Archiving disabled
[JENKINS] Archiving disabled
[JENKINS] Archiving disabled
[JENKINS] Archiving disabled
[JENKINS] Archiving disabled
[JENKINS] Archiving disabled
[JENKINS] Archiving disabled
[JENKINS] Archiving disabled
[JENKINS] Archiving disabled
[JENKINS] Archiving disabled
[JENKINS] Archiving disabled
[JENKINS] Archiving disabled
[JENKINS] Archiving disabled
[JENKINS] Archiving disabled
[JENKINS] Archiving disabled
[JENKINS] Archiving disabled
[JENKINS] Archiving disabled
[JENKINS] Archiving disabled
[JENKINS] Archiving disabled
[JENKINS] Archiving disabled
[JENKINS] Archiving disabled
[JENKINS] Archiving disabled
[JENKINS] Archiving disabled
[JENKINS] Archiving disabled
[JENKINS] Archiving disabled
[JENKINS] Archiving disabled
[JENKINS] Archiving disabled
[JENKINS] Archiving disabled
[JENKINS] Archiving disabled
[JENKINS] Archiving disabled
[JENKINS] Archiving disabled
[JENKINS] Archiving disabled
[JENKINS] Archiving disabled
[JENKINS] Archiving disabled
[JENKINS] Archiving disabled
[JENKINS] Archiving disabled
[JENKINS] Archiving disabled
[JENKINS] Archiving disabled
[JENKINS] Archiving disabled
[JENKINS] Archiving disabled
[JENKINS] Archiving disabled
2017-06-09T00:39:25.317 [INFO] ------------------------------------------------------------------------
2017-06-09T00:39:25.317 [INFO] Reactor Summary:
2017-06-09T00:39:25.317 [INFO] 
2017-06-09T00:39:25.317 [INFO] Apache Beam :: Parent .............................. SUCCESS
[ 30.971 s]
2017-06-09T00:39:25.317 [INFO] Apache Beam :: SDKs :: Java :: Build Tools ......... SUCCESS
[ 17.655 s]
2017-06-09T00:39:25.318 [INFO] Apache Beam :: SDKs ................................ SUCCESS
[  8.411 s]
2017-06-09T00:39:25.318 [INFO] Apache Beam :: SDKs :: Common ...................... SUCCESS
[  5.410 s]
2017-06-09T00:39:25.318 [INFO] Apache Beam :: SDKs :: Common :: Runner API ........ SUCCESS
[ 24.870 s]
2017-06-09T00:39:25.318 [INFO] Apache Beam :: SDKs :: Common :: Fn API ............ SUCCESS
[ 24.381 s]
2017-06-09T00:39:25.318 [INFO] Apache Beam :: SDKs :: Java ........................ SUCCESS
[  8.255 s]
2017-06-09T00:39:25.318 [INFO] Apache Beam :: SDKs :: Java :: Core ................ SUCCESS
[04:10 min]
2017-06-09T00:39:25.318 [INFO] Apache Beam :: Runners ............................. SUCCESS
[  5.485 s]
2017-06-09T00:39:25.318 [INFO] Apache Beam :: Runners :: Core Construction Java ... SUCCESS
[ 49.468 s]
2017-06-09T00:39:25.318 [INFO] Apache Beam :: Runners :: Core Java ................ SUCCESS
[01:08 min]
2017-06-09T00:39:25.318 [INFO] Apache Beam :: Runners :: Direct Java .............. SUCCESS
[03:30 min]
2017-06-09T00:39:25.318 [INFO] Apache Beam :: SDKs :: Java :: IO .................. SUCCESS
[  5.559 s]
2017-06-09T00:39:25.318 [INFO] Apache Beam :: SDKs :: Java :: IO :: Common ........ SUCCESS
[ 10.607 s]
2017-06-09T00:39:25.318 [INFO] Apache Beam :: SDKs :: Java :: IO :: Cassandra ..... SUCCESS
[ 38.716 s]
2017-06-09T00:39:25.318 [INFO] Apache Beam :: SDKs :: Java :: IO :: Elasticsearch . SUCCESS
[ 56.672 s]
2017-06-09T00:39:25.318 [INFO] Apache Beam :: SDKs :: Java :: Extensions .......... SUCCESS
[  8.268 s]
2017-06-09T00:39:25.318 [INFO] Apache Beam :: SDKs :: Java :: Extensions :: Google Cloud Platform
Core SUCCESS [ 53.677 s]
2017-06-09T00:39:25.318 [INFO] Apache Beam :: SDKs :: Java :: Extensions :: Protobuf SUCCESS
[ 30.134 s]
2017-06-09T00:39:25.318 [INFO] Apache Beam :: SDKs :: Java :: IO :: Google Cloud Platform
SUCCESS [01:34 min]
2017-06-09T00:39:25.319 [INFO] Apache Beam :: SDKs :: Java :: IO :: Hadoop Common . SUCCESS
[ 34.013 s]
2017-06-09T00:39:25.319 [INFO] Apache Beam :: SDKs :: Java :: IO :: Hadoop File System SUCCESS
[ 41.235 s]
2017-06-09T00:39:25.319 [INFO] Apache Beam :: SDKs :: Java :: IO :: Hadoop ........ SUCCESS
[  9.597 s]
2017-06-09T00:39:25.319 [INFO] Apache Beam :: SDKs :: Java :: IO :: Hadoop :: input-format
SUCCESS [ 33.325 s]
2017-06-09T00:39:25.319 [INFO] Apache Beam :: SDKs :: Java :: IO :: Hadoop :: jdk1.8-tests
SUCCESS [01:42 min]
2017-06-09T00:39:25.319 [INFO] Apache Beam :: SDKs :: Java :: IO :: HBase ......... SUCCESS
[ 44.309 s]
2017-06-09T00:39:25.319 [INFO] Apache Beam :: SDKs :: Java :: IO :: HCatalog ...... SUCCESS
[01:03 min]
2017-06-09T00:39:25.319 [INFO] Apache Beam :: SDKs :: Java :: IO :: JDBC .......... SUCCESS
[ 45.481 s]
2017-06-09T00:39:25.319 [INFO] Apache Beam :: SDKs :: Java :: IO :: JMS ........... SUCCESS
[ 41.042 s]
2017-06-09T00:39:25.319 [INFO] Apache Beam :: SDKs :: Java :: IO :: Kafka ......... SUCCESS
[ 46.840 s]
2017-06-09T00:39:25.319 [INFO] Apache Beam :: SDKs :: Java :: IO :: Kinesis ....... SUCCESS
[ 39.310 s]
2017-06-09T00:39:25.319 [INFO] Apache Beam :: SDKs :: Java :: IO :: MongoDB ....... SUCCESS
[ 47.664 s]
2017-06-09T00:39:25.319 [INFO] Apache Beam :: SDKs :: Java :: IO :: MQTT .......... SUCCESS
[ 33.799 s]
2017-06-09T00:39:25.319 [INFO] Apache Beam :: SDKs :: Java :: IO :: XML ........... SUCCESS
[ 31.468 s]
2017-06-09T00:39:25.319 [INFO] Apache Beam :: SDKs :: Java :: Maven Archetypes .... SUCCESS
[  4.726 s]
2017-06-09T00:39:25.319 [INFO] Apache Beam :: SDKs :: Java :: Maven Archetypes :: Starter
SUCCESS [ 27.702 s]
2017-06-09T00:39:25.319 [INFO] Apache Beam :: SDKs :: Java :: Extensions :: Jackson SUCCESS
[ 27.222 s]
2017-06-09T00:39:25.319 [INFO] Apache Beam :: SDKs :: Java :: Extensions :: Join library SUCCESS
[ 29.994 s]
2017-06-09T00:39:25.319 [INFO] Apache Beam :: SDKs :: Java :: Extensions :: Sorter  SUCCESS
[ 37.613 s]
2017-06-09T00:39:25.319 [INFO] Apache Beam :: Runners :: Google Cloud Dataflow .... SUCCESS
[ 52.361 s]
2017-06-09T00:39:25.319 [INFO] Apache Beam :: SDKs :: Java :: Harness ............. SUCCESS
[ 57.022 s]
2017-06-09T00:39:25.320 [INFO] Apache Beam :: SDKs :: Java :: Java 8 Tests ........ SUCCESS
[ 24.851 s]
2017-06-09T00:39:25.320 [INFO] Apache Beam :: SDKs :: Python ...................... FAILURE
[  3.530 s]
2017-06-09T00:39:25.320 [INFO] Apache Beam :: Runners :: Flink .................... SKIPPED
2017-06-09T00:39:25.320 [INFO] Apache Beam :: Runners :: Spark .................... SKIPPED
2017-06-09T00:39:25.320 [INFO] Apache Beam :: Runners :: Apex ..................... SKIPPED
2017-06-09T00:39:25.320 [INFO] Apache Beam :: Examples ............................ SKIPPED
2017-06-09T00:39:25.320 [INFO] Apache Beam :: Examples :: Java .................... SKIPPED
2017-06-09T00:39:25.320 [INFO] Apache Beam :: Examples :: Java 8 .................. SKIPPED
2017-06-09T00:39:25.320 [INFO] Apache Beam :: SDKs :: Java :: Aggregated Javadoc .. SKIPPED
2017-06-09T00:39:25.320 [INFO] ------------------------------------------------------------------------
2017-06-09T00:39:25.320 [INFO] BUILD FAILURE
2017-06-09T00:39:25.320 [INFO] ------------------------------------------------------------------------
2017-06-09T00:39:25.320 [INFO] Total time: 34:14 min
2017-06-09T00:39:25.321 [INFO] Finished at: 2017-06-09T00:39:25+00:00
2017-06-09T00:39:26.856 [INFO] Final Memory: 407M/3282M
2017-06-09T00:39:26.857 [INFO] ------------------------------------------------------------------------
Waiting for Jenkins to finish collecting data
2017-06-09T00:39:27.371 [ERROR] Failed to execute goal org.codehaus.gmaven:groovy-maven-plugin:2.0:execute
(find-supported-python-for-clean) on project beam-sdks-python: Unable to find Python 2.7 in
path -> [Help 1]
org.apache.maven.lifecycle.LifecycleExecutionException: Failed to execute goal org.codehaus.gmaven:groovy-maven-plugin:2.0:execute
(find-supported-python-for-clean) on project beam-sdks-python: Unable to find Python 2.7 in
path
	at org.apache.maven.lifecycle.internal.MojoExecutor.execute(MojoExecutor.java:212)
	at org.apache.maven.lifecycle.internal.MojoExecutor.execute(MojoExecutor.java:153)
	at org.apache.maven.lifecycle.internal.MojoExecutor.execute(MojoExecutor.java:145)
	at org.apache.maven.lifecycle.internal.LifecycleModuleBuilder.buildProject(LifecycleModuleBuilder.java:116)
	at org.apache.maven.lifecycle.internal.LifecycleModuleBuilder.buildProject(LifecycleModuleBuilder.java:80)
	at org.apache.maven.lifecycle.internal.builder.singlethreaded.SingleThreadedBuilder.build(SingleThreadedBuilder.java:51)
	at org.apache.maven.lifecycle.internal.LifecycleStarter.execute(LifecycleStarter.java:128)
	at org.apache.maven.DefaultMaven.doExecute(DefaultMaven.java:307)
	at org.apache.maven.DefaultMaven.doExecute(DefaultMaven.java:193)
	at org.apache.maven.DefaultMaven.execute(DefaultMaven.java:106)
	at org.jvnet.hudson.maven3.launcher.Maven33Launcher.main(Maven33Launcher.java:129)
	at sun.reflect.NativeMethodAccessorImpl.invoke0(Native Method)
	at sun.reflect.NativeMethodAccessorImpl.invoke(NativeMethodAccessorImpl.java:62)
	at sun.reflect.DelegatingMethodAccessorImpl.invoke(DelegatingMethodAccessorImpl.java:43)
	at java.lang.reflect.Method.invoke(Method.java:498)
	at org.codehaus.plexus.classworlds.launcher.Launcher.launchStandard(Launcher.java:330)
	at org.codehaus.plexus.classworlds.launcher.Launcher.launch(Launcher.java:238)
	at jenkins.maven3.agent.Maven33Main.launch(Maven33Main.java:176)
	at sun.reflect.NativeMethodAccessorImpl.invoke0(Native Method)
	at sun.reflect.NativeMethodAccessorImpl.invoke(NativeMethodAccessorImpl.java:62)
	at sun.reflect.DelegatingMethodAccessorImpl.invoke(DelegatingMethodAccessorImpl.java:43)
	at java.lang.reflect.Method.invoke(Method.java:498)
	at hudson.maven.Maven3Builder.call(Maven3Builder.java:139)
	at hudson.maven.Maven3Builder.call(Maven3Builder.java:70)
	at hudson.remoting.UserRequest.perform(UserRequest.java:153)
	at hudson.remoting.UserRequest.perform(UserRequest.java:50)
	at hudson.remoting.Request$2.run(Request.java:336)
	at hudson.remoting.InterceptingExecutorService$1.call(InterceptingExecutorService.java:68)
	at java.util.concurrent.FutureTask.run(FutureTask.java:266)
	at java.util.concurrent.ThreadPoolExecutor.runWorker(ThreadPoolExecutor.java:1142)
	at java.util.concurrent.ThreadPoolExecutor$Worker.run(ThreadPoolExecutor.java:617)
	at java.lang.Thread.run(Thread.java:745)
Caused by: org.apache.maven.plugin.MojoFailureException: Unable to find Python 2.7 in path
	at sun.reflect.NativeConstructorAccessorImpl.newInstance0(Native Method)
	at sun.reflect.NativeConstructorAccessorImpl.newInstance(NativeConstructorAccessorImpl.java:62)
	at sun.reflect.DelegatingConstructorAccessorImpl.newInstance(DelegatingConstructorAccessorImpl.java:45)
	at java.lang.reflect.Constructor.newInstance(Constructor.java:423)
	at org.codehaus.groovy.reflection.CachedConstructor.invoke(CachedConstructor.java:77)
	at org.codehaus.groovy.runtime.callsite.ConstructorSite$ConstructorSiteNoUnwrapNoCoerce.callConstructor(ConstructorSite.java:102)
	at org.codehaus.groovy.runtime.callsite.CallSiteArray.defaultCallConstructor(CallSiteArray.java:57)
	at org.codehaus.groovy.runtime.callsite.AbstractCallSite.callConstructor(AbstractCallSite.java:182)
	at org.codehaus.groovy.runtime.callsite.AbstractCallSite.callConstructor(AbstractCallSite.java:190)
	at findSupportedPython.run(findSupportedPython.groovy:70)
	at groovy.lang.GroovyShell.evaluate(GroovyShell.java:518)
	at org.codehaus.gmaven.adapter.impl.ScriptExecutorImpl.execute(ScriptExecutorImpl.java:80)
	at org.codehaus.gmaven.plugin.ExecuteMojo$1.run(ExecuteMojo.java:100)
	at org.codehaus.gmaven.plugin.util.SystemNoExitGuard.run(SystemNoExitGuard.java:45)
	at org.codehaus.gmaven.plugin.ExecuteMojo.run(ExecuteMojo.java:96)
	at org.codehaus.gmaven.plugin.MojoSupport.execute(MojoSupport.java:45)
	at org.apache.maven.plugin.DefaultBuildPluginManager.executeMojo(DefaultBuildPluginManager.java:134)
	at org.apache.maven.lifecycle.internal.MojoExecutor.execute(MojoExecutor.java:208)
	... 31 more
2017-06-09T00:39:27.375 [ERROR] 
2017-06-09T00:39:27.375 [ERROR] Re-run Maven using the -X switch to enable full debug logging.
2017-06-09T00:39:27.375 [ERROR] 
2017-06-09T00:39:27.375 [ERROR] For more information about the errors and possible solutions,
please read the following articles:
2017-06-09T00:39:27.375 [ERROR] [Help 1] http://cwiki.apache.org/confluence/display/MAVEN/MojoFailureException
2017-06-09T00:39:27.376 [ERROR] 
2017-06-09T00:39:27.376 [ERROR] After correcting the problems, you can resume the build with
the command
2017-06-09T00:39:27.376 [ERROR]   mvn <goals> -rf :beam-sdks-python
channel stopped
Not sending mail to unregistered user github@nakomis.com
Not sending mail to unregistered user ccy@google.com
Not sending mail to unregistered user mingmxu@ebay.com
Not sending mail to unregistered user kirpichov@google.com
Not sending mail to unregistered user aljoscha.krettek@gmail.com
Not sending mail to unregistered user klk@google.com
Not sending mail to unregistered user sourabhbajaj@google.com
Not sending mail to unregistered user hepei.hp@alibaba-inc.com

Mime
View raw message