beam-commits mailing list archives

Site index · List index
Message view « Date » · « Thread »
Top « Date » · « Thread »
From Apache Jenkins Server <jenk...@builds.apache.org>
Subject Build failed in Jenkins: beam_PostCommit_Java_MavenInstall_Windows #119
Date Sun, 11 Jun 2017 06:34:42 GMT
See <https://builds.apache.org/job/beam_PostCommit_Java_MavenInstall_Windows/119/display/redirect>

------------------------------------------
[...truncated 2.64 MB...]
2017-06-11T06:33:10.822 [INFO] Downloading: https://repo.maven.apache.org/maven2/org/sonatype/gossip/gossip/1.8/gossip-1.8.pom
2017-06-11T06:33:10.833 [INFO] Downloaded: https://repo.maven.apache.org/maven2/org/sonatype/gossip/gossip/1.8/gossip-1.8.pom
(12 KB at 1023.3 KB/sec)
2017-06-11T06:33:10.836 [INFO] Downloading: https://repo.maven.apache.org/maven2/org/sonatype/forge/forge-parent/9/forge-parent-9.pom
2017-06-11T06:33:10.845 [INFO] Downloaded: https://repo.maven.apache.org/maven2/org/sonatype/forge/forge-parent/9/forge-parent-9.pom
(13 KB at 1426.0 KB/sec)
2017-06-11T06:33:10.856 [INFO] Downloading: https://repo.maven.apache.org/maven2/org/sonatype/gossip/gossip-core/1.8/gossip-core-1.8.pom
2017-06-11T06:33:10.867 [INFO] Downloaded: https://repo.maven.apache.org/maven2/org/sonatype/gossip/gossip-core/1.8/gossip-core-1.8.pom
(3 KB at 197.5 KB/sec)
2017-06-11T06:33:10.871 [INFO] Downloading: https://repo.maven.apache.org/maven2/org/sonatype/gossip/gossip-bootstrap/1.8/gossip-bootstrap-1.8.pom
2017-06-11T06:33:10.880 [INFO] Downloaded: https://repo.maven.apache.org/maven2/org/sonatype/gossip/gossip-bootstrap/1.8/gossip-bootstrap-1.8.pom
(2 KB at 157.3 KB/sec)
2017-06-11T06:33:10.885 [INFO] Downloading: https://repo.maven.apache.org/maven2/com/google/guava/guava/14.0.1/guava-14.0.1.pom
2017-06-11T06:33:10.894 [INFO] Downloaded: https://repo.maven.apache.org/maven2/com/google/guava/guava/14.0.1/guava-14.0.1.pom
(6 KB at 583.3 KB/sec)
2017-06-11T06:33:10.898 [INFO] Downloading: https://repo.maven.apache.org/maven2/com/google/guava/guava-parent/14.0.1/guava-parent-14.0.1.pom
2017-06-11T06:33:10.907 [INFO] Downloaded: https://repo.maven.apache.org/maven2/com/google/guava/guava-parent/14.0.1/guava-parent-14.0.1.pom
(3 KB at 277.2 KB/sec)
2017-06-11T06:33:10.911 [INFO] Downloading: https://repo.maven.apache.org/maven2/org/codehaus/plexus/plexus-classworlds/2.4.2/plexus-classworlds-2.4.2.pom
2017-06-11T06:33:10.921 [INFO] Downloaded: https://repo.maven.apache.org/maven2/org/codehaus/plexus/plexus-classworlds/2.4.2/plexus-classworlds-2.4.2.pom
(4 KB at 342.7 KB/sec)
2017-06-11T06:33:10.925 [INFO] Downloading: https://repo.maven.apache.org/maven2/org/codehaus/plexus/plexus-interpolation/1.16/plexus-interpolation-1.16.pom
2017-06-11T06:33:10.936 [INFO] Downloaded: https://repo.maven.apache.org/maven2/org/codehaus/plexus/plexus-interpolation/1.16/plexus-interpolation-1.16.pom
(2 KB at 91.2 KB/sec)
2017-06-11T06:33:10.940 [INFO] Downloading: https://repo.maven.apache.org/maven2/org/eclipse/aether/aether-api/0.9.0.M2/aether-api-0.9.0.M2.pom
2017-06-11T06:33:10.949 [INFO] Downloaded: https://repo.maven.apache.org/maven2/org/eclipse/aether/aether-api/0.9.0.M2/aether-api-0.9.0.M2.pom
(2 KB at 212.0 KB/sec)
2017-06-11T06:33:10.953 [INFO] Downloading: https://repo.maven.apache.org/maven2/org/codehaus/gmaven/gmaven-adapter-api/2.0/gmaven-adapter-api-2.0.pom
2017-06-11T06:33:10.962 [INFO] Downloaded: https://repo.maven.apache.org/maven2/org/codehaus/gmaven/gmaven-adapter-api/2.0/gmaven-adapter-api-2.0.pom
(2 KB at 196.0 KB/sec)
2017-06-11T06:33:10.967 [INFO] Downloading: https://repo.maven.apache.org/maven2/org/codehaus/gmaven/gmaven-adapter-impl/2.0/gmaven-adapter-impl-2.0.pom
2017-06-11T06:33:10.977 [INFO] Downloaded: https://repo.maven.apache.org/maven2/org/codehaus/gmaven/gmaven-adapter-impl/2.0/gmaven-adapter-impl-2.0.pom
(3 KB at 265.4 KB/sec)
2017-06-11T06:33:10.982 [INFO] Downloading: https://repo.maven.apache.org/maven2/org/codehaus/groovy/groovy-all/2.1.5/groovy-all-2.1.5.pom
2017-06-11T06:33:11.073 [INFO] Downloaded: https://repo.maven.apache.org/maven2/org/codehaus/groovy/groovy-all/2.1.5/groovy-all-2.1.5.pom
(18 KB at 193.6 KB/sec)
2017-06-11T06:33:11.078 [INFO] Downloading: https://repo.maven.apache.org/maven2/org/apache/ant/ant/1.8.4/ant-1.8.4.pom
2017-06-11T06:33:11.089 [INFO] Downloaded: https://repo.maven.apache.org/maven2/org/apache/ant/ant/1.8.4/ant-1.8.4.pom
(10 KB at 857.1 KB/sec)
2017-06-11T06:33:11.092 [INFO] Downloading: https://repo.maven.apache.org/maven2/org/apache/ant/ant-parent/1.8.4/ant-parent-1.8.4.pom
2017-06-11T06:33:11.101 [INFO] Downloaded: https://repo.maven.apache.org/maven2/org/apache/ant/ant-parent/1.8.4/ant-parent-1.8.4.pom
(5 KB at 494.9 KB/sec)
2017-06-11T06:33:11.105 [INFO] Downloading: https://repo.maven.apache.org/maven2/org/apache/ant/ant-launcher/1.8.4/ant-launcher-1.8.4.pom
2017-06-11T06:33:11.117 [INFO] Downloaded: https://repo.maven.apache.org/maven2/org/apache/ant/ant-launcher/1.8.4/ant-launcher-1.8.4.pom
(3 KB at 192.1 KB/sec)
2017-06-11T06:33:11.120 [INFO] Downloading: https://repo.maven.apache.org/maven2/org/fusesource/jansi/jansi/1.11/jansi-1.11.pom
2017-06-11T06:33:11.130 [INFO] Downloaded: https://repo.maven.apache.org/maven2/org/fusesource/jansi/jansi/1.11/jansi-1.11.pom
(4 KB at 351.7 KB/sec)
2017-06-11T06:33:11.134 [INFO] Downloading: https://repo.maven.apache.org/maven2/org/fusesource/jansi/jansi-project/1.11/jansi-project-1.11.pom
2017-06-11T06:33:11.143 [INFO] Downloaded: https://repo.maven.apache.org/maven2/org/fusesource/jansi/jansi-project/1.11/jansi-project-1.11.pom
(12 KB at 1242.1 KB/sec)
2017-06-11T06:33:11.146 [INFO] Downloading: https://repo.maven.apache.org/maven2/org/fusesource/fusesource-pom/1.8/fusesource-pom-1.8.pom
2017-06-11T06:33:11.156 [INFO] Downloaded: https://repo.maven.apache.org/maven2/org/fusesource/fusesource-pom/1.8/fusesource-pom-1.8.pom
(15 KB at 1431.2 KB/sec)
2017-06-11T06:33:11.171 [INFO] Downloading: https://repo.maven.apache.org/maven2/org/sonatype/gossip/gossip-slf4j/1.8/gossip-slf4j-1.8.jar
2017-06-11T06:33:11.171 [INFO] Downloading: https://repo.maven.apache.org/maven2/org/sonatype/gossip/gossip-core/1.8/gossip-core-1.8.jar
2017-06-11T06:33:11.171 [INFO] Downloading: https://repo.maven.apache.org/maven2/org/sonatype/gossip/gossip-bootstrap/1.8/gossip-bootstrap-1.8.jar
2017-06-11T06:33:11.171 [INFO] Downloading: https://repo.maven.apache.org/maven2/com/google/guava/guava/14.0.1/guava-14.0.1.jar
2017-06-11T06:33:11.171 [INFO] Downloading: https://repo.maven.apache.org/maven2/org/codehaus/plexus/plexus-classworlds/2.4.2/plexus-classworlds-2.4.2.jar
2017-06-11T06:33:11.185 [INFO] Downloaded: https://repo.maven.apache.org/maven2/org/sonatype/gossip/gossip-slf4j/1.8/gossip-slf4j-1.8.jar
(5 KB at 275.2 KB/sec)
2017-06-11T06:33:11.185 [INFO] Downloading: https://repo.maven.apache.org/maven2/org/codehaus/plexus/plexus-interpolation/1.16/plexus-interpolation-1.16.jar
2017-06-11T06:33:11.186 [INFO] Downloaded: https://repo.maven.apache.org/maven2/org/sonatype/gossip/gossip-bootstrap/1.8/gossip-bootstrap-1.8.jar
(20 KB at 1286.3 KB/sec)
2017-06-11T06:33:11.186 [INFO] Downloading: https://repo.maven.apache.org/maven2/org/eclipse/aether/aether-api/0.9.0.M2/aether-api-0.9.0.M2.jar
2017-06-11T06:33:11.190 [INFO] Downloaded: https://repo.maven.apache.org/maven2/org/codehaus/plexus/plexus-classworlds/2.4.2/plexus-classworlds-2.4.2.jar
(46 KB at 2414.1 KB/sec)
2017-06-11T06:33:11.190 [INFO] Downloading: https://repo.maven.apache.org/maven2/org/codehaus/gmaven/gmaven-adapter-api/2.0/gmaven-adapter-api-2.0.jar
2017-06-11T06:33:11.200 [INFO] Downloaded: https://repo.maven.apache.org/maven2/org/codehaus/gmaven/gmaven-adapter-api/2.0/gmaven-adapter-api-2.0.jar
(7 KB at 238.4 KB/sec)
2017-06-11T06:33:11.200 [INFO] Downloading: https://repo.maven.apache.org/maven2/org/codehaus/gmaven/gmaven-adapter-impl/2.0/gmaven-adapter-impl-2.0.jar
2017-06-11T06:33:11.204 [INFO] Downloaded: https://repo.maven.apache.org/maven2/org/codehaus/plexus/plexus-interpolation/1.16/plexus-interpolation-1.16.jar
(60 KB at 1814.3 KB/sec)
2017-06-11T06:33:11.204 [INFO] Downloading: https://repo.maven.apache.org/maven2/org/codehaus/groovy/groovy-all/2.1.5/groovy-all-2.1.5.jar
2017-06-11T06:33:11.212 [INFO] Downloaded: https://repo.maven.apache.org/maven2/org/eclipse/aether/aether-api/0.9.0.M2/aether-api-0.9.0.M2.jar
(131 KB at 3190.7 KB/sec)
2017-06-11T06:33:11.212 [INFO] Downloading: https://repo.maven.apache.org/maven2/org/apache/ant/ant/1.8.4/ant-1.8.4.jar
2017-06-11T06:33:11.215 [INFO] Downloaded: https://repo.maven.apache.org/maven2/org/codehaus/gmaven/gmaven-adapter-impl/2.0/gmaven-adapter-impl-2.0.jar
(16 KB at 358.9 KB/sec)
2017-06-11T06:33:11.215 [INFO] Downloading: https://repo.maven.apache.org/maven2/org/apache/ant/ant-launcher/1.8.4/ant-launcher-1.8.4.jar
2017-06-11T06:33:11.242 [INFO] Downloaded: https://repo.maven.apache.org/maven2/org/apache/ant/ant-launcher/1.8.4/ant-launcher-1.8.4.jar
(18 KB at 253.5 KB/sec)
2017-06-11T06:33:11.242 [INFO] Downloading: https://repo.maven.apache.org/maven2/org/fusesource/jansi/jansi/1.11/jansi-1.11.jar
2017-06-11T06:33:11.263 [INFO] Downloaded: https://repo.maven.apache.org/maven2/org/fusesource/jansi/jansi/1.11/jansi-1.11.jar
(112 KB at 1214.5 KB/sec)
2017-06-11T06:33:11.271 [INFO] Downloaded: https://repo.maven.apache.org/maven2/org/sonatype/gossip/gossip-core/1.8/gossip-core-1.8.jar
(57 KB at 564.6 KB/sec)
2017-06-11T06:33:11.388 [INFO] Downloaded: https://repo.maven.apache.org/maven2/com/google/guava/guava/14.0.1/guava-14.0.1.jar
(2138 KB at 9851.7 KB/sec)
2017-06-11T06:33:11.413 [INFO] Downloaded: https://repo.maven.apache.org/maven2/org/apache/ant/ant/1.8.4/ant-1.8.4.jar
(1897 KB at 7835.6 KB/sec)
2017-06-11T06:33:11.821 [INFO] Downloaded: https://repo.maven.apache.org/maven2/org/codehaus/groovy/groovy-all/2.1.5/groovy-all-2.1.5.jar
(6219 KB at 9566.6 KB/sec)
[JENKINS] Archiving disabled
2017-06-11T06:33:15.100 [INFO]                                                           
             
2017-06-11T06:33:15.100 [INFO] ------------------------------------------------------------------------
2017-06-11T06:33:15.100 [INFO] Skipping Apache Beam :: Parent
2017-06-11T06:33:15.100 [INFO] This project has been banned from the build due to previous
failures.
2017-06-11T06:33:15.100 [INFO] ------------------------------------------------------------------------
[JENKINS] Archiving disabled
[JENKINS] Archiving disabled
[JENKINS] Archiving disabled
[JENKINS] Archiving disabled
[JENKINS] Archiving disabled
[JENKINS] Archiving disabled
[JENKINS] Archiving disabled
[JENKINS] Archiving disabled
[JENKINS] Archiving disabled
[JENKINS] Archiving disabled
[JENKINS] Archiving disabled
[JENKINS] Archiving disabled
[JENKINS] Archiving disabled
[JENKINS] Archiving disabled
[JENKINS] Archiving disabled
[JENKINS] Archiving disabled
[JENKINS] Archiving disabled
[JENKINS] Archiving disabled
[JENKINS] Archiving disabled
[JENKINS] Archiving disabled
[JENKINS] Archiving disabled
[JENKINS] Archiving disabled
[JENKINS] Archiving disabled
[JENKINS] Archiving disabled
[JENKINS] Archiving disabled
[JENKINS] Archiving disabled
[JENKINS] Archiving disabled
[JENKINS] Archiving disabled
[JENKINS] Archiving disabled
[JENKINS] Archiving disabled
[JENKINS] Archiving disabled
[JENKINS] Archiving disabled
[JENKINS] Archiving disabled
[JENKINS] Archiving disabled
[JENKINS] Archiving disabled
[JENKINS] Archiving disabled
[JENKINS] Archiving disabled
[JENKINS] Archiving disabled
[JENKINS] Archiving disabled
[JENKINS] Archiving disabled
[JENKINS] Archiving disabled
[JENKINS] Archiving disabled
[JENKINS] Archiving disabled
[JENKINS] Archiving disabled
[JENKINS] Archiving disabled
[JENKINS] Archiving disabled
[JENKINS] Archiving disabled
[JENKINS] Archiving disabled
[JENKINS] Archiving disabled
[JENKINS] Archiving disabled
2017-06-11T06:34:15.755 [INFO] ------------------------------------------------------------------------
2017-06-11T06:34:15.756 [INFO] Reactor Summary:
2017-06-11T06:34:15.756 [INFO] 
2017-06-11T06:34:15.757 [INFO] Apache Beam :: Parent .............................. SUCCESS
[ 25.776 s]
2017-06-11T06:34:15.757 [INFO] Apache Beam :: SDKs :: Java :: Build Tools ......... SUCCESS
[ 16.653 s]
2017-06-11T06:34:15.757 [INFO] Apache Beam :: SDKs ................................ SUCCESS
[  8.791 s]
2017-06-11T06:34:15.757 [INFO] Apache Beam :: SDKs :: Common ...................... SUCCESS
[  5.594 s]
2017-06-11T06:34:15.757 [INFO] Apache Beam :: SDKs :: Common :: Runner API ........ SUCCESS
[ 24.327 s]
2017-06-11T06:34:15.757 [INFO] Apache Beam :: SDKs :: Common :: Fn API ............ SUCCESS
[ 22.808 s]
2017-06-11T06:34:15.757 [INFO] Apache Beam :: SDKs :: Java ........................ SUCCESS
[  5.666 s]
2017-06-11T06:34:15.757 [INFO] Apache Beam :: SDKs :: Java :: Core ................ SUCCESS
[04:17 min]
2017-06-11T06:34:15.757 [INFO] Apache Beam :: Runners ............................. SUCCESS
[  5.585 s]
2017-06-11T06:34:15.757 [INFO] Apache Beam :: Runners :: Core Construction Java ... SUCCESS
[ 49.318 s]
2017-06-11T06:34:15.757 [INFO] Apache Beam :: Runners :: Core Java ................ SUCCESS
[01:11 min]
2017-06-11T06:34:15.757 [INFO] Apache Beam :: Runners :: Direct Java .............. SUCCESS
[03:25 min]
2017-06-11T06:34:15.757 [INFO] Apache Beam :: SDKs :: Java :: IO .................. SUCCESS
[  5.857 s]
2017-06-11T06:34:15.758 [INFO] Apache Beam :: SDKs :: Java :: IO :: Common ........ SUCCESS
[ 10.786 s]
2017-06-11T06:34:15.758 [INFO] Apache Beam :: SDKs :: Java :: IO :: Cassandra ..... SUCCESS
[ 38.047 s]
2017-06-11T06:34:15.758 [INFO] Apache Beam :: SDKs :: Java :: IO :: Elasticsearch . SUCCESS
[ 53.135 s]
2017-06-11T06:34:15.758 [INFO] Apache Beam :: SDKs :: Java :: Extensions .......... SUCCESS
[  5.718 s]
2017-06-11T06:34:15.758 [INFO] Apache Beam :: SDKs :: Java :: Extensions :: Google Cloud Platform
Core SUCCESS [ 55.671 s]
2017-06-11T06:34:15.758 [INFO] Apache Beam :: SDKs :: Java :: Extensions :: Protobuf SUCCESS
[ 29.961 s]
2017-06-11T06:34:15.758 [INFO] Apache Beam :: SDKs :: Java :: IO :: Google Cloud Platform
SUCCESS [01:34 min]
2017-06-11T06:34:15.758 [INFO] Apache Beam :: SDKs :: Java :: IO :: Hadoop Common . SUCCESS
[ 34.422 s]
2017-06-11T06:34:15.758 [INFO] Apache Beam :: SDKs :: Java :: IO :: Hadoop File System SUCCESS
[ 40.656 s]
2017-06-11T06:34:15.758 [INFO] Apache Beam :: SDKs :: Java :: IO :: Hadoop ........ SUCCESS
[  9.203 s]
2017-06-11T06:34:15.758 [INFO] Apache Beam :: SDKs :: Java :: IO :: Hadoop :: input-format
SUCCESS [ 33.422 s]
2017-06-11T06:34:15.758 [INFO] Apache Beam :: SDKs :: Java :: IO :: Hadoop :: jdk1.8-tests
SUCCESS [01:47 min]
2017-06-11T06:34:15.758 [INFO] Apache Beam :: SDKs :: Java :: IO :: HBase ......... SUCCESS
[ 43.741 s]
2017-06-11T06:34:15.758 [INFO] Apache Beam :: SDKs :: Java :: IO :: HCatalog ...... SUCCESS
[01:01 min]
2017-06-11T06:34:15.758 [INFO] Apache Beam :: SDKs :: Java :: IO :: JDBC .......... SUCCESS
[ 38.325 s]
2017-06-11T06:34:15.758 [INFO] Apache Beam :: SDKs :: Java :: IO :: JMS ........... SUCCESS
[ 32.424 s]
2017-06-11T06:34:15.758 [INFO] Apache Beam :: SDKs :: Java :: IO :: Kafka ......... SUCCESS
[ 43.341 s]
2017-06-11T06:34:15.758 [INFO] Apache Beam :: SDKs :: Java :: IO :: Kinesis ....... SUCCESS
[ 37.560 s]
2017-06-11T06:34:15.758 [INFO] Apache Beam :: SDKs :: Java :: IO :: MongoDB ....... SUCCESS
[ 47.296 s]
2017-06-11T06:34:15.758 [INFO] Apache Beam :: SDKs :: Java :: IO :: MQTT .......... SUCCESS
[ 32.318 s]
2017-06-11T06:34:15.758 [INFO] Apache Beam :: SDKs :: Java :: IO :: XML ........... SUCCESS
[ 29.525 s]
2017-06-11T06:34:15.759 [INFO] Apache Beam :: SDKs :: Java :: Maven Archetypes .... SUCCESS
[  4.781 s]
2017-06-11T06:34:15.759 [INFO] Apache Beam :: SDKs :: Java :: Maven Archetypes :: Starter
SUCCESS [ 25.837 s]
2017-06-11T06:34:15.759 [INFO] Apache Beam :: SDKs :: Java :: Extensions :: Jackson SUCCESS
[ 27.096 s]
2017-06-11T06:34:15.759 [INFO] Apache Beam :: SDKs :: Java :: Extensions :: Join library SUCCESS
[ 29.540 s]
2017-06-11T06:34:15.759 [INFO] Apache Beam :: SDKs :: Java :: Extensions :: Sorter  SUCCESS
[ 37.239 s]
2017-06-11T06:34:15.759 [INFO] Apache Beam :: Runners :: Google Cloud Dataflow .... SUCCESS
[ 51.972 s]
2017-06-11T06:34:15.759 [INFO] Apache Beam :: SDKs :: Java :: Harness ............. SUCCESS
[ 55.665 s]
2017-06-11T06:34:15.759 [INFO] Apache Beam :: SDKs :: Java :: Java 8 Tests ........ SUCCESS
[ 23.786 s]
2017-06-11T06:34:15.759 [INFO] Apache Beam :: SDKs :: Python ...................... FAILURE
[  3.494 s]
2017-06-11T06:34:15.759 [INFO] Apache Beam :: Runners :: Flink .................... SKIPPED
2017-06-11T06:34:15.759 [INFO] Apache Beam :: Runners :: Spark .................... SKIPPED
2017-06-11T06:34:15.759 [INFO] Apache Beam :: Runners :: Apex ..................... SKIPPED
2017-06-11T06:34:15.759 [INFO] Apache Beam :: Examples ............................ SKIPPED
2017-06-11T06:34:15.759 [INFO] Apache Beam :: Examples :: Java .................... SKIPPED
2017-06-11T06:34:15.759 [INFO] Apache Beam :: Examples :: Java 8 .................. SKIPPED
2017-06-11T06:34:15.759 [INFO] Apache Beam :: SDKs :: Java :: Aggregated Javadoc .. SKIPPED
2017-06-11T06:34:15.759 [INFO] ------------------------------------------------------------------------
2017-06-11T06:34:15.759 [INFO] BUILD FAILURE
2017-06-11T06:34:15.759 [INFO] ------------------------------------------------------------------------
2017-06-11T06:34:15.759 [INFO] Total time: 33:33 min
2017-06-11T06:34:15.760 [INFO] Finished at: 2017-06-11T06:34:15+00:00
2017-06-11T06:34:17.030 [INFO] Final Memory: 326M/2860M
2017-06-11T06:34:17.030 [INFO] ------------------------------------------------------------------------
2017-06-11T06:34:17.042 [ERROR] Failed to execute goal org.codehaus.gmaven:groovy-maven-plugin:2.0:execute
(find-supported-python-for-clean) on project beam-sdks-python: Unable to find Python 2.7 in
path -> [Help 1]
org.apache.maven.lifecycle.LifecycleExecutionException: Failed to execute goal org.codehaus.gmaven:groovy-maven-plugin:2.0:execute
(find-supported-python-for-clean) on project beam-sdks-python: Unable to find Python 2.7 in
path
	at org.apache.maven.lifecycle.internal.MojoExecutor.execute(MojoExecutor.java:212)
	at org.apache.maven.lifecycle.internal.MojoExecutor.execute(MojoExecutor.java:153)
	at org.apache.maven.lifecycle.internal.MojoExecutor.execute(MojoExecutor.java:145)
	at org.apache.maven.lifecycle.internal.LifecycleModuleBuilder.buildProject(LifecycleModuleBuilder.java:116)
	at org.apache.maven.lifecycle.internal.LifecycleModuleBuilder.buildProject(LifecycleModuleBuilder.java:80)
	at org.apache.maven.lifecycle.internal.builder.singlethreaded.SingleThreadedBuilder.build(SingleThreadedBuilder.java:51)
	at org.apache.maven.lifecycle.internal.LifecycleStarter.execute(LifecycleStarter.java:128)
	at org.apache.maven.DefaultMaven.doExecute(DefaultMaven.java:307)
	at org.apache.maven.DefaultMaven.doExecute(DefaultMaven.java:193)
	at org.apache.maven.DefaultMaven.execute(DefaultMaven.java:106)
	at org.jvnet.hudson.maven3.launcher.Maven33Launcher.main(Maven33Launcher.java:129)
	at sun.reflect.NativeMethodAccessorImpl.invoke0(Native Method)
	at sun.reflect.NativeMethodAccessorImpl.invoke(NativeMethodAccessorImpl.java:62)
	at sun.reflect.DelegatingMethodAccessorImpl.invoke(DelegatingMethodAccessorImpl.java:43)
	at java.lang.reflect.Method.invoke(Method.java:498)
	at org.codehaus.plexus.classworlds.launcher.Launcher.launchStandard(Launcher.java:330)
	at org.codehaus.plexus.classworlds.launcher.Launcher.launch(Launcher.java:238)
	at jenkins.maven3.agent.Maven33Main.launch(Maven33Main.java:176)
	at sun.reflect.NativeMethodAccessorImpl.invoke0(Native Method)
	at sun.reflect.NativeMethodAccessorImpl.invoke(NativeMethodAccessorImpl.java:62)
	at sun.reflect.DelegatingMethodAccessorImpl.invoke(DelegatingMethodAccessorImpl.java:43)
	at java.lang.reflect.Method.invoke(Method.java:498)
	at hudson.maven.Maven3Builder.call(Maven3Builder.java:139)
	at hudson.maven.Maven3Builder.call(Maven3Builder.java:70)
	at hudson.remoting.UserRequest.perform(UserRequest.java:120)
	at hudson.remoting.UserRequest.perform(UserRequest.java:48)
	at hudson.remoting.Request$2.run(Request.java:326)
	at hudson.remoting.InterceptingExecutorService$1.call(InterceptingExecutorService.java:68)
	at java.util.concurrent.FutureTask.run(FutureTask.java:266)
	at java.util.concurrent.ThreadPoolExecutor.runWorker(ThreadPoolExecutor.java:1142)
	at java.util.concurrent.ThreadPoolExecutor$Worker.run(ThreadPoolExecutor.java:617)
	at java.lang.Thread.run(Thread.java:745)
Caused by: org.apache.maven.plugin.MojoFailureException: Unable to find Python 2.7 in path
	at sun.reflect.NativeConstructorAccessorImpl.newInstance0(Native Method)
	at sun.reflect.NativeConstructorAccessorImpl.newInstance(NativeConstructorAccessorImpl.java:62)
	at sun.reflect.DelegatingConstructorAccessorImpl.newInstance(DelegatingConstructorAccessorImpl.java:45)
	at java.lang.reflect.Constructor.newInstance(Constructor.java:423)
	at org.codehaus.groovy.reflection.CachedConstructor.invoke(CachedConstructor.java:77)
	at org.codehaus.groovy.runtime.callsite.ConstructorSite$ConstructorSiteNoUnwrapNoCoerce.callConstructor(ConstructorSite.java:102)
	at org.codehaus.groovy.runtime.callsite.CallSiteArray.defaultCallConstructor(CallSiteArray.java:57)
	at org.codehaus.groovy.runtime.callsite.AbstractCallSite.callConstructor(AbstractCallSite.java:182)
	at org.codehaus.groovy.runtime.callsite.AbstractCallSite.callConstructor(AbstractCallSite.java:190)
	at findSupportedPython.run(findSupportedPython.groovy:70)
	at groovy.lang.GroovyShell.evaluate(GroovyShell.java:518)
	at org.codehaus.gmaven.adapter.impl.ScriptExecutorImpl.execute(ScriptExecutorImpl.java:80)
	at org.codehaus.gmaven.plugin.ExecuteMojo$1.run(ExecuteMojo.java:100)
	at org.codehaus.gmaven.plugin.util.SystemNoExitGuard.run(SystemNoExitGuard.java:45)
	at org.codehaus.gmaven.plugin.ExecuteMojo.run(ExecuteMojo.java:96)
	at org.codehaus.gmaven.plugin.MojoSupport.execute(MojoSupport.java:45)
	at org.apache.maven.plugin.DefaultBuildPluginManager.executeMojo(DefaultBuildPluginManager.java:134)
	at org.apache.maven.lifecycle.internal.MojoExecutor.execute(MojoExecutor.java:208)
	... 31 more
2017-06-11T06:34:17.044 [ERROR] 
2017-06-11T06:34:17.044 [ERROR] Re-run Maven using the -X switch to enable full debug logging.
2017-06-11T06:34:17.044 [ERROR] 
2017-06-11T06:34:17.045 [ERROR] For more information about the errors and possible solutions,
please read the following articles:
2017-06-11T06:34:17.045 [ERROR] [Help 1] http://cwiki.apache.org/confluence/display/MAVEN/MojoFailureException
2017-06-11T06:34:17.045 [ERROR] 
2017-06-11T06:34:17.045 [ERROR] After correcting the problems, you can resume the build with
the command
2017-06-11T06:34:17.045 [ERROR]   mvn <goals> -rf :beam-sdks-python
channel stopped
Not sending mail to unregistered user github@nakomis.com
Not sending mail to unregistered user ccy@google.com
Not sending mail to unregistered user mingmxu@ebay.com
Not sending mail to unregistered user kirpichov@google.com
Not sending mail to unregistered user aljoscha.krettek@gmail.com
Not sending mail to unregistered user klk@google.com
Not sending mail to unregistered user sourabhbajaj@google.com
Not sending mail to unregistered user hepei.hp@alibaba-inc.com

Mime
View raw message