beam-commits mailing list archives

Site index · List index
Message view « Date » · « Thread »
Top « Date » · « Thread »
From Apache Jenkins Server <jenk...@builds.apache.org>
Subject Build failed in Jenkins: beam_PostCommit_Java_JDK_Versions_Test » JDK 1.7 (latest),beam #33
Date Fri, 02 Jun 2017 06:28:04 GMT
See <https://builds.apache.org/job/beam_PostCommit_Java_JDK_Versions_Test/jdk=JDK%201.7%20(latest),label=beam/33/display/redirect>

------------------------------------------
[...truncated 1.40 MB...]
  [javadoc]   location: package java.util.concurrent
  [javadoc] <https://builds.apache.org/job/beam_PostCommit_Java_JDK_Versions_Test/jdk=JDK%201.7%20(latest),label=beam/ws/sdks/java/javadoc/target/collected/org/apache/beam/runners/core/BeamFnDataReadRunner.java>:29:
error: package java.util.function does not exist
  [javadoc] import java.util.function.Supplier;
  [javadoc]                          ^
  [javadoc] <https://builds.apache.org/job/beam_PostCommit_Java_JDK_Versions_Test/jdk=JDK%201.7%20(latest),label=beam/ws/sdks/java/javadoc/target/collected/org/apache/beam/runners/core/BeamFnDataReadRunner.java>:56:
error: cannot find symbol
  [javadoc]   private final Supplier<String> processBundleInstructionIdSupplier;
  [javadoc]                 ^
  [javadoc]   symbol:   class Supplier
  [javadoc]   location: class BeamFnDataReadRunner<OutputT>
  [javadoc]   where OutputT is a type-variable:
  [javadoc]     OutputT extends Object declared in class BeamFnDataReadRunner
  [javadoc] <https://builds.apache.org/job/beam_PostCommit_Java_JDK_Versions_Test/jdk=JDK%201.7%20(latest),label=beam/ws/sdks/java/javadoc/target/collected/org/apache/beam/runners/core/BeamFnDataReadRunner.java>:61:
error: cannot find symbol
  [javadoc]   private CompletableFuture<Void> readFuture;
  [javadoc]           ^
  [javadoc]   symbol:   class CompletableFuture
  [javadoc]   location: class BeamFnDataReadRunner<OutputT>
  [javadoc]   where OutputT is a type-variable:
  [javadoc]     OutputT extends Object declared in class BeamFnDataReadRunner
  [javadoc] <https://builds.apache.org/job/beam_PostCommit_Java_JDK_Versions_Test/jdk=JDK%201.7%20(latest),label=beam/ws/sdks/java/javadoc/target/collected/org/apache/beam/runners/core/BeamFnDataReadRunner.java>:65:
error: cannot find symbol
  [javadoc]       Supplier<String> processBundleInstructionIdSupplier,
  [javadoc]       ^
  [javadoc]   symbol:   class Supplier
  [javadoc]   location: class BeamFnDataReadRunner<OutputT>
  [javadoc]   where OutputT is a type-variable:
  [javadoc]     OutputT extends Object declared in class BeamFnDataReadRunner
  [javadoc] <https://builds.apache.org/job/beam_PostCommit_Java_JDK_Versions_Test/jdk=JDK%201.7%20(latest),label=beam/ws/sdks/java/javadoc/target/collected/org/apache/beam/runners/core/DoFnRunner.java>:51:
warning - Tag @link: reference not found: DoFn.FinishBundle @FinishBundle
  [javadoc] <https://builds.apache.org/job/beam_PostCommit_Java_JDK_Versions_Test/jdk=JDK%201.7%20(latest),label=beam/ws/sdks/java/javadoc/target/collected/org/apache/beam/runners/core/DoFnRunner.java>:45:
warning - Tag @link: reference not found: DoFn.OnTimer @OnTimer
  [javadoc] <https://builds.apache.org/job/beam_PostCommit_Java_JDK_Versions_Test/jdk=JDK%201.7%20(latest),label=beam/ws/sdks/java/javadoc/target/collected/org/apache/beam/runners/core/DoFnRunner.java>:39:
warning - Tag @link: reference not found: DoFn.ProcessElement @ProcessElement
  [javadoc] <https://builds.apache.org/job/beam_PostCommit_Java_JDK_Versions_Test/jdk=JDK%201.7%20(latest),label=beam/ws/sdks/java/javadoc/target/collected/org/apache/beam/runners/core/DoFnRunner.java>:39:
warning - Tag @link: reference not found: DoFn.ProcessContext
  [javadoc] <https://builds.apache.org/job/beam_PostCommit_Java_JDK_Versions_Test/jdk=JDK%201.7%20(latest),label=beam/ws/sdks/java/javadoc/target/collected/org/apache/beam/runners/core/DoFnRunner.java>:33:
warning - Tag @link: reference not found: DoFn.StartBundle @StartBundle
  [javadoc] <https://builds.apache.org/job/beam_PostCommit_Java_JDK_Versions_Test/jdk=JDK%201.7%20(latest),label=beam/ws/sdks/java/javadoc/target/collected/org/apache/beam/runners/core/DoFnRunner.java>:33:
warning - Tag @link: reference not found: DoFn.StartBundle @StartBundle
  [javadoc] <https://builds.apache.org/job/beam_PostCommit_Java_JDK_Versions_Test/jdk=JDK%201.7%20(latest),label=beam/ws/sdks/java/javadoc/target/collected/org/apache/beam/runners/core/DoFnRunner.java>:39:
warning - Tag @link: reference not found: DoFn.ProcessElement @ProcessElement
  [javadoc] <https://builds.apache.org/job/beam_PostCommit_Java_JDK_Versions_Test/jdk=JDK%201.7%20(latest),label=beam/ws/sdks/java/javadoc/target/collected/org/apache/beam/runners/core/DoFnRunner.java>:39:
warning - Tag @link: reference not found: DoFn.ProcessContext
  [javadoc] <https://builds.apache.org/job/beam_PostCommit_Java_JDK_Versions_Test/jdk=JDK%201.7%20(latest),label=beam/ws/sdks/java/javadoc/target/collected/org/apache/beam/runners/core/DoFnRunner.java>:45:
warning - Tag @link: reference not found: DoFn.OnTimer @OnTimer
  [javadoc] <https://builds.apache.org/job/beam_PostCommit_Java_JDK_Versions_Test/jdk=JDK%201.7%20(latest),label=beam/ws/sdks/java/javadoc/target/collected/org/apache/beam/runners/core/DoFnRunner.java>:51:
warning - Tag @link: reference not found: DoFn.FinishBundle @FinishBundle
  [javadoc] <https://builds.apache.org/job/beam_PostCommit_Java_JDK_Versions_Test/jdk=JDK%201.7%20(latest),label=beam/ws/sdks/java/javadoc/target/collected/org/apache/beam/runners/flink/metrics/ReaderInvocationUtil.java>:34:
warning - Tag @link: reference not found: Source.Reader
  [javadoc] <https://builds.apache.org/job/beam_PostCommit_Java_JDK_Versions_Test/jdk=JDK%201.7%20(latest),label=beam/ws/sdks/java/javadoc/target/collected/org/apache/beam/runners/spark/io/SourceRDD.java>:292:
warning - Tag @link: reference not found: UnboundedSource.CheckpointMark
  [javadoc] <https://builds.apache.org/job/beam_PostCommit_Java_JDK_Versions_Test/jdk=JDK%201.7%20(latest),label=beam/ws/sdks/java/javadoc/target/collected/org/apache/beam/runners/spark/stateful/StateSpecFunctions.java>:101:
warning - Tag @link: reference not found: UnboundedSource.CheckpointMark
  [javadoc] <https://builds.apache.org/job/beam_PostCommit_Java_JDK_Versions_Test/jdk=JDK%201.7%20(latest),label=beam/ws/sdks/java/javadoc/target/collected/org/apache/beam/runners/spark/stateful/StateSpecFunctions.java>:101:
warning - Tag @link: reference not found: UnboundedSource.CheckpointMark
  [javadoc] <https://builds.apache.org/job/beam_PostCommit_Java_JDK_Versions_Test/jdk=JDK%201.7%20(latest),label=beam/ws/sdks/java/javadoc/target/collected/org/apache/beam/sdk/extensions/protobuf/ByteStringCoder.java>:37:
warning - Tag @link: reference not found: Coder.Context
  [javadoc] <https://builds.apache.org/job/beam_PostCommit_Java_JDK_Versions_Test/jdk=JDK%201.7%20(latest),label=beam/ws/sdks/java/javadoc/target/collected/org/apache/beam/sdk/extensions/protobuf/ByteStringCoder.java>:106:
warning - Tag @link: reference not found: Coder.Context
  [javadoc] <https://builds.apache.org/job/beam_PostCommit_Java_JDK_Versions_Test/jdk=JDK%201.7%20(latest),label=beam/ws/sdks/java/javadoc/target/collected/org/apache/beam/sdk/io/AvroIO.java>:319:
warning - Tag @link: can't find withFilenamePolicy(FilenamePolicy) in org.apache.beam.sdk.io.AvroIO.Write
  [javadoc] <https://builds.apache.org/job/beam_PostCommit_Java_JDK_Versions_Test/jdk=JDK%201.7%20(latest),label=beam/ws/sdks/java/javadoc/target/collected/org/apache/beam/sdk/io/AvroIO.java>:303:
warning - Tag @link: can't find withFilenamePolicy(FilenamePolicy) in org.apache.beam.sdk.io.AvroIO.Write
  [javadoc] <https://builds.apache.org/job/beam_PostCommit_Java_JDK_Versions_Test/jdk=JDK%201.7%20(latest),label=beam/ws/sdks/java/javadoc/target/collected/org/apache/beam/sdk/io/AvroIO.java>:358:
warning - Tag @link: can't find withFilenamePolicy(FilenamePolicy) in org.apache.beam.sdk.io.AvroIO.Write
  [javadoc] <https://builds.apache.org/job/beam_PostCommit_Java_JDK_Versions_Test/jdk=JDK%201.7%20(latest),label=beam/ws/sdks/java/javadoc/target/collected/org/apache/beam/sdk/io/AvroIO.java>:369:
warning - Tag @link: can't find withFilenamePolicy(FilenamePolicy) in org.apache.beam.sdk.io.AvroIO.Write
  [javadoc] <https://builds.apache.org/job/beam_PostCommit_Java_JDK_Versions_Test/jdk=JDK%201.7%20(latest),label=beam/ws/sdks/java/javadoc/target/collected/org/apache/beam/sdk/io/CompressedSource.java>:534:
warning - Tag @link: reference not found: FileBasedReader#startReading(ReadableByteChannel)
  [javadoc] <https://builds.apache.org/job/beam_PostCommit_Java_JDK_Versions_Test/jdk=JDK%201.7%20(latest),label=beam/ws/sdks/java/javadoc/target/collected/org/apache/beam/sdk/io/CompressedSource.java>:534:
warning - Tag @link: reference not found: FileBasedReader#startReading(ReadableByteChannel)
  [javadoc] <https://builds.apache.org/job/beam_PostCommit_Java_JDK_Versions_Test/jdk=JDK%201.7%20(latest),label=beam/ws/sdks/java/javadoc/target/collected/org/apache/beam/sdk/io/FileBasedSource.java>:184:
warning - Tag @link: can't find FileBasedSource(Metadata, long, long, long) in org.apache.beam.sdk.io.FileBasedSource
  [javadoc] <https://builds.apache.org/job/beam_PostCommit_Java_JDK_Versions_Test/jdk=JDK%201.7%20(latest),label=beam/ws/sdks/java/javadoc/target/collected/org/apache/beam/sdk/io/OffsetBasedSource.java>:295:
warning - Tag @link: reference not found: BoundedReader#start
  [javadoc] <https://builds.apache.org/job/beam_PostCommit_Java_JDK_Versions_Test/jdk=JDK%201.7%20(latest),label=beam/ws/sdks/java/javadoc/target/collected/org/apache/beam/sdk/io/OffsetBasedSource.java>:295:
warning - Tag @see: reference not found: BoundedReader#start
  [javadoc] <https://builds.apache.org/job/beam_PostCommit_Java_JDK_Versions_Test/jdk=JDK%201.7%20(latest),label=beam/ws/sdks/java/javadoc/target/collected/org/apache/beam/sdk/io/OffsetBasedSource.java>:309:
warning - Tag @link: reference not found: BoundedReader#advance
  [javadoc] <https://builds.apache.org/job/beam_PostCommit_Java_JDK_Versions_Test/jdk=JDK%201.7%20(latest),label=beam/ws/sdks/java/javadoc/target/collected/org/apache/beam/sdk/io/OffsetBasedSource.java>:309:
warning - Tag @see: reference not found: BoundedReader#advance
  [javadoc] <https://builds.apache.org/job/beam_PostCommit_Java_JDK_Versions_Test/jdk=JDK%201.7%20(latest),label=beam/ws/sdks/java/javadoc/target/collected/org/apache/beam/sdk/io/FileSystem.java>:80:
warning - Tag @link: reference not found: ResourceIdT
  [javadoc] <https://builds.apache.org/job/beam_PostCommit_Java_JDK_Versions_Test/jdk=JDK%201.7%20(latest),label=beam/ws/sdks/java/javadoc/target/collected/org/apache/beam/sdk/io/FileSystem.java>:70:
warning - Tag @link: reference not found: ResourceIdT ResourceIds
  [javadoc] <https://builds.apache.org/job/beam_PostCommit_Java_JDK_Versions_Test/jdk=JDK%201.7%20(latest),label=beam/ws/sdks/java/javadoc/target/collected/org/apache/beam/sdk/io/FileSystem.java>:93:
warning - Tag @link: reference not found: ResourceIdT
  [javadoc] <https://builds.apache.org/job/beam_PostCommit_Java_JDK_Versions_Test/jdk=JDK%201.7%20(latest),label=beam/ws/sdks/java/javadoc/target/collected/org/apache/beam/sdk/io/FileSystem.java>:70:
warning - Tag @link: reference not found: ResourceIdT ResourceIds
  [javadoc] <https://builds.apache.org/job/beam_PostCommit_Java_JDK_Versions_Test/jdk=JDK%201.7%20(latest),label=beam/ws/sdks/java/javadoc/target/collected/org/apache/beam/sdk/io/FileSystem.java>:70:
warning - Tag @link: reference not found: ResourceIdT
  [javadoc] <https://builds.apache.org/job/beam_PostCommit_Java_JDK_Versions_Test/jdk=JDK%201.7%20(latest),label=beam/ws/sdks/java/javadoc/target/collected/org/apache/beam/sdk/io/FileSystem.java>:70:
warning - Tag @link: reference not found: ResourceIdT
  [javadoc] <https://builds.apache.org/job/beam_PostCommit_Java_JDK_Versions_Test/jdk=JDK%201.7%20(latest),label=beam/ws/sdks/java/javadoc/target/collected/org/apache/beam/sdk/io/FileSystem.java>:80:
warning - Tag @link: reference not found: ResourceIdT
  [javadoc] <https://builds.apache.org/job/beam_PostCommit_Java_JDK_Versions_Test/jdk=JDK%201.7%20(latest),label=beam/ws/sdks/java/javadoc/target/collected/org/apache/beam/sdk/io/FileSystem.java>:93:
warning - Tag @link: reference not found: ResourceIdT
  [javadoc] <https://builds.apache.org/job/beam_PostCommit_Java_JDK_Versions_Test/jdk=JDK%201.7%20(latest),label=beam/ws/sdks/java/javadoc/target/collected/org/apache/beam/sdk/io/OffsetBasedSource.java>:295:
warning - Tag @link: reference not found: BoundedReader#start
  [javadoc] <https://builds.apache.org/job/beam_PostCommit_Java_JDK_Versions_Test/jdk=JDK%201.7%20(latest),label=beam/ws/sdks/java/javadoc/target/collected/org/apache/beam/sdk/io/OffsetBasedSource.java>:295:
warning - Tag @see: reference not found: BoundedReader#start
  [javadoc] <https://builds.apache.org/job/beam_PostCommit_Java_JDK_Versions_Test/jdk=JDK%201.7%20(latest),label=beam/ws/sdks/java/javadoc/target/collected/org/apache/beam/sdk/io/OffsetBasedSource.java>:309:
warning - Tag @link: reference not found: BoundedReader#advance
  [javadoc] <https://builds.apache.org/job/beam_PostCommit_Java_JDK_Versions_Test/jdk=JDK%201.7%20(latest),label=beam/ws/sdks/java/javadoc/target/collected/org/apache/beam/sdk/io/OffsetBasedSource.java>:309:
warning - Tag @see: reference not found: BoundedReader#advance
  [javadoc] <https://builds.apache.org/job/beam_PostCommit_Java_JDK_Versions_Test/jdk=JDK%201.7%20(latest),label=beam/ws/sdks/java/javadoc/target/collected/org/apache/beam/sdk/io/TextIO.java>:314:
warning - Tag @link: can't find withFilenamePolicy(FilenamePolicy) in org.apache.beam.sdk.io.TextIO.Write
  [javadoc] <https://builds.apache.org/job/beam_PostCommit_Java_JDK_Versions_Test/jdk=JDK%201.7%20(latest),label=beam/ws/sdks/java/javadoc/target/collected/org/apache/beam/sdk/io/TextIO.java>:295:
warning - Tag @link: can't find withFilenamePolicy(FilenamePolicy) in org.apache.beam.sdk.io.TextIO.Write
  [javadoc] <https://builds.apache.org/job/beam_PostCommit_Java_JDK_Versions_Test/jdk=JDK%201.7%20(latest),label=beam/ws/sdks/java/javadoc/target/collected/org/apache/beam/sdk/io/TextIO.java>:346:
warning - Tag @link: can't find withFilenamePolicy(FilenamePolicy) in org.apache.beam.sdk.io.TextIO.Write
  [javadoc] <https://builds.apache.org/job/beam_PostCommit_Java_JDK_Versions_Test/jdk=JDK%201.7%20(latest),label=beam/ws/sdks/java/javadoc/target/collected/org/apache/beam/sdk/io/TextIO.java>:357:
warning - Tag @link: can't find withFilenamePolicy(FilenamePolicy) in org.apache.beam.sdk.io.TextIO.Write
  [javadoc] <https://builds.apache.org/job/beam_PostCommit_Java_JDK_Versions_Test/jdk=JDK%201.7%20(latest),label=beam/ws/sdks/java/javadoc/target/collected/org/apache/beam/sdk/io/gcp/bigquery/DynamicDestinations.java>:136:
warning - Tag @link: reference not found: DestinationT
  [javadoc] <https://builds.apache.org/job/beam_PostCommit_Java_JDK_Versions_Test/jdk=JDK%201.7%20(latest),label=beam/ws/sdks/java/javadoc/target/collected/org/apache/beam/sdk/io/gcp/bigquery/DynamicDestinations.java>:136:
warning - Tag @link: reference not found: DestinationT
  [javadoc] <https://builds.apache.org/job/beam_PostCommit_Java_JDK_Versions_Test/jdk=JDK%201.7%20(latest),label=beam/ws/sdks/java/javadoc/target/collected/org/apache/beam/sdk/io/gcp/bigquery/DynamicDestinations.java>:136:
warning - Tag @link: reference not found: DestinationT
  [javadoc] <https://builds.apache.org/job/beam_PostCommit_Java_JDK_Versions_Test/jdk=JDK%201.7%20(latest),label=beam/ws/sdks/java/javadoc/target/collected/org/apache/beam/sdk/io/gcp/datastore/DatastoreV1.java>:472:
warning - Tag @link: reference not found: Query.Builder#setLimit
  [javadoc] <https://builds.apache.org/job/beam_PostCommit_Java_JDK_Versions_Test/jdk=JDK%201.7%20(latest),label=beam/ws/sdks/java/javadoc/target/collected/org/apache/beam/sdk/io/gcp/pubsub/PubsubUnboundedSource.java>:110:
warning - Tag @link: reference not found: UnboundedSource.UnboundedReader
  [javadoc] <https://builds.apache.org/job/beam_PostCommit_Java_JDK_Versions_Test/jdk=JDK%201.7%20(latest),label=beam/ws/sdks/java/javadoc/target/collected/org/apache/beam/sdk/io/kafka/KafkaIO.java>:239:
warning - Tag @link: reference not found: org.apache.kafka.common.serialization
  [javadoc] <https://builds.apache.org/job/beam_PostCommit_Java_JDK_Versions_Test/jdk=JDK%201.7%20(latest),label=beam/ws/sdks/java/javadoc/target/collected/org/apache/beam/sdk/io/kafka/KafkaIO.java>:239:
warning - Tag @link: reference not found: UnboundedKafkaSource#split(int, PipelineOptions)
  [javadoc] <https://builds.apache.org/job/beam_PostCommit_Java_JDK_Versions_Test/jdk=JDK%201.7%20(latest),label=beam/ws/sdks/java/javadoc/target/collected/org/apache/beam/sdk/io/kafka/KafkaIO.java>:350:
warning - Tag @link: reference not found: UnboundedKafkaSource#split(int, PipelineOptions)
  [javadoc] <https://builds.apache.org/job/beam_PostCommit_Java_JDK_Versions_Test/jdk=JDK%201.7%20(latest),label=beam/ws/sdks/java/javadoc/target/collected/org/apache/beam/sdk/io/kafka/KafkaIO.java>:361:
warning - Tag @link: reference not found: UnboundedKafkaSource#split(int, PipelineOptions)
  [javadoc] <https://builds.apache.org/job/beam_PostCommit_Java_JDK_Versions_Test/jdk=JDK%201.7%20(latest),label=beam/ws/sdks/java/javadoc/target/collected/org/apache/beam/sdk/io/kafka/KafkaIO.java>:374:
warning - Tag @link: reference not found: UnboundedKafkaSource#split(int, PipelineOptions)
  [javadoc] <https://builds.apache.org/job/beam_PostCommit_Java_JDK_Versions_Test/jdk=JDK%201.7%20(latest),label=beam/ws/sdks/java/javadoc/target/collected/org/apache/beam/sdk/options/PipelineOptions.java>:199:
warning - Tag @link: reference not found: DoFn.ProcessContext Context
  [javadoc] <https://builds.apache.org/job/beam_PostCommit_Java_JDK_Versions_Test/jdk=JDK%201.7%20(latest),label=beam/ws/sdks/java/javadoc/target/collected/org/apache/beam/sdk/state/StateSpecs.java>:73:
warning - Tag @see: can't find combining(Coder, CombineFn) in org.apache.beam.sdk.state.StateSpecs
  [javadoc] <https://builds.apache.org/job/beam_PostCommit_Java_JDK_Versions_Test/jdk=JDK%201.7%20(latest),label=beam/ws/sdks/java/javadoc/target/collected/org/apache/beam/sdk/state/StateSpecs.java>:91:
warning - Tag @see: can't find combining(Coder, CombineFnWithContext) in org.apache.beam.sdk.state.StateSpecs
  [javadoc] <https://builds.apache.org/job/beam_PostCommit_Java_JDK_Versions_Test/jdk=JDK%201.7%20(latest),label=beam/ws/sdks/java/javadoc/target/collected/org/apache/beam/sdk/state/StateSpecs.java>:102:
warning - Tag @link: can't find combining(CombineFn) in org.apache.beam.sdk.state.StateSpecs
  [javadoc] <https://builds.apache.org/job/beam_PostCommit_Java_JDK_Versions_Test/jdk=JDK%201.7%20(latest),label=beam/ws/sdks/java/javadoc/target/collected/org/apache/beam/sdk/state/StateSpecs.java>:120:
warning - Tag @link: can't find combining(CombineFnWithContext) in org.apache.beam.sdk.state.StateSpecs
  [javadoc] <https://builds.apache.org/job/beam_PostCommit_Java_JDK_Versions_Test/jdk=JDK%201.7%20(latest),label=beam/ws/sdks/java/javadoc/target/collected/org/apache/beam/sdk/state/Timer.java>:45:
warning - Tag @link: reference not found: DoFn.TimerId
  [javadoc] <https://builds.apache.org/job/beam_PostCommit_Java_JDK_Versions_Test/jdk=JDK%201.7%20(latest),label=beam/ws/sdks/java/javadoc/target/collected/org/apache/beam/sdk/testing/SourceTestUtils.java>:80:
warning - Tag @link: reference not found: BoundedSource.BoundedReader#splitAtFraction
  [javadoc] <https://builds.apache.org/job/beam_PostCommit_Java_JDK_Versions_Test/jdk=JDK%201.7%20(latest),label=beam/ws/sdks/java/javadoc/target/collected/org/apache/beam/sdk/testing/SourceTestUtils.java>:552:
warning - Tag @link: reference not found: BoundedSource.BoundedReader#splitAtFraction
  [javadoc] <https://builds.apache.org/job/beam_PostCommit_Java_JDK_Versions_Test/jdk=JDK%201.7%20(latest),label=beam/ws/sdks/java/javadoc/target/collected/org/apache/beam/sdk/testing/SourceTestUtils.java>:450:
warning - Tag @link: reference not found: BoundedSource.BoundedReader#splitAtFraction
  [javadoc] <https://builds.apache.org/job/beam_PostCommit_Java_JDK_Versions_Test/jdk=JDK%201.7%20(latest),label=beam/ws/sdks/java/javadoc/target/collected/org/apache/beam/sdk/testing/SourceTestUtils.java>:152:
warning - Tag @link: reference not found: Source.Reader
  [javadoc] <https://builds.apache.org/job/beam_PostCommit_Java_JDK_Versions_Test/jdk=JDK%201.7%20(latest),label=beam/ws/sdks/java/javadoc/target/collected/org/apache/beam/sdk/testing/SourceTestUtils.java>:145:
warning - Tag @link: reference not found: Source.Reader
  [javadoc] <https://builds.apache.org/job/beam_PostCommit_Java_JDK_Versions_Test/jdk=JDK%201.7%20(latest),label=beam/ws/sdks/java/javadoc/target/collected/org/apache/beam/sdk/testing/SourceTestUtils.java>:168:
warning - Tag @link: reference not found: Source.Reader
  [javadoc] <https://builds.apache.org/job/beam_PostCommit_Java_JDK_Versions_Test/jdk=JDK%201.7%20(latest),label=beam/ws/sdks/java/javadoc/target/collected/org/apache/beam/sdk/testing/SourceTestUtils.java>:168:
warning - Tag @link: reference not found: Source.Reader#start
  [javadoc] <https://builds.apache.org/job/beam_PostCommit_Java_JDK_Versions_Test/jdk=JDK%201.7%20(latest),label=beam/ws/sdks/java/javadoc/target/collected/org/apache/beam/sdk/testing/SourceTestUtils.java>:159:
warning - Tag @link: reference not found: Source.Reader
  [javadoc] <https://builds.apache.org/job/beam_PostCommit_Java_JDK_Versions_Test/jdk=JDK%201.7%20(latest),label=beam/ws/sdks/java/javadoc/target/collected/org/apache/beam/sdk/testing/SourceTestUtils.java>:200:
warning - Tag @link: reference not found: Source.Reader
  [javadoc] <https://builds.apache.org/job/beam_PostCommit_Java_JDK_Versions_Test/jdk=JDK%201.7%20(latest),label=beam/ws/sdks/java/javadoc/target/collected/org/apache/beam/sdk/testing/SourceTestUtils.java>:145:
warning - Tag @link: reference not found: Source.Reader
  [javadoc] <https://builds.apache.org/job/beam_PostCommit_Java_JDK_Versions_Test/jdk=JDK%201.7%20(latest),label=beam/ws/sdks/java/javadoc/target/collected/org/apache/beam/sdk/testing/SourceTestUtils.java>:152:
warning - Tag @link: reference not found: Source.Reader
  [javadoc] <https://builds.apache.org/job/beam_PostCommit_Java_JDK_Versions_Test/jdk=JDK%201.7%20(latest),label=beam/ws/sdks/java/javadoc/target/collected/org/apache/beam/sdk/testing/SourceTestUtils.java>:159:
warning - Tag @link: reference not found: Source.Reader
  [javadoc] <https://builds.apache.org/job/beam_PostCommit_Java_JDK_Versions_Test/jdk=JDK%201.7%20(latest),label=beam/ws/sdks/java/javadoc/target/collected/org/apache/beam/sdk/testing/SourceTestUtils.java>:168:
warning - Tag @link: reference not found: Source.Reader
  [javadoc] <https://builds.apache.org/job/beam_PostCommit_Java_JDK_Versions_Test/jdk=JDK%201.7%20(latest),label=beam/ws/sdks/java/javadoc/target/collected/org/apache/beam/sdk/testing/SourceTestUtils.java>:168:
warning - Tag @link: reference not found: Source.Reader#start
  [javadoc] <https://builds.apache.org/job/beam_PostCommit_Java_JDK_Versions_Test/jdk=JDK%201.7%20(latest),label=beam/ws/sdks/java/javadoc/target/collected/org/apache/beam/sdk/testing/SourceTestUtils.java>:200:
warning - Tag @link: reference not found: Source.Reader
  [javadoc] <https://builds.apache.org/job/beam_PostCommit_Java_JDK_Versions_Test/jdk=JDK%201.7%20(latest),label=beam/ws/sdks/java/javadoc/target/collected/org/apache/beam/sdk/testing/SourceTestUtils.java>:450:
warning - Tag @link: reference not found: BoundedSource.BoundedReader#splitAtFraction
  [javadoc] <https://builds.apache.org/job/beam_PostCommit_Java_JDK_Versions_Test/jdk=JDK%201.7%20(latest),label=beam/ws/sdks/java/javadoc/target/collected/org/apache/beam/sdk/testing/SourceTestUtils.java>:552:
warning - Tag @link: reference not found: BoundedSource.BoundedReader#splitAtFraction
  [javadoc] <https://builds.apache.org/job/beam_PostCommit_Java_JDK_Versions_Test/jdk=JDK%201.7%20(latest),label=beam/ws/sdks/java/javadoc/target/collected/org/apache/beam/sdk/transforms/PTransform.java>:208:
warning - Tag @link: reference not found: InputT
  [javadoc] <https://builds.apache.org/job/beam_PostCommit_Java_JDK_Versions_Test/jdk=JDK%201.7%20(latest),label=beam/ws/sdks/java/javadoc/target/collected/org/apache/beam/sdk/transforms/PTransform.java>:208:
warning - Tag @link: reference not found: InputT
  [javadoc] <https://builds.apache.org/job/beam_PostCommit_Java_JDK_Versions_Test/jdk=JDK%201.7%20(latest),label=beam/ws/sdks/java/javadoc/target/collected/org/apache/beam/sdk/transforms/splittabledofn/RestrictionTracker.java>:47:
warning - Tag @link: reference not found: DoFn.ProcessElement
  [javadoc] <https://builds.apache.org/job/beam_PostCommit_Java_JDK_Versions_Test/jdk=JDK%201.7%20(latest),label=beam/ws/sdks/java/javadoc/target/collected/org/apache/beam/sdk/transforms/splittabledofn/RestrictionTracker.java>:39:
warning - Tag @link: reference not found: DoFn.ProcessElement
  [javadoc] <https://builds.apache.org/job/beam_PostCommit_Java_JDK_Versions_Test/jdk=JDK%201.7%20(latest),label=beam/ws/sdks/java/javadoc/target/collected/org/apache/beam/sdk/transforms/splittabledofn/RestrictionTracker.java>:31:
warning - Tag @link: reference not found: DoFn.ProcessElement
  [javadoc] <https://builds.apache.org/job/beam_PostCommit_Java_JDK_Versions_Test/jdk=JDK%201.7%20(latest),label=beam/ws/sdks/java/javadoc/target/collected/org/apache/beam/sdk/transforms/splittabledofn/RestrictionTracker.java>:31:
warning - Tag @link: reference not found: DoFn.ProcessElement
  [javadoc] <https://builds.apache.org/job/beam_PostCommit_Java_JDK_Versions_Test/jdk=JDK%201.7%20(latest),label=beam/ws/sdks/java/javadoc/target/collected/org/apache/beam/sdk/transforms/splittabledofn/RestrictionTracker.java>:39:
warning - Tag @link: reference not found: DoFn.ProcessElement
  [javadoc] <https://builds.apache.org/job/beam_PostCommit_Java_JDK_Versions_Test/jdk=JDK%201.7%20(latest),label=beam/ws/sdks/java/javadoc/target/collected/org/apache/beam/sdk/transforms/splittabledofn/RestrictionTracker.java>:47:
warning - Tag @link: reference not found: DoFn.ProcessElement
  [javadoc] <https://builds.apache.org/job/beam_PostCommit_Java_JDK_Versions_Test/jdk=JDK%201.7%20(latest),label=beam/ws/sdks/java/javadoc/target/collected/org/apache/beam/sdk/transforms/splittabledofn/RestrictionTracker.java>:47:
warning - Tag @link: reference not found: DoFn.ProcessElement
  [javadoc] <https://builds.apache.org/job/beam_PostCommit_Java_JDK_Versions_Test/jdk=JDK%201.7%20(latest),label=beam/ws/sdks/java/javadoc/target/collected/org/apache/beam/sdk/transforms/splittabledofn/RestrictionTracker.java>:39:
warning - Tag @link: reference not found: DoFn.ProcessElement
  [javadoc] <https://builds.apache.org/job/beam_PostCommit_Java_JDK_Versions_Test/jdk=JDK%201.7%20(latest),label=beam/ws/sdks/java/javadoc/target/collected/org/apache/beam/sdk/transforms/splittabledofn/RestrictionTracker.java>:31:
warning - Tag @link: reference not found: DoFn.ProcessElement
  [javadoc] <https://builds.apache.org/job/beam_PostCommit_Java_JDK_Versions_Test/jdk=JDK%201.7%20(latest),label=beam/ws/sdks/java/javadoc/target/collected/org/apache/beam/sdk/transforms/splittabledofn/RestrictionTracker.java>:31:
warning - Tag @link: reference not found: DoFn.ProcessElement
  [javadoc] <https://builds.apache.org/job/beam_PostCommit_Java_JDK_Versions_Test/jdk=JDK%201.7%20(latest),label=beam/ws/sdks/java/javadoc/target/collected/org/apache/beam/sdk/transforms/splittabledofn/RestrictionTracker.java>:39:
warning - Tag @link: reference not found: DoFn.ProcessElement
  [javadoc] <https://builds.apache.org/job/beam_PostCommit_Java_JDK_Versions_Test/jdk=JDK%201.7%20(latest),label=beam/ws/sdks/java/javadoc/target/collected/org/apache/beam/sdk/transforms/splittabledofn/RestrictionTracker.java>:47:
warning - Tag @link: reference not found: DoFn.ProcessElement
  [javadoc] <https://builds.apache.org/job/beam_PostCommit_Java_JDK_Versions_Test/jdk=JDK%201.7%20(latest),label=beam/ws/sdks/java/javadoc/target/collected/org/apache/beam/sdk/transforms/windowing/PaneInfo.java>:44:
warning - Tag @link: reference not found: DoFn.ProcessContext#pane
  [javadoc] <https://builds.apache.org/job/beam_PostCommit_Java_JDK_Versions_Test/jdk=JDK%201.7%20(latest),label=beam/ws/sdks/java/javadoc/target/collected/org/apache/beam/sdk/transforms/windowing/PaneInfo.java>:44:
warning - Tag @link: reference not found: DoFn.ProcessElement
  [javadoc] <https://builds.apache.org/job/beam_PostCommit_Java_JDK_Versions_Test/jdk=JDK%201.7%20(latest),label=beam/ws/sdks/java/javadoc/target/collected/org/apache/beam/runners/dataflow/PrimitiveParDoSingleFactory.java>:40:
warning - Tag @link: reference not found: ParDo.SingleOutput
  [javadoc] <https://builds.apache.org/job/beam_PostCommit_Java_JDK_Versions_Test/jdk=JDK%201.7%20(latest),label=beam/ws/sdks/java/javadoc/target/collected/org/apache/beam/runners/direct/package-info.java>:25:
warning - Tag @link: reference not found: org.apache.beam.sdk.runners
  [javadoc] <https://builds.apache.org/job/beam_PostCommit_Java_JDK_Versions_Test/jdk=JDK%201.7%20(latest),label=beam/ws/sdks/java/javadoc/target/collected/org/apache/beam/runners/flink/metrics/ReaderInvocationUtil.java>:34:
warning - Tag @link: reference not found: Source.Reader
  [javadoc] Building index for all the packages and classes...
  [javadoc] <https://builds.apache.org/job/beam_PostCommit_Java_JDK_Versions_Test/jdk=JDK%201.7%20(latest),label=beam/ws/sdks/java/javadoc/target/collected/org/apache/beam/sdk/testing/SourceTestUtils.java>:552:
warning - Tag @link: reference not found: BoundedSource.BoundedReader#splitAtFraction
  [javadoc] <https://builds.apache.org/job/beam_PostCommit_Java_JDK_Versions_Test/jdk=JDK%201.7%20(latest),label=beam/ws/sdks/java/javadoc/target/collected/org/apache/beam/sdk/testing/SourceTestUtils.java>:450:
warning - Tag @link: reference not found: BoundedSource.BoundedReader#splitAtFraction
  [javadoc] <https://builds.apache.org/job/beam_PostCommit_Java_JDK_Versions_Test/jdk=JDK%201.7%20(latest),label=beam/ws/sdks/java/javadoc/target/collected/org/apache/beam/sdk/transforms/splittabledofn/RestrictionTracker.java>:47:
warning - Tag @link: reference not found: DoFn.ProcessElement
  [javadoc] <https://builds.apache.org/job/beam_PostCommit_Java_JDK_Versions_Test/jdk=JDK%201.7%20(latest),label=beam/ws/sdks/java/javadoc/target/collected/org/apache/beam/sdk/transforms/splittabledofn/RestrictionTracker.java>:39:
warning - Tag @link: reference not found: DoFn.ProcessElement
  [javadoc] <https://builds.apache.org/job/beam_PostCommit_Java_JDK_Versions_Test/jdk=JDK%201.7%20(latest),label=beam/ws/sdks/java/javadoc/target/collected/org/apache/beam/sdk/io/FileSystem.java>:80:
warning - Tag @link: reference not found: ResourceIdT
  [javadoc] <https://builds.apache.org/job/beam_PostCommit_Java_JDK_Versions_Test/jdk=JDK%201.7%20(latest),label=beam/ws/sdks/java/javadoc/target/collected/org/apache/beam/sdk/transforms/splittabledofn/RestrictionTracker.java>:31:
warning - Tag @link: reference not found: DoFn.ProcessElement
  [javadoc] <https://builds.apache.org/job/beam_PostCommit_Java_JDK_Versions_Test/jdk=JDK%201.7%20(latest),label=beam/ws/sdks/java/javadoc/target/collected/org/apache/beam/sdk/transforms/PTransform.java>:208:
warning - Tag @link: reference not found: InputT
  [javadoc] <https://builds.apache.org/job/beam_PostCommit_Java_JDK_Versions_Test/jdk=JDK%201.7%20(latest),label=beam/ws/sdks/java/javadoc/target/collected/org/apache/beam/sdk/io/gcp/bigquery/DynamicDestinations.java>:136:
warning - Tag @link: reference not found: DestinationT
  [javadoc] <https://builds.apache.org/job/beam_PostCommit_Java_JDK_Versions_Test/jdk=JDK%201.7%20(latest),label=beam/ws/sdks/java/javadoc/target/collected/org/apache/beam/sdk/io/FileSystem.java>:70:
warning - Tag @link: reference not found: ResourceIdT ResourceIds
  [javadoc] <https://builds.apache.org/job/beam_PostCommit_Java_JDK_Versions_Test/jdk=JDK%201.7%20(latest),label=beam/ws/sdks/java/javadoc/target/collected/org/apache/beam/sdk/io/FileSystem.java>:93:
warning - Tag @link: reference not found: ResourceIdT
  [javadoc] <https://builds.apache.org/job/beam_PostCommit_Java_JDK_Versions_Test/jdk=JDK%201.7%20(latest),label=beam/ws/sdks/java/javadoc/target/collected/org/apache/beam/runners/dataflow/PrimitiveParDoSingleFactory.java>:40:
warning - Tag @link: reference not found: ParDo.SingleOutput
  [javadoc] <https://builds.apache.org/job/beam_PostCommit_Java_JDK_Versions_Test/jdk=JDK%201.7%20(latest),label=beam/ws/sdks/java/javadoc/target/collected/org/apache/beam/runners/flink/metrics/ReaderInvocationUtil.java>:34:
warning - Tag @link: reference not found: Source.Reader
  [javadoc] <https://builds.apache.org/job/beam_PostCommit_Java_JDK_Versions_Test/jdk=JDK%201.7%20(latest),label=beam/ws/sdks/java/javadoc/target/collected/org/apache/beam/sdk/testing/SourceTestUtils.java>:152:
warning - Tag @link: reference not found: Source.Reader
  [javadoc] <https://builds.apache.org/job/beam_PostCommit_Java_JDK_Versions_Test/jdk=JDK%201.7%20(latest),label=beam/ws/sdks/java/javadoc/target/collected/org/apache/beam/sdk/testing/SourceTestUtils.java>:145:
warning - Tag @link: reference not found: Source.Reader
  [javadoc] <https://builds.apache.org/job/beam_PostCommit_Java_JDK_Versions_Test/jdk=JDK%201.7%20(latest),label=beam/ws/sdks/java/javadoc/target/collected/org/apache/beam/sdk/testing/SourceTestUtils.java>:168:
warning - Tag @link: reference not found: Source.Reader
  [javadoc] <https://builds.apache.org/job/beam_PostCommit_Java_JDK_Versions_Test/jdk=JDK%201.7%20(latest),label=beam/ws/sdks/java/javadoc/target/collected/org/apache/beam/sdk/testing/SourceTestUtils.java>:168:
warning - Tag @link: reference not found: Source.Reader#start
  [javadoc] <https://builds.apache.org/job/beam_PostCommit_Java_JDK_Versions_Test/jdk=JDK%201.7%20(latest),label=beam/ws/sdks/java/javadoc/target/collected/org/apache/beam/sdk/testing/SourceTestUtils.java>:159:
warning - Tag @link: reference not found: Source.Reader
  [javadoc] <https://builds.apache.org/job/beam_PostCommit_Java_JDK_Versions_Test/jdk=JDK%201.7%20(latest),label=beam/ws/sdks/java/javadoc/target/collected/org/apache/beam/sdk/testing/SourceTestUtils.java>:200:
warning - Tag @link: reference not found: Source.Reader
  [javadoc] <https://builds.apache.org/job/beam_PostCommit_Java_JDK_Versions_Test/jdk=JDK%201.7%20(latest),label=beam/ws/sdks/java/javadoc/target/collected/org/apache/beam/sdk/io/CompressedSource.java>:534:
warning - Tag @link: reference not found: FileBasedReader#startReading(ReadableByteChannel)
  [javadoc] Building index for all classes...
  [javadoc] Generating <https://builds.apache.org/job/beam_PostCommit_Java_JDK_Versions_Test/jdk=JDK%201.7%20(latest),label=beam/ws/sdks/java/target/site/javadoc/help-doc.html...>
  [javadoc] 15 errors
  [javadoc] 115 warnings
2017-06-02\T\06:27:59.381 [INFO] ------------------------------------------------------------------------
2017-06-02\T\06:27:59.381 [INFO] Reactor Summary:
2017-06-02\T\06:27:59.381 [INFO] 
2017-06-02\T\06:27:59.381 [INFO] Apache Beam :: Parent .............................. SUCCESS
[ 17.951 s]
2017-06-02\T\06:27:59.381 [INFO] Apache Beam :: SDKs :: Java :: Build Tools ......... SUCCESS
[  4.973 s]
2017-06-02\T\06:27:59.381 [INFO] Apache Beam :: SDKs ................................ SUCCESS
[  0.475 s]
2017-06-02\T\06:27:59.381 [INFO] Apache Beam :: SDKs :: Common ...................... SUCCESS
[  0.446 s]
2017-06-02\T\06:27:59.381 [INFO] Apache Beam :: SDKs :: Common :: Fn API ............ SUCCESS
[  8.151 s]
2017-06-02\T\06:27:59.381 [INFO] Apache Beam :: SDKs :: Common :: Runner API ........ SUCCESS
[  1.925 s]
2017-06-02\T\06:27:59.381 [INFO] Apache Beam :: SDKs :: Java ........................ SUCCESS
[  0.526 s]
2017-06-02\T\06:27:59.381 [INFO] Apache Beam :: SDKs :: Java :: Core ................ SUCCESS
[01:15 min]
2017-06-02\T\06:27:59.381 [INFO] Apache Beam :: SDKs :: Java :: IO .................. SUCCESS
[  0.498 s]
2017-06-02\T\06:27:59.381 [INFO] Apache Beam :: SDKs :: Java :: IO :: Common ........ SUCCESS
[  2.972 s]
2017-06-02\T\06:27:59.381 [INFO] Apache Beam :: Runners ............................. SUCCESS
[  0.545 s]
2017-06-02\T\06:27:59.381 [INFO] Apache Beam :: Runners :: Core Construction Java ... SUCCESS
[ 10.518 s]
2017-06-02\T\06:27:59.381 [INFO] Apache Beam :: Runners :: Core Java ................ SUCCESS
[ 24.485 s]
2017-06-02\T\06:27:59.382 [INFO] Apache Beam :: Runners :: Direct Java .............. SUCCESS
[02:45 min]
2017-06-02\T\06:27:59.382 [INFO] Apache Beam :: SDKs :: Java :: IO :: Elasticsearch . SUCCESS
[ 23.773 s]
2017-06-02\T\06:27:59.382 [INFO] Apache Beam :: SDKs :: Java :: Extensions .......... SUCCESS
[  0.416 s]
2017-06-02\T\06:27:59.382 [INFO] Apache Beam :: SDKs :: Java :: Extensions :: Google Cloud
Platform Core SUCCESS [ 20.497 s]
2017-06-02\T\06:27:59.382 [INFO] Apache Beam :: SDKs :: Java :: Extensions :: Protobuf SUCCESS
[  8.085 s]
2017-06-02\T\06:27:59.382 [INFO] Apache Beam :: SDKs :: Java :: IO :: Google Cloud Platform
SUCCESS [ 46.896 s]
2017-06-02\T\06:27:59.382 [INFO] Apache Beam :: SDKs :: Java :: IO :: Hadoop Common . SUCCESS
[ 11.559 s]
2017-06-02\T\06:27:59.382 [INFO] Apache Beam :: SDKs :: Java :: IO :: Hadoop File System SUCCESS
[ 20.903 s]
2017-06-02\T\06:27:59.382 [INFO] Apache Beam :: SDKs :: Java :: IO :: Hadoop ........ SUCCESS
[  2.768 s]
2017-06-02\T\06:27:59.382 [INFO] Apache Beam :: SDKs :: Java :: IO :: Hadoop :: input-format
SUCCESS [  9.218 s]
2017-06-02\T\06:27:59.382 [INFO] Apache Beam :: SDKs :: Java :: IO :: HBase ......... SUCCESS
[ 49.330 s]
2017-06-02\T\06:27:59.382 [INFO] Apache Beam :: Runners :: Google Cloud Dataflow .... SUCCESS
[05:41 min]
2017-06-02\T\06:27:59.382 [INFO] Apache Beam :: SDKs :: Java :: IO :: JDBC .......... SUCCESS
[ 17.546 s]
2017-06-02\T\06:27:59.382 [INFO] Apache Beam :: SDKs :: Java :: IO :: JMS ........... SUCCESS
[  9.637 s]
2017-06-02\T\06:27:59.382 [INFO] Apache Beam :: SDKs :: Java :: IO :: Kafka ......... SUCCESS
[ 23.974 s]
2017-06-02\T\06:27:59.382 [INFO] Apache Beam :: SDKs :: Java :: IO :: Kinesis ....... SUCCESS
[ 11.170 s]
2017-06-02\T\06:27:59.382 [INFO] Apache Beam :: SDKs :: Java :: IO :: MongoDB ....... SUCCESS
[ 19.927 s]
2017-06-02\T\06:27:59.382 [INFO] Apache Beam :: SDKs :: Java :: IO :: MQTT .......... SUCCESS
[  9.864 s]
2017-06-02\T\06:27:59.382 [INFO] Apache Beam :: SDKs :: Java :: IO :: XML ........... SUCCESS
[ 13.206 s]
2017-06-02\T\06:27:59.382 [INFO] Apache Beam :: SDKs :: Java :: Maven Archetypes .... SUCCESS
[  0.440 s]
2017-06-02\T\06:27:59.382 [INFO] Apache Beam :: SDKs :: Java :: Maven Archetypes :: Starter
SUCCESS [ 10.623 s]
2017-06-02\T\06:27:59.382 [INFO] Apache Beam :: Examples ............................ SUCCESS
[  0.479 s]
2017-06-02\T\06:27:59.382 [INFO] Apache Beam :: Examples :: Java .................... SUCCESS
[06:42 min]
2017-06-02\T\06:27:59.382 [INFO] Apache Beam :: SDKs :: Java :: Maven Archetypes :: Examples
SUCCESS [ 24.184 s]
2017-06-02\T\06:27:59.382 [INFO] Apache Beam :: SDKs :: Java :: Extensions :: Jackson SUCCESS
[  5.946 s]
2017-06-02\T\06:27:59.382 [INFO] Apache Beam :: SDKs :: Java :: Extensions :: Join library
SUCCESS [  7.574 s]
2017-06-02\T\06:27:59.382 [INFO] Apache Beam :: SDKs :: Java :: Extensions :: Sorter  SUCCESS
[ 20.275 s]
2017-06-02\T\06:27:59.382 [INFO] Apache Beam :: Runners :: Flink .................... SUCCESS
[ 16.925 s]
2017-06-02\T\06:27:59.382 [INFO] Apache Beam :: Runners :: Spark .................... SUCCESS
[02:34 min]
2017-06-02\T\06:27:59.382 [INFO] Apache Beam :: SDKs :: Java :: Aggregated Javadoc .. FAILURE
[ 32.538 s]
2017-06-02\T\06:27:59.382 [INFO] ------------------------------------------------------------------------
2017-06-02\T\06:27:59.382 [INFO] BUILD FAILURE
2017-06-02\T\06:27:59.382 [INFO] ------------------------------------------------------------------------
2017-06-02\T\06:27:59.382 [INFO] Total time: 27:13 min
2017-06-02\T\06:27:59.382 [INFO] Finished at: 2017-06-02T06:27:59+00:00
2017-06-02\T\06:27:59.905 [INFO] Final Memory: 173M/3426M
2017-06-02\T\06:27:59.905 [INFO] ------------------------------------------------------------------------
2017-06-02\T\06:27:59.906 [ERROR] PermGen space -> [Help 1]
---------------------------------------------------
constituent[0]: file:/home/jenkins/tools/maven/apache-maven-3.3.3/lib/commons-lang-2.6.jar
constituent[1]: file:/home/jenkins/tools/maven/apache-maven-3.3.3/lib/plexus-interpolation-1.21.jar
constituent[2]: file:/home/jenkins/tools/maven/apache-maven-3.3.3/lib/org.eclipse.sisu.plexus-0.3.0.jar
constituent[3]: file:/home/jenkins/tools/maven/apache-maven-3.3.3/lib/plexus-utils-3.0.20.jar
constituent[4]: file:/home/jenkins/tools/maven/apache-maven-3.3.3/lib/wagon-file-2.9.jar
constituent[5]: file:/home/jenkins/tools/maven/apache-maven-3.3.3/lib/cdi-api-1.0.jar
constituent[6]: file:/home/jenkins/tools/maven/apache-maven-3.3.3/lib/wagon-http-shared-2.9.jar
constituent[7]: file:/home/jenkins/tools/maven/apache-maven-3.3.3/lib/aether-api-1.0.2.v20150114.jar
constituent[8]: file:/home/jenkins/tools/maven/apache-maven-3.3.3/lib/plexus-component-annotations-1.5.5.jar
constituent[9]: file:/home/jenkins/tools/maven/apache-maven-3.3.3/lib/jsoup-1.7.2.jar
constituent[10]: file:/home/jenkins/tools/maven/apache-maven-3.3.3/lib/wagon-http-2.9-shaded.jar
constituent[11]: file:/home/jenkins/tools/maven/apache-maven-3.3.3/lib/plexus-cipher-1.7.jar
constituent[12]: file:/home/jenkins/tools/maven/apache-maven-3.3.3/lib/org.eclipse.sisu.inject-0.3.0.jar
constituent[13]: file:/home/jenkins/tools/maven/apache-maven-3.3.3/lib/aether-spi-1.0.2.v20150114.jar
constituent[14]: file:/home/jenkins/tools/maven/apache-maven-3.3.3/lib/commons-cli-1.2.jar
constituent[15]: file:/home/jenkins/tools/maven/apache-maven-3.3.3/lib/aether-transport-wagon-1.0.2.v20150114.jar
constituent[16]: file:/home/jenkins/tools/maven/apache-maven-3.3.3/lib/javax.inject-1.jar
constituent[17]: file:/home/jenkins/tools/maven/apache-maven-3.3.3/lib/maven-compat-3.3.3.jar
constituent[18]: file:/home/jenkins/tools/maven/apache-maven-3.3.3/lib/maven-model-builder-3.3.3.jar
constituent[19]: file:/home/jenkins/tools/maven/apache-maven-3.3.3/lib/maven-settings-builder-3.3.3.jar
constituent[20]: file:/home/jenkins/tools/maven/apache-maven-3.3.3/lib/jsr250-api-1.0.jar
constituent[21]: file:/home/jenkins/tools/maven/apache-maven-3.3.3/lib/maven-model-3.3.3.jar
constituent[22]: file:/home/jenkins/tools/maven/apache-maven-3.3.3/lib/slf4j-simple-1.7.5.jar
constituent[23]: file:/home/jenkins/tools/maven/apache-maven-3.3.3/lib/wagon-provider-api-2.9.jar
constituent[24]: file:/home/jenkins/tools/maven/apache-maven-3.3.3/lib/maven-plugin-api-3.3.3.jar
constituent[25]: file:/home/jenkins/tools/maven/apache-maven-3.3.3/lib/commons-io-2.2.jar
constituent[26]: file:/home/jenkins/tools/maven/apache-maven-3.3.3/lib/maven-repository-metadata-3.3.3.jar
constituent[27]: file:/home/jenkins/tools/maven/apache-maven-3.3.3/lib/maven-core-3.3.3.jar
constituent[28]: file:/home/jenkins/tools/maven/apache-maven-3.3.3/lib/aether-connector-basic-1.0.2.v20150114.jar
constituent[29]: file:/home/jenkins/tools/maven/apache-maven-3.3.3/lib/sisu-guice-3.2.5-no_aop.jar
constituent[30]: file:/home/jenkins/tools/maven/apache-maven-3.3.3/lib/maven-artifact-3.3.3.jar
constituent[31]: file:/home/jenkins/tools/maven/apache-maven-3.3.3/lib/maven-builder-support-3.3.3.jar
constituent[32]: file:/home/jenkins/tools/maven/apache-maven-3.3.3/lib/aopalliance-1.0.jar
constituent[33]: file:/home/jenkins/tools/maven/apache-maven-3.3.3/lib/aether-impl-1.0.2.v20150114.jar
constituent[34]: file:/home/jenkins/tools/maven/apache-maven-3.3.3/lib/plexus-sec-dispatcher-1.3.jar
constituent[35]: file:/home/jenkins/tools/maven/apache-maven-3.3.3/lib/maven-settings-3.3.3.jar
constituent[36]: file:/home/jenkins/tools/maven/apache-maven-3.3.3/lib/aether-util-1.0.2.v20150114.jar
constituent[37]: file:/home/jenkins/tools/maven/apache-maven-3.3.3/lib/maven-embedder-3.3.3.jar
constituent[38]: file:/home/jenkins/tools/maven/apache-maven-3.3.3/lib/guava-18.0.jar
constituent[39]: file:/home/jenkins/tools/maven/apache-maven-3.3.3/lib/slf4j-api-1.7.5.jar
constituent[40]: file:/home/jenkins/tools/maven/apache-maven-3.3.3/lib/maven-aether-provider-3.3.3.jar
constituent[41]: file:/home/jenkins/tools/maven/apache-maven-3.3.3/conf/logging/
---------------------------------------------------
Exception in thread "main" 
Exception: java.lang.OutOfMemoryError thrown from the UncaughtExceptionHandler in thread "main"
Build step 'Invoke top-level Maven targets' marked build as failure
Not sending mail to unregistered user kirpichov@google.com
Not sending mail to unregistered user aljoscha.krettek@gmail.com
Not sending mail to unregistered user klk@google.com
Not sending mail to unregistered user hepei.hp@alibaba-inc.com

Mime
View raw message