beam-commits mailing list archives

Site index · List index
Message view « Date » · « Thread »
Top « Date » · « Thread »
From Apache Jenkins Server <jenk...@builds.apache.org>
Subject Build failed in Jenkins: beam_PostCommit_Java_MavenInstall_Windows #139
Date Fri, 16 Jun 2017 06:37:40 GMT
See <https://builds.apache.org/job/beam_PostCommit_Java_MavenInstall_Windows/139/display/redirect>

------------------------------------------
[...truncated 2.64 MB...]
2017-06-16T06:36:06.741 [INFO] Downloading: https://repo.maven.apache.org/maven2/org/sonatype/gossip/gossip/1.8/gossip-1.8.pom
2017-06-16T06:36:06.751 [INFO] Downloaded: https://repo.maven.apache.org/maven2/org/sonatype/gossip/gossip/1.8/gossip-1.8.pom
(12 KB at 1125.6 KB/sec)
2017-06-16T06:36:06.755 [INFO] Downloading: https://repo.maven.apache.org/maven2/org/sonatype/forge/forge-parent/9/forge-parent-9.pom
2017-06-16T06:36:06.849 [INFO] Downloaded: https://repo.maven.apache.org/maven2/org/sonatype/forge/forge-parent/9/forge-parent-9.pom
(13 KB at 136.5 KB/sec)
2017-06-16T06:36:06.854 [INFO] Downloading: https://repo.maven.apache.org/maven2/org/sonatype/gossip/gossip-core/1.8/gossip-core-1.8.pom
2017-06-16T06:36:06.863 [INFO] Downloaded: https://repo.maven.apache.org/maven2/org/sonatype/gossip/gossip-core/1.8/gossip-core-1.8.pom
(3 KB at 241.4 KB/sec)
2017-06-16T06:36:06.868 [INFO] Downloading: https://repo.maven.apache.org/maven2/org/sonatype/gossip/gossip-bootstrap/1.8/gossip-bootstrap-1.8.pom
2017-06-16T06:36:06.958 [INFO] Downloaded: https://repo.maven.apache.org/maven2/org/sonatype/gossip/gossip-bootstrap/1.8/gossip-bootstrap-1.8.pom
(2 KB at 17.5 KB/sec)
2017-06-16T06:36:06.962 [INFO] Downloading: https://repo.maven.apache.org/maven2/com/google/guava/guava/14.0.1/guava-14.0.1.pom
2017-06-16T06:36:06.975 [INFO] Downloaded: https://repo.maven.apache.org/maven2/com/google/guava/guava/14.0.1/guava-14.0.1.pom
(6 KB at 403.8 KB/sec)
2017-06-16T06:36:06.979 [INFO] Downloading: https://repo.maven.apache.org/maven2/com/google/guava/guava-parent/14.0.1/guava-parent-14.0.1.pom
2017-06-16T06:36:06.988 [INFO] Downloaded: https://repo.maven.apache.org/maven2/com/google/guava/guava-parent/14.0.1/guava-parent-14.0.1.pom
(3 KB at 277.2 KB/sec)
2017-06-16T06:36:06.993 [INFO] Downloading: https://repo.maven.apache.org/maven2/org/codehaus/plexus/plexus-classworlds/2.4.2/plexus-classworlds-2.4.2.pom
2017-06-16T06:36:07.005 [INFO] Downloaded: https://repo.maven.apache.org/maven2/org/codehaus/plexus/plexus-classworlds/2.4.2/plexus-classworlds-2.4.2.pom
(4 KB at 285.6 KB/sec)
2017-06-16T06:36:07.012 [INFO] Downloading: https://repo.maven.apache.org/maven2/org/codehaus/plexus/plexus-interpolation/1.16/plexus-interpolation-1.16.pom
2017-06-16T06:36:07.103 [INFO] Downloaded: https://repo.maven.apache.org/maven2/org/codehaus/plexus/plexus-interpolation/1.16/plexus-interpolation-1.16.pom
(2 KB at 11.0 KB/sec)
2017-06-16T06:36:07.109 [INFO] Downloading: https://repo.maven.apache.org/maven2/org/eclipse/aether/aether-api/0.9.0.M2/aether-api-0.9.0.M2.pom
2017-06-16T06:36:07.118 [INFO] Downloaded: https://repo.maven.apache.org/maven2/org/eclipse/aether/aether-api/0.9.0.M2/aether-api-0.9.0.M2.pom
(2 KB at 188.5 KB/sec)
2017-06-16T06:36:07.123 [INFO] Downloading: https://repo.maven.apache.org/maven2/org/codehaus/gmaven/gmaven-adapter-api/2.0/gmaven-adapter-api-2.0.pom
2017-06-16T06:36:07.214 [INFO] Downloaded: https://repo.maven.apache.org/maven2/org/codehaus/gmaven/gmaven-adapter-api/2.0/gmaven-adapter-api-2.0.pom
(2 KB at 19.4 KB/sec)
2017-06-16T06:36:07.220 [INFO] Downloading: https://repo.maven.apache.org/maven2/org/codehaus/gmaven/gmaven-adapter-impl/2.0/gmaven-adapter-impl-2.0.pom
2017-06-16T06:36:07.393 [INFO] Downloaded: https://repo.maven.apache.org/maven2/org/codehaus/gmaven/gmaven-adapter-impl/2.0/gmaven-adapter-impl-2.0.pom
(3 KB at 15.3 KB/sec)
2017-06-16T06:36:07.398 [INFO] Downloading: https://repo.maven.apache.org/maven2/org/codehaus/groovy/groovy-all/2.1.5/groovy-all-2.1.5.pom
2017-06-16T06:36:07.408 [INFO] Downloaded: https://repo.maven.apache.org/maven2/org/codehaus/groovy/groovy-all/2.1.5/groovy-all-2.1.5.pom
(18 KB at 1761.6 KB/sec)
2017-06-16T06:36:07.413 [INFO] Downloading: https://repo.maven.apache.org/maven2/org/apache/ant/ant/1.8.4/ant-1.8.4.pom
2017-06-16T06:36:07.424 [INFO] Downloaded: https://repo.maven.apache.org/maven2/org/apache/ant/ant/1.8.4/ant-1.8.4.pom
(10 KB at 857.1 KB/sec)
2017-06-16T06:36:07.429 [INFO] Downloading: https://repo.maven.apache.org/maven2/org/apache/ant/ant-parent/1.8.4/ant-parent-1.8.4.pom
2017-06-16T06:36:07.441 [INFO] Downloaded: https://repo.maven.apache.org/maven2/org/apache/ant/ant-parent/1.8.4/ant-parent-1.8.4.pom
(5 KB at 371.2 KB/sec)
2017-06-16T06:36:07.446 [INFO] Downloading: https://repo.maven.apache.org/maven2/org/apache/ant/ant-launcher/1.8.4/ant-launcher-1.8.4.pom
2017-06-16T06:36:07.453 [INFO] Downloaded: https://repo.maven.apache.org/maven2/org/apache/ant/ant-launcher/1.8.4/ant-launcher-1.8.4.pom
(3 KB at 329.4 KB/sec)
2017-06-16T06:36:07.457 [INFO] Downloading: https://repo.maven.apache.org/maven2/org/fusesource/jansi/jansi/1.11/jansi-1.11.pom
2017-06-16T06:36:07.473 [INFO] Downloaded: https://repo.maven.apache.org/maven2/org/fusesource/jansi/jansi/1.11/jansi-1.11.pom
(4 KB at 219.8 KB/sec)
2017-06-16T06:36:07.477 [INFO] Downloading: https://repo.maven.apache.org/maven2/org/fusesource/jansi/jansi-project/1.11/jansi-project-1.11.pom
2017-06-16T06:36:07.486 [INFO] Downloaded: https://repo.maven.apache.org/maven2/org/fusesource/jansi/jansi-project/1.11/jansi-project-1.11.pom
(12 KB at 1242.1 KB/sec)
2017-06-16T06:36:07.490 [INFO] Downloading: https://repo.maven.apache.org/maven2/org/fusesource/fusesource-pom/1.8/fusesource-pom-1.8.pom
2017-06-16T06:36:07.500 [INFO] Downloaded: https://repo.maven.apache.org/maven2/org/fusesource/fusesource-pom/1.8/fusesource-pom-1.8.pom
(15 KB at 1431.2 KB/sec)
2017-06-16T06:36:07.516 [INFO] Downloading: https://repo.maven.apache.org/maven2/org/sonatype/gossip/gossip-core/1.8/gossip-core-1.8.jar
2017-06-16T06:36:07.516 [INFO] Downloading: https://repo.maven.apache.org/maven2/org/sonatype/gossip/gossip-slf4j/1.8/gossip-slf4j-1.8.jar
2017-06-16T06:36:07.518 [INFO] Downloading: https://repo.maven.apache.org/maven2/com/google/guava/guava/14.0.1/guava-14.0.1.jar
2017-06-16T06:36:07.518 [INFO] Downloading: https://repo.maven.apache.org/maven2/org/sonatype/gossip/gossip-bootstrap/1.8/gossip-bootstrap-1.8.jar
2017-06-16T06:36:07.518 [INFO] Downloading: https://repo.maven.apache.org/maven2/org/codehaus/plexus/plexus-classworlds/2.4.2/plexus-classworlds-2.4.2.jar
2017-06-16T06:36:07.556 [INFO] Downloaded: https://repo.maven.apache.org/maven2/org/sonatype/gossip/gossip-bootstrap/1.8/gossip-bootstrap-1.8.jar
(20 KB at 470.6 KB/sec)
2017-06-16T06:36:07.556 [INFO] Downloading: https://repo.maven.apache.org/maven2/org/codehaus/plexus/plexus-interpolation/1.16/plexus-interpolation-1.16.jar
2017-06-16T06:36:07.559 [INFO] Downloaded: https://repo.maven.apache.org/maven2/org/codehaus/plexus/plexus-classworlds/2.4.2/plexus-classworlds-2.4.2.jar
(46 KB at 1066.7 KB/sec)
2017-06-16T06:36:07.559 [INFO] Downloading: https://repo.maven.apache.org/maven2/org/eclipse/aether/aether-api/0.9.0.M2/aether-api-0.9.0.M2.jar
2017-06-16T06:36:07.571 [INFO] Downloaded: https://repo.maven.apache.org/maven2/org/sonatype/gossip/gossip-slf4j/1.8/gossip-slf4j-1.8.jar
(5 KB at 73.7 KB/sec)
2017-06-16T06:36:07.571 [INFO] Downloading: https://repo.maven.apache.org/maven2/org/codehaus/gmaven/gmaven-adapter-api/2.0/gmaven-adapter-api-2.0.jar
2017-06-16T06:36:07.573 [INFO] Downloaded: https://repo.maven.apache.org/maven2/org/sonatype/gossip/gossip-core/1.8/gossip-core-1.8.jar
(57 KB at 973.4 KB/sec)
2017-06-16T06:36:07.573 [INFO] Downloading: https://repo.maven.apache.org/maven2/org/codehaus/gmaven/gmaven-adapter-impl/2.0/gmaven-adapter-impl-2.0.jar
2017-06-16T06:36:07.603 [INFO] Downloaded: https://repo.maven.apache.org/maven2/org/eclipse/aether/aether-api/0.9.0.M2/aether-api-0.9.0.M2.jar
(131 KB at 1503.6 KB/sec)
2017-06-16T06:36:07.603 [INFO] Downloading: https://repo.maven.apache.org/maven2/org/codehaus/groovy/groovy-all/2.1.5/groovy-all-2.1.5.jar
2017-06-16T06:36:07.730 [INFO] Downloaded: https://repo.maven.apache.org/maven2/org/codehaus/gmaven/gmaven-adapter-impl/2.0/gmaven-adapter-impl-2.0.jar
(16 KB at 73.8 KB/sec)
2017-06-16T06:36:07.730 [INFO] Downloading: https://repo.maven.apache.org/maven2/org/apache/ant/ant/1.8.4/ant-1.8.4.jar
2017-06-16T06:36:07.735 [INFO] Downloaded: https://repo.maven.apache.org/maven2/org/codehaus/plexus/plexus-interpolation/1.16/plexus-interpolation-1.16.jar
(60 KB at 273.4 KB/sec)
2017-06-16T06:36:07.735 [INFO] Downloading: https://repo.maven.apache.org/maven2/org/apache/ant/ant-launcher/1.8.4/ant-launcher-1.8.4.jar
2017-06-16T06:36:07.764 [INFO] Downloaded: https://repo.maven.apache.org/maven2/com/google/guava/guava/14.0.1/guava-14.0.1.jar
(2138 KB at 8585.6 KB/sec)
2017-06-16T06:36:07.764 [INFO] Downloading: https://repo.maven.apache.org/maven2/org/fusesource/jansi/jansi/1.11/jansi-1.11.jar
2017-06-16T06:36:07.805 [INFO] Downloaded: https://repo.maven.apache.org/maven2/org/fusesource/jansi/jansi/1.11/jansi-1.11.jar
(112 KB at 388.0 KB/sec)
2017-06-16T06:36:07.908 [INFO] Downloaded: https://repo.maven.apache.org/maven2/org/codehaus/gmaven/gmaven-adapter-api/2.0/gmaven-adapter-api-2.0.jar
(7 KB at 17.7 KB/sec)
2017-06-16T06:36:07.909 [INFO] Downloaded: https://repo.maven.apache.org/maven2/org/apache/ant/ant-launcher/1.8.4/ant-launcher-1.8.4.jar
(18 KB at 45.8 KB/sec)
2017-06-16T06:36:07.910 [INFO] Downloaded: https://repo.maven.apache.org/maven2/org/apache/ant/ant/1.8.4/ant-1.8.4.jar
(1897 KB at 4812.7 KB/sec)
2017-06-16T06:36:08.373 [INFO] Downloaded: https://repo.maven.apache.org/maven2/org/codehaus/groovy/groovy-all/2.1.5/groovy-all-2.1.5.jar
(6219 KB at 7255.9 KB/sec)
[JENKINS] Archiving disabled
2017-06-16T06:36:12.272 [INFO]                                                           
             
2017-06-16T06:36:12.272 [INFO] ------------------------------------------------------------------------
2017-06-16T06:36:12.272 [INFO] Skipping Apache Beam :: Parent
2017-06-16T06:36:12.272 [INFO] This project has been banned from the build due to previous
failures.
2017-06-16T06:36:12.272 [INFO] ------------------------------------------------------------------------
[JENKINS] Archiving disabled
[JENKINS] Archiving disabled
[JENKINS] Archiving disabled
[JENKINS] Archiving disabled
[JENKINS] Archiving disabled
[JENKINS] Archiving disabled
[JENKINS] Archiving disabled
[JENKINS] Archiving disabled
[JENKINS] Archiving disabled
[JENKINS] Archiving disabled
[JENKINS] Archiving disabled
[JENKINS] Archiving disabled
[JENKINS] Archiving disabled
[JENKINS] Archiving disabled
[JENKINS] Archiving disabled
[JENKINS] Archiving disabled
[JENKINS] Archiving disabled
[JENKINS] Archiving disabled
[JENKINS] Archiving disabled
[JENKINS] Archiving disabled
[JENKINS] Archiving disabled
[JENKINS] Archiving disabled
[JENKINS] Archiving disabled
[JENKINS] Archiving disabled
[JENKINS] Archiving disabled
[JENKINS] Archiving disabled
[JENKINS] Archiving disabled
[JENKINS] Archiving disabled
[JENKINS] Archiving disabled
[JENKINS] Archiving disabled
[JENKINS] Archiving disabled
[JENKINS] Archiving disabled
[JENKINS] Archiving disabled
[JENKINS] Archiving disabled
[JENKINS] Archiving disabled
[JENKINS] Archiving disabled
[JENKINS] Archiving disabled
[JENKINS] Archiving disabled
[JENKINS] Archiving disabled
[JENKINS] Archiving disabled
[JENKINS] Archiving disabled
[JENKINS] Archiving disabled
[JENKINS] Archiving disabled
[JENKINS] Archiving disabled
[JENKINS] Archiving disabled
[JENKINS] Archiving disabled
[JENKINS] Archiving disabled
[JENKINS] Archiving disabled
[JENKINS] Archiving disabled
[JENKINS] Archiving disabled
2017-06-16T06:37:14.918 [INFO] ------------------------------------------------------------------------
2017-06-16T06:37:14.918 [INFO] Reactor Summary:
2017-06-16T06:37:14.918 [INFO] 
2017-06-16T06:37:14.918 [INFO] Apache Beam :: Parent .............................. SUCCESS
[ 26.307 s]
2017-06-16T06:37:14.918 [INFO] Apache Beam :: SDKs :: Java :: Build Tools ......... SUCCESS
[ 17.580 s]
2017-06-16T06:37:14.919 [INFO] Apache Beam :: SDKs ................................ SUCCESS
[  9.659 s]
2017-06-16T06:37:14.919 [INFO] Apache Beam :: SDKs :: Common ...................... SUCCESS
[  5.306 s]
2017-06-16T06:37:14.919 [INFO] Apache Beam :: SDKs :: Common :: Runner API ........ SUCCESS
[ 25.088 s]
2017-06-16T06:37:14.919 [INFO] Apache Beam :: SDKs :: Common :: Fn API ............ SUCCESS
[ 22.200 s]
2017-06-16T06:37:14.919 [INFO] Apache Beam :: SDKs :: Java ........................ SUCCESS
[  5.592 s]
2017-06-16T06:37:14.919 [INFO] Apache Beam :: SDKs :: Java :: Core ................ SUCCESS
[04:15 min]
2017-06-16T06:37:14.919 [INFO] Apache Beam :: Runners ............................. SUCCESS
[  5.537 s]
2017-06-16T06:37:14.919 [INFO] Apache Beam :: Runners :: Core Construction Java ... SUCCESS
[ 48.752 s]
2017-06-16T06:37:14.919 [INFO] Apache Beam :: Runners :: Core Java ................ SUCCESS
[01:11 min]
2017-06-16T06:37:14.919 [INFO] Apache Beam :: Runners :: Direct Java .............. SUCCESS
[03:32 min]
2017-06-16T06:37:14.919 [INFO] Apache Beam :: SDKs :: Java :: IO .................. SUCCESS
[  6.353 s]
2017-06-16T06:37:14.919 [INFO] Apache Beam :: SDKs :: Java :: IO :: Common ........ SUCCESS
[ 11.816 s]
2017-06-16T06:37:14.919 [INFO] Apache Beam :: SDKs :: Java :: IO :: Cassandra ..... SUCCESS
[ 38.321 s]
2017-06-16T06:37:14.919 [INFO] Apache Beam :: SDKs :: Java :: IO :: Elasticsearch . SUCCESS
[ 55.654 s]
2017-06-16T06:37:14.920 [INFO] Apache Beam :: SDKs :: Java :: Extensions .......... SUCCESS
[  5.595 s]
2017-06-16T06:37:14.920 [INFO] Apache Beam :: SDKs :: Java :: Extensions :: Google Cloud Platform
Core SUCCESS [ 54.396 s]
2017-06-16T06:37:14.920 [INFO] Apache Beam :: SDKs :: Java :: Extensions :: Protobuf SUCCESS
[ 32.419 s]
2017-06-16T06:37:14.920 [INFO] Apache Beam :: SDKs :: Java :: IO :: Google Cloud Platform
SUCCESS [01:39 min]
2017-06-16T06:37:14.920 [INFO] Apache Beam :: SDKs :: Java :: IO :: Hadoop Common . SUCCESS
[ 33.760 s]
2017-06-16T06:37:14.920 [INFO] Apache Beam :: SDKs :: Java :: IO :: Hadoop File System SUCCESS
[01:09 min]
2017-06-16T06:37:14.920 [INFO] Apache Beam :: SDKs :: Java :: IO :: Hadoop ........ SUCCESS
[  9.464 s]
2017-06-16T06:37:14.920 [INFO] Apache Beam :: SDKs :: Java :: IO :: Hadoop :: input-format
SUCCESS [ 38.722 s]
2017-06-16T06:37:14.920 [INFO] Apache Beam :: SDKs :: Java :: IO :: Hadoop :: jdk1.8-tests
SUCCESS [01:57 min]
2017-06-16T06:37:14.922 [INFO] Apache Beam :: SDKs :: Java :: IO :: HBase ......... SUCCESS
[ 57.743 s]
2017-06-16T06:37:14.922 [INFO] Apache Beam :: SDKs :: Java :: IO :: HCatalog ...... SUCCESS
[01:12 min]
2017-06-16T06:37:14.922 [INFO] Apache Beam :: SDKs :: Java :: IO :: JDBC .......... SUCCESS
[ 53.688 s]
2017-06-16T06:37:14.922 [INFO] Apache Beam :: SDKs :: Java :: IO :: JMS ........... SUCCESS
[ 37.486 s]
2017-06-16T06:37:14.922 [INFO] Apache Beam :: SDKs :: Java :: IO :: Kafka ......... SUCCESS
[ 49.809 s]
2017-06-16T06:37:14.922 [INFO] Apache Beam :: SDKs :: Java :: IO :: Kinesis ....... SUCCESS
[ 44.833 s]
2017-06-16T06:37:14.922 [INFO] Apache Beam :: SDKs :: Java :: IO :: MongoDB ....... SUCCESS
[01:01 min]
2017-06-16T06:37:14.922 [INFO] Apache Beam :: SDKs :: Java :: IO :: MQTT .......... SUCCESS
[ 33.972 s]
2017-06-16T06:37:14.922 [INFO] Apache Beam :: SDKs :: Java :: IO :: XML ........... SUCCESS
[ 33.747 s]
2017-06-16T06:37:14.922 [INFO] Apache Beam :: SDKs :: Java :: Maven Archetypes .... SUCCESS
[  5.253 s]
2017-06-16T06:37:14.922 [INFO] Apache Beam :: SDKs :: Java :: Maven Archetypes :: Starter
SUCCESS [ 27.522 s]
2017-06-16T06:37:14.922 [INFO] Apache Beam :: SDKs :: Java :: Extensions :: Jackson SUCCESS
[ 33.134 s]
2017-06-16T06:37:14.922 [INFO] Apache Beam :: SDKs :: Java :: Extensions :: Join library SUCCESS
[ 31.890 s]
2017-06-16T06:37:14.922 [INFO] Apache Beam :: SDKs :: Java :: Extensions :: Sorter  SUCCESS
[ 38.728 s]
2017-06-16T06:37:14.922 [INFO] Apache Beam :: Runners :: Google Cloud Dataflow .... SUCCESS
[01:01 min]
2017-06-16T06:37:14.922 [INFO] Apache Beam :: SDKs :: Java :: Harness ............. SUCCESS
[01:09 min]
2017-06-16T06:37:14.922 [INFO] Apache Beam :: SDKs :: Java :: Java 8 Tests ........ SUCCESS
[ 26.289 s]
2017-06-16T06:37:14.922 [INFO] Apache Beam :: SDKs :: Python ...................... FAILURE
[  4.610 s]
2017-06-16T06:37:14.922 [INFO] Apache Beam :: Runners :: Flink .................... SKIPPED
2017-06-16T06:37:14.922 [INFO] Apache Beam :: Runners :: Spark .................... SKIPPED
2017-06-16T06:37:14.922 [INFO] Apache Beam :: Runners :: Apex ..................... SKIPPED
2017-06-16T06:37:14.922 [INFO] Apache Beam :: Examples ............................ SKIPPED
2017-06-16T06:37:14.922 [INFO] Apache Beam :: Examples :: Java .................... SKIPPED
2017-06-16T06:37:14.922 [INFO] Apache Beam :: Examples :: Java 8 .................. SKIPPED
2017-06-16T06:37:14.922 [INFO] Apache Beam :: SDKs :: Java :: Aggregated Javadoc .. SKIPPED
2017-06-16T06:37:14.922 [INFO] ------------------------------------------------------------------------
2017-06-16T06:37:14.922 [INFO] BUILD FAILURE
2017-06-16T06:37:14.922 [INFO] ------------------------------------------------------------------------
2017-06-16T06:37:14.923 [INFO] Total time: 36:33 min
2017-06-16T06:37:14.923 [INFO] Finished at: 2017-06-16T06:37:14+00:00
2017-06-16T06:37:16.350 [INFO] Final Memory: 408M/3190M
2017-06-16T06:37:16.350 [INFO] ------------------------------------------------------------------------
2017-06-16T06:37:16.364 [ERROR] Failed to execute goal org.codehaus.gmaven:groovy-maven-plugin:2.0:execute
(find-supported-python-for-clean) on project beam-sdks-python: Unable to find Python 2.7 in
path -> [Help 1]
org.apache.maven.lifecycle.LifecycleExecutionException: Failed to execute goal org.codehaus.gmaven:groovy-maven-plugin:2.0:execute
(find-supported-python-for-clean) on project beam-sdks-python: Unable to find Python 2.7 in
path
	at org.apache.maven.lifecycle.internal.MojoExecutor.execute(MojoExecutor.java:212)
	at org.apache.maven.lifecycle.internal.MojoExecutor.execute(MojoExecutor.java:153)
	at org.apache.maven.lifecycle.internal.MojoExecutor.execute(MojoExecutor.java:145)
	at org.apache.maven.lifecycle.internal.LifecycleModuleBuilder.buildProject(LifecycleModuleBuilder.java:116)
	at org.apache.maven.lifecycle.internal.LifecycleModuleBuilder.buildProject(LifecycleModuleBuilder.java:80)
	at org.apache.maven.lifecycle.internal.builder.singlethreaded.SingleThreadedBuilder.build(SingleThreadedBuilder.java:51)
	at org.apache.maven.lifecycle.internal.LifecycleStarter.execute(LifecycleStarter.java:128)
	at org.apache.maven.DefaultMaven.doExecute(DefaultMaven.java:307)
	at org.apache.maven.DefaultMaven.doExecute(DefaultMaven.java:193)
	at org.apache.maven.DefaultMaven.execute(DefaultMaven.java:106)
	at org.jvnet.hudson.maven3.launcher.Maven33Launcher.main(Maven33Launcher.java:129)
	at sun.reflect.NativeMethodAccessorImpl.invoke0(Native Method)
	at sun.reflect.NativeMethodAccessorImpl.invoke(NativeMethodAccessorImpl.java:62)
	at sun.reflect.DelegatingMethodAccessorImpl.invoke(DelegatingMethodAccessorImpl.java:43)
	at java.lang.reflect.Method.invoke(Method.java:498)
	at org.codehaus.plexus.classworlds.launcher.Launcher.launchStandard(Launcher.java:330)
	at org.codehaus.plexus.classworlds.launcher.Launcher.launch(Launcher.java:238)
	at jenkins.maven3.agent.Maven33Main.launch(Maven33Main.java:176)
	at sun.reflect.NativeMethodAccessorImpl.invoke0(Native Method)
	at sun.reflect.NativeMethodAccessorImpl.invoke(NativeMethodAccessorImpl.java:62)
	at sun.reflect.DelegatingMethodAccessorImpl.invoke(DelegatingMethodAccessorImpl.java:43)
	at java.lang.reflect.Method.invoke(Method.java:498)
	at hudson.maven.Maven3Builder.call(Maven3Builder.java:139)
	at hudson.maven.Maven3Builder.call(Maven3Builder.java:70)
	at hudson.remoting.UserRequest.perform(UserRequest.java:120)
	at hudson.remoting.UserRequest.perform(UserRequest.java:48)
	at hudson.remoting.Request$2.run(Request.java:326)
	at hudson.remoting.InterceptingExecutorService$1.call(InterceptingExecutorService.java:68)
	at java.util.concurrent.FutureTask.run(FutureTask.java:266)
	at java.util.concurrent.ThreadPoolExecutor.runWorker(ThreadPoolExecutor.java:1142)
	at java.util.concurrent.ThreadPoolExecutor$Worker.run(ThreadPoolExecutor.java:617)
	at java.lang.Thread.run(Thread.java:745)
Caused by: org.apache.maven.plugin.MojoFailureException: Unable to find Python 2.7 in path
	at sun.reflect.NativeConstructorAccessorImpl.newInstance0(Native Method)
	at sun.reflect.NativeConstructorAccessorImpl.newInstance(NativeConstructorAccessorImpl.java:62)
	at sun.reflect.DelegatingConstructorAccessorImpl.newInstance(DelegatingConstructorAccessorImpl.java:45)
	at java.lang.reflect.Constructor.newInstance(Constructor.java:423)
	at org.codehaus.groovy.reflection.CachedConstructor.invoke(CachedConstructor.java:77)
	at org.codehaus.groovy.runtime.callsite.ConstructorSite$ConstructorSiteNoUnwrapNoCoerce.callConstructor(ConstructorSite.java:102)
	at org.codehaus.groovy.runtime.callsite.CallSiteArray.defaultCallConstructor(CallSiteArray.java:57)
	at org.codehaus.groovy.runtime.callsite.AbstractCallSite.callConstructor(AbstractCallSite.java:182)
	at org.codehaus.groovy.runtime.callsite.AbstractCallSite.callConstructor(AbstractCallSite.java:190)
	at findSupportedPython.run(findSupportedPython.groovy:70)
	at groovy.lang.GroovyShell.evaluate(GroovyShell.java:518)
	at org.codehaus.gmaven.adapter.impl.ScriptExecutorImpl.execute(ScriptExecutorImpl.java:80)
	at org.codehaus.gmaven.plugin.ExecuteMojo$1.run(ExecuteMojo.java:100)
	at org.codehaus.gmaven.plugin.util.SystemNoExitGuard.run(SystemNoExitGuard.java:45)
	at org.codehaus.gmaven.plugin.ExecuteMojo.run(ExecuteMojo.java:96)
	at org.codehaus.gmaven.plugin.MojoSupport.execute(MojoSupport.java:45)
	at org.apache.maven.plugin.DefaultBuildPluginManager.executeMojo(DefaultBuildPluginManager.java:134)
	at org.apache.maven.lifecycle.internal.MojoExecutor.execute(MojoExecutor.java:208)
	... 31 more
2017-06-16T06:37:16.381 [ERROR] 
2017-06-16T06:37:16.382 [ERROR] Re-run Maven using the -X switch to enable full debug logging.
2017-06-16T06:37:16.382 [ERROR] 
2017-06-16T06:37:16.382 [ERROR] For more information about the errors and possible solutions,
please read the following articles:
2017-06-16T06:37:16.382 [ERROR] [Help 1] http://cwiki.apache.org/confluence/display/MAVEN/MojoFailureException
2017-06-16T06:37:16.383 [ERROR] 
2017-06-16T06:37:16.383 [ERROR] After correcting the problems, you can resume the build with
the command
2017-06-16T06:37:16.383 [ERROR]   mvn <goals> -rf :beam-sdks-python
channel stopped
Not sending mail to unregistered user aljoscha.krettek@gmail.com
Not sending mail to unregistered user github@nakomis.com
Not sending mail to unregistered user hepei.hp@alibaba-inc.com
Not sending mail to unregistered user sourabhbajaj@google.com
Not sending mail to unregistered user klk@google.com
Not sending mail to unregistered user ccy@google.com
Not sending mail to unregistered user kirpichov@google.com
Not sending mail to unregistered user mingmxu@ebay.com

Mime
View raw message