beam-commits mailing list archives

Site index · List index
Message view « Date » · « Thread »
Top « Date » · « Thread »
From Apache Jenkins Server <jenk...@builds.apache.org>
Subject Build failed in Jenkins: beam_PostCommit_Java_MavenInstall_Windows #137
Date Thu, 15 Jun 2017 18:36:12 GMT
See <https://builds.apache.org/job/beam_PostCommit_Java_MavenInstall_Windows/137/display/redirect?page=changes>

Changes:

[ccy] Migrate DirectRunner evaluators to use Beam state API

------------------------------------------
[...truncated 2.64 MB...]
2017-06-15T18:34:41.387 [INFO] Downloaded: https://repo.maven.apache.org/maven2/org/sonatype/gossip/gossip/1.8/gossip-1.8.pom
(12 KB at 938.0 KB/sec)
2017-06-15T18:34:41.392 [INFO] Downloading: https://repo.maven.apache.org/maven2/org/sonatype/forge/forge-parent/9/forge-parent-9.pom
2017-06-15T18:34:41.402 [INFO] Downloaded: https://repo.maven.apache.org/maven2/org/sonatype/forge/forge-parent/9/forge-parent-9.pom
(13 KB at 1283.4 KB/sec)
2017-06-15T18:34:41.408 [INFO] Downloading: https://repo.maven.apache.org/maven2/org/sonatype/gossip/gossip-core/1.8/gossip-core-1.8.pom
2017-06-15T18:34:41.420 [INFO] Downloaded: https://repo.maven.apache.org/maven2/org/sonatype/gossip/gossip-core/1.8/gossip-core-1.8.pom
(3 KB at 181.1 KB/sec)
2017-06-15T18:34:41.425 [INFO] Downloading: https://repo.maven.apache.org/maven2/org/sonatype/gossip/gossip-bootstrap/1.8/gossip-bootstrap-1.8.pom
2017-06-15T18:34:41.435 [INFO] Downloaded: https://repo.maven.apache.org/maven2/org/sonatype/gossip/gossip-bootstrap/1.8/gossip-bootstrap-1.8.pom
(2 KB at 157.3 KB/sec)
2017-06-15T18:34:41.439 [INFO] Downloading: https://repo.maven.apache.org/maven2/com/google/guava/guava/14.0.1/guava-14.0.1.pom
2017-06-15T18:34:41.451 [INFO] Downloaded: https://repo.maven.apache.org/maven2/com/google/guava/guava/14.0.1/guava-14.0.1.pom
(6 KB at 437.5 KB/sec)
2017-06-15T18:34:41.455 [INFO] Downloading: https://repo.maven.apache.org/maven2/com/google/guava/guava-parent/14.0.1/guava-parent-14.0.1.pom
2017-06-15T18:34:41.466 [INFO] Downloaded: https://repo.maven.apache.org/maven2/com/google/guava/guava-parent/14.0.1/guava-parent-14.0.1.pom
(3 KB at 226.8 KB/sec)
2017-06-15T18:34:41.471 [INFO] Downloading: https://repo.maven.apache.org/maven2/org/codehaus/plexus/plexus-classworlds/2.4.2/plexus-classworlds-2.4.2.pom
2017-06-15T18:34:41.483 [INFO] Downloaded: https://repo.maven.apache.org/maven2/org/codehaus/plexus/plexus-classworlds/2.4.2/plexus-classworlds-2.4.2.pom
(4 KB at 285.6 KB/sec)
2017-06-15T18:34:41.488 [INFO] Downloading: https://repo.maven.apache.org/maven2/org/codehaus/plexus/plexus-interpolation/1.16/plexus-interpolation-1.16.pom
2017-06-15T18:34:41.499 [INFO] Downloaded: https://repo.maven.apache.org/maven2/org/codehaus/plexus/plexus-interpolation/1.16/plexus-interpolation-1.16.pom
(2 KB at 91.2 KB/sec)
2017-06-15T18:34:41.504 [INFO] Downloading: https://repo.maven.apache.org/maven2/org/eclipse/aether/aether-api/0.9.0.M2/aether-api-0.9.0.M2.pom
2017-06-15T18:34:41.515 [INFO] Downloaded: https://repo.maven.apache.org/maven2/org/eclipse/aether/aether-api/0.9.0.M2/aether-api-0.9.0.M2.pom
(2 KB at 154.2 KB/sec)
2017-06-15T18:34:41.521 [INFO] Downloading: https://repo.maven.apache.org/maven2/org/codehaus/gmaven/gmaven-adapter-api/2.0/gmaven-adapter-api-2.0.pom
2017-06-15T18:34:41.530 [INFO] Downloaded: https://repo.maven.apache.org/maven2/org/codehaus/gmaven/gmaven-adapter-api/2.0/gmaven-adapter-api-2.0.pom
(2 KB at 196.0 KB/sec)
2017-06-15T18:34:41.536 [INFO] Downloading: https://repo.maven.apache.org/maven2/org/codehaus/gmaven/gmaven-adapter-impl/2.0/gmaven-adapter-impl-2.0.pom
2017-06-15T18:34:41.547 [INFO] Downloaded: https://repo.maven.apache.org/maven2/org/codehaus/gmaven/gmaven-adapter-impl/2.0/gmaven-adapter-impl-2.0.pom
(3 KB at 241.3 KB/sec)
2017-06-15T18:34:41.552 [INFO] Downloading: https://repo.maven.apache.org/maven2/org/codehaus/groovy/groovy-all/2.1.5/groovy-all-2.1.5.pom
2017-06-15T18:34:41.565 [INFO] Downloaded: https://repo.maven.apache.org/maven2/org/codehaus/groovy/groovy-all/2.1.5/groovy-all-2.1.5.pom
(18 KB at 1355.1 KB/sec)
2017-06-15T18:34:41.570 [INFO] Downloading: https://repo.maven.apache.org/maven2/org/apache/ant/ant/1.8.4/ant-1.8.4.pom
2017-06-15T18:34:41.582 [INFO] Downloaded: https://repo.maven.apache.org/maven2/org/apache/ant/ant/1.8.4/ant-1.8.4.pom
(10 KB at 785.6 KB/sec)
2017-06-15T18:34:41.586 [INFO] Downloading: https://repo.maven.apache.org/maven2/org/apache/ant/ant-parent/1.8.4/ant-parent-1.8.4.pom
2017-06-15T18:34:41.598 [INFO] Downloaded: https://repo.maven.apache.org/maven2/org/apache/ant/ant-parent/1.8.4/ant-parent-1.8.4.pom
(5 KB at 371.2 KB/sec)
2017-06-15T18:34:41.602 [INFO] Downloading: https://repo.maven.apache.org/maven2/org/apache/ant/ant-launcher/1.8.4/ant-launcher-1.8.4.pom
2017-06-15T18:34:41.612 [INFO] Downloaded: https://repo.maven.apache.org/maven2/org/apache/ant/ant-launcher/1.8.4/ant-launcher-1.8.4.pom
(3 KB at 230.6 KB/sec)
2017-06-15T18:34:41.617 [INFO] Downloading: https://repo.maven.apache.org/maven2/org/fusesource/jansi/jansi/1.11/jansi-1.11.pom
2017-06-15T18:34:41.627 [INFO] Downloaded: https://repo.maven.apache.org/maven2/org/fusesource/jansi/jansi/1.11/jansi-1.11.pom
(4 KB at 319.7 KB/sec)
2017-06-15T18:34:41.631 [INFO] Downloading: https://repo.maven.apache.org/maven2/org/fusesource/jansi/jansi-project/1.11/jansi-project-1.11.pom
2017-06-15T18:34:41.642 [INFO] Downloaded: https://repo.maven.apache.org/maven2/org/fusesource/jansi/jansi-project/1.11/jansi-project-1.11.pom
(12 KB at 1016.2 KB/sec)
2017-06-15T18:34:41.647 [INFO] Downloading: https://repo.maven.apache.org/maven2/org/fusesource/fusesource-pom/1.8/fusesource-pom-1.8.pom
2017-06-15T18:34:41.658 [INFO] Downloaded: https://repo.maven.apache.org/maven2/org/fusesource/fusesource-pom/1.8/fusesource-pom-1.8.pom
(15 KB at 1301.0 KB/sec)
2017-06-15T18:34:41.675 [INFO] Downloading: https://repo.maven.apache.org/maven2/org/sonatype/gossip/gossip-core/1.8/gossip-core-1.8.jar
2017-06-15T18:34:41.675 [INFO] Downloading: https://repo.maven.apache.org/maven2/org/sonatype/gossip/gossip-slf4j/1.8/gossip-slf4j-1.8.jar
2017-06-15T18:34:41.675 [INFO] Downloading: https://repo.maven.apache.org/maven2/org/sonatype/gossip/gossip-bootstrap/1.8/gossip-bootstrap-1.8.jar
2017-06-15T18:34:41.676 [INFO] Downloading: https://repo.maven.apache.org/maven2/org/codehaus/plexus/plexus-classworlds/2.4.2/plexus-classworlds-2.4.2.jar
2017-06-15T18:34:41.676 [INFO] Downloading: https://repo.maven.apache.org/maven2/com/google/guava/guava/14.0.1/guava-14.0.1.jar
2017-06-15T18:34:41.695 [INFO] Downloaded: https://repo.maven.apache.org/maven2/org/sonatype/gossip/gossip-slf4j/1.8/gossip-slf4j-1.8.jar
(5 KB at 196.6 KB/sec)
2017-06-15T18:34:41.695 [INFO] Downloading: https://repo.maven.apache.org/maven2/org/codehaus/plexus/plexus-interpolation/1.16/plexus-interpolation-1.16.jar
2017-06-15T18:34:41.698 [INFO] Downloaded: https://repo.maven.apache.org/maven2/org/sonatype/gossip/gossip-core/1.8/gossip-core-1.8.jar
(57 KB at 2352.5 KB/sec)
2017-06-15T18:34:41.699 [INFO] Downloading: https://repo.maven.apache.org/maven2/org/eclipse/aether/aether-api/0.9.0.M2/aether-api-0.9.0.M2.jar
2017-06-15T18:34:41.701 [INFO] Downloaded: https://repo.maven.apache.org/maven2/org/sonatype/gossip/gossip-bootstrap/1.8/gossip-bootstrap-1.8.jar
(20 KB at 714.6 KB/sec)
2017-06-15T18:34:41.701 [INFO] Downloading: https://repo.maven.apache.org/maven2/org/codehaus/gmaven/gmaven-adapter-api/2.0/gmaven-adapter-api-2.0.jar
2017-06-15T18:34:41.702 [INFO] Downloaded: https://repo.maven.apache.org/maven2/org/codehaus/plexus/plexus-classworlds/2.4.2/plexus-classworlds-2.4.2.jar
(46 KB at 1698.8 KB/sec)
2017-06-15T18:34:41.702 [INFO] Downloading: https://repo.maven.apache.org/maven2/org/codehaus/gmaven/gmaven-adapter-impl/2.0/gmaven-adapter-impl-2.0.jar
2017-06-15T18:34:41.715 [INFO] Downloaded: https://repo.maven.apache.org/maven2/org/codehaus/plexus/plexus-interpolation/1.16/plexus-interpolation-1.16.jar
(60 KB at 1496.8 KB/sec)
2017-06-15T18:34:41.715 [INFO] Downloading: https://repo.maven.apache.org/maven2/org/codehaus/groovy/groovy-all/2.1.5/groovy-all-2.1.5.jar
2017-06-15T18:34:41.718 [INFO] Downloaded: https://repo.maven.apache.org/maven2/org/codehaus/gmaven/gmaven-adapter-impl/2.0/gmaven-adapter-impl-2.0.jar
(16 KB at 367.3 KB/sec)
2017-06-15T18:34:41.718 [INFO] Downloading: https://repo.maven.apache.org/maven2/org/apache/ant/ant/1.8.4/ant-1.8.4.jar
2017-06-15T18:34:41.720 [INFO] Downloaded: https://repo.maven.apache.org/maven2/org/codehaus/gmaven/gmaven-adapter-api/2.0/gmaven-adapter-api-2.0.jar
(7 KB at 153.6 KB/sec)
2017-06-15T18:34:41.720 [INFO] Downloading: https://repo.maven.apache.org/maven2/org/apache/ant/ant-launcher/1.8.4/ant-launcher-1.8.4.jar
2017-06-15T18:34:41.723 [INFO] Downloaded: https://repo.maven.apache.org/maven2/org/eclipse/aether/aether-api/0.9.0.M2/aether-api-0.9.0.M2.jar
(131 KB at 2725.4 KB/sec)
2017-06-15T18:34:41.723 [INFO] Downloading: https://repo.maven.apache.org/maven2/org/fusesource/jansi/jansi/1.11/jansi-1.11.jar
2017-06-15T18:34:41.751 [INFO] Downloaded: https://repo.maven.apache.org/maven2/org/apache/ant/ant-launcher/1.8.4/ant-launcher-1.8.4.jar
(18 KB at 236.8 KB/sec)
2017-06-15T18:34:41.757 [INFO] Downloaded: https://repo.maven.apache.org/maven2/org/fusesource/jansi/jansi/1.11/jansi-1.11.jar
(112 KB at 1362.6 KB/sec)
2017-06-15T18:34:41.910 [INFO] Downloaded: https://repo.maven.apache.org/maven2/com/google/guava/guava/14.0.1/guava-14.0.1.jar
(2138 KB at 9058.5 KB/sec)
2017-06-15T18:34:41.942 [INFO] Downloaded: https://repo.maven.apache.org/maven2/org/apache/ant/ant/1.8.4/ant-1.8.4.jar
(1897 KB at 7102.0 KB/sec)
2017-06-15T18:34:42.364 [INFO] Downloaded: https://repo.maven.apache.org/maven2/org/codehaus/groovy/groovy-all/2.1.5/groovy-all-2.1.5.jar
(6219 KB at 9038.2 KB/sec)
[JENKINS] Archiving disabled
2017-06-15T18:34:45.626 [INFO]                                                           
             
2017-06-15T18:34:45.626 [INFO] ------------------------------------------------------------------------
2017-06-15T18:34:45.626 [INFO] Skipping Apache Beam :: Parent
2017-06-15T18:34:45.626 [INFO] This project has been banned from the build due to previous
failures.
2017-06-15T18:34:45.626 [INFO] ------------------------------------------------------------------------
[JENKINS] Archiving disabled
[JENKINS] Archiving disabled
[JENKINS] Archiving disabled
[JENKINS] Archiving disabled
[JENKINS] Archiving disabled
[JENKINS] Archiving disabled
[JENKINS] Archiving disabled
[JENKINS] Archiving disabled
[JENKINS] Archiving disabled
[JENKINS] Archiving disabled
[JENKINS] Archiving disabled
[JENKINS] Archiving disabled
[JENKINS] Archiving disabled
[JENKINS] Archiving disabled
[JENKINS] Archiving disabled
[JENKINS] Archiving disabled
[JENKINS] Archiving disabled
[JENKINS] Archiving disabled
[JENKINS] Archiving disabled
[JENKINS] Archiving disabled
[JENKINS] Archiving disabled
[JENKINS] Archiving disabled
[JENKINS] Archiving disabled
[JENKINS] Archiving disabled
[JENKINS] Archiving disabled
[JENKINS] Archiving disabled
[JENKINS] Archiving disabled
[JENKINS] Archiving disabled
[JENKINS] Archiving disabled
[JENKINS] Archiving disabled
[JENKINS] Archiving disabled
[JENKINS] Archiving disabled
[JENKINS] Archiving disabled
[JENKINS] Archiving disabled
[JENKINS] Archiving disabled
[JENKINS] Archiving disabled
[JENKINS] Archiving disabled
[JENKINS] Archiving disabled
[JENKINS] Archiving disabled
[JENKINS] Archiving disabled
[JENKINS] Archiving disabled
[JENKINS] Archiving disabled
[JENKINS] Archiving disabled
[JENKINS] Archiving disabled
[JENKINS] Archiving disabled
[JENKINS] Archiving disabled
[JENKINS] Archiving disabled
[JENKINS] Archiving disabled
[JENKINS] Archiving disabled
[JENKINS] Archiving disabled
2017-06-15T18:35:46.372 [INFO] ------------------------------------------------------------------------
2017-06-15T18:35:46.372 [INFO] Reactor Summary:
2017-06-15T18:35:46.372 [INFO] 
2017-06-15T18:35:46.373 [INFO] Apache Beam :: Parent .............................. SUCCESS
[ 35.281 s]
2017-06-15T18:35:46.373 [INFO] Apache Beam :: SDKs :: Java :: Build Tools ......... SUCCESS
[ 17.063 s]
2017-06-15T18:35:46.374 [INFO] Apache Beam :: SDKs ................................ SUCCESS
[  9.486 s]
2017-06-15T18:35:46.374 [INFO] Apache Beam :: SDKs :: Common ...................... SUCCESS
[  5.275 s]
2017-06-15T18:35:46.374 [INFO] Apache Beam :: SDKs :: Common :: Runner API ........ SUCCESS
[ 24.981 s]
2017-06-15T18:35:46.374 [INFO] Apache Beam :: SDKs :: Common :: Fn API ............ SUCCESS
[ 23.391 s]
2017-06-15T18:35:46.374 [INFO] Apache Beam :: SDKs :: Java ........................ SUCCESS
[  6.508 s]
2017-06-15T18:35:46.375 [INFO] Apache Beam :: SDKs :: Java :: Core ................ SUCCESS
[04:14 min]
2017-06-15T18:35:46.375 [INFO] Apache Beam :: Runners ............................. SUCCESS
[  6.168 s]
2017-06-15T18:35:46.375 [INFO] Apache Beam :: Runners :: Core Construction Java ... SUCCESS
[ 49.522 s]
2017-06-15T18:35:46.375 [INFO] Apache Beam :: Runners :: Core Java ................ SUCCESS
[01:10 min]
2017-06-15T18:35:46.376 [INFO] Apache Beam :: Runners :: Direct Java .............. SUCCESS
[03:24 min]
2017-06-15T18:35:46.376 [INFO] Apache Beam :: SDKs :: Java :: IO .................. SUCCESS
[  5.887 s]
2017-06-15T18:35:46.376 [INFO] Apache Beam :: SDKs :: Java :: IO :: Common ........ SUCCESS
[ 11.498 s]
2017-06-15T18:35:46.376 [INFO] Apache Beam :: SDKs :: Java :: IO :: Cassandra ..... SUCCESS
[ 39.424 s]
2017-06-15T18:35:46.376 [INFO] Apache Beam :: SDKs :: Java :: IO :: Elasticsearch . SUCCESS
[ 55.520 s]
2017-06-15T18:35:46.377 [INFO] Apache Beam :: SDKs :: Java :: Extensions .......... SUCCESS
[  5.405 s]
2017-06-15T18:35:46.377 [INFO] Apache Beam :: SDKs :: Java :: Extensions :: Google Cloud Platform
Core SUCCESS [ 55.411 s]
2017-06-15T18:35:46.377 [INFO] Apache Beam :: SDKs :: Java :: Extensions :: Protobuf SUCCESS
[ 31.004 s]
2017-06-15T18:35:46.377 [INFO] Apache Beam :: SDKs :: Java :: IO :: Google Cloud Platform
SUCCESS [01:35 min]
2017-06-15T18:35:46.378 [INFO] Apache Beam :: SDKs :: Java :: IO :: Hadoop Common . SUCCESS
[ 31.743 s]
2017-06-15T18:35:46.378 [INFO] Apache Beam :: SDKs :: Java :: IO :: Hadoop File System SUCCESS
[ 40.826 s]
2017-06-15T18:35:46.378 [INFO] Apache Beam :: SDKs :: Java :: IO :: Hadoop ........ SUCCESS
[  8.707 s]
2017-06-15T18:35:46.378 [INFO] Apache Beam :: SDKs :: Java :: IO :: Hadoop :: input-format
SUCCESS [ 34.194 s]
2017-06-15T18:35:46.378 [INFO] Apache Beam :: SDKs :: Java :: IO :: Hadoop :: jdk1.8-tests
SUCCESS [01:46 min]
2017-06-15T18:35:46.379 [INFO] Apache Beam :: SDKs :: Java :: IO :: HBase ......... SUCCESS
[ 42.799 s]
2017-06-15T18:35:46.379 [INFO] Apache Beam :: SDKs :: Java :: IO :: HCatalog ...... SUCCESS
[01:00 min]
2017-06-15T18:35:46.379 [INFO] Apache Beam :: SDKs :: Java :: IO :: JDBC .......... SUCCESS
[ 36.243 s]
2017-06-15T18:35:46.379 [INFO] Apache Beam :: SDKs :: Java :: IO :: JMS ........... SUCCESS
[ 31.250 s]
2017-06-15T18:35:46.379 [INFO] Apache Beam :: SDKs :: Java :: IO :: Kafka ......... SUCCESS
[ 43.453 s]
2017-06-15T18:35:46.380 [INFO] Apache Beam :: SDKs :: Java :: IO :: Kinesis ....... SUCCESS
[ 37.613 s]
2017-06-15T18:35:46.380 [INFO] Apache Beam :: SDKs :: Java :: IO :: MongoDB ....... SUCCESS
[ 53.585 s]
2017-06-15T18:35:46.380 [INFO] Apache Beam :: SDKs :: Java :: IO :: MQTT .......... SUCCESS
[ 49.680 s]
2017-06-15T18:35:46.380 [INFO] Apache Beam :: SDKs :: Java :: IO :: XML ........... SUCCESS
[ 42.547 s]
2017-06-15T18:35:46.381 [INFO] Apache Beam :: SDKs :: Java :: Maven Archetypes .... SUCCESS
[  5.154 s]
2017-06-15T18:35:46.381 [INFO] Apache Beam :: SDKs :: Java :: Maven Archetypes :: Starter
SUCCESS [ 28.352 s]
2017-06-15T18:35:46.381 [INFO] Apache Beam :: SDKs :: Java :: Extensions :: Jackson SUCCESS
[ 33.794 s]
2017-06-15T18:35:46.381 [INFO] Apache Beam :: SDKs :: Java :: Extensions :: Join library SUCCESS
[ 38.435 s]
2017-06-15T18:35:46.381 [INFO] Apache Beam :: SDKs :: Java :: Extensions :: Sorter  SUCCESS
[ 39.620 s]
2017-06-15T18:35:46.382 [INFO] Apache Beam :: Runners :: Google Cloud Dataflow .... SUCCESS
[01:01 min]
2017-06-15T18:35:46.382 [INFO] Apache Beam :: SDKs :: Java :: Harness ............. SUCCESS
[01:03 min]
2017-06-15T18:35:46.382 [INFO] Apache Beam :: SDKs :: Java :: Java 8 Tests ........ SUCCESS
[ 26.462 s]
2017-06-15T18:35:46.382 [INFO] Apache Beam :: SDKs :: Python ...................... FAILURE
[  3.521 s]
2017-06-15T18:35:46.383 [INFO] Apache Beam :: Runners :: Flink .................... SKIPPED
2017-06-15T18:35:46.383 [INFO] Apache Beam :: Runners :: Spark .................... SKIPPED
2017-06-15T18:35:46.383 [INFO] Apache Beam :: Runners :: Apex ..................... SKIPPED
2017-06-15T18:35:46.383 [INFO] Apache Beam :: Examples ............................ SKIPPED
2017-06-15T18:35:46.383 [INFO] Apache Beam :: Examples :: Java .................... SKIPPED
2017-06-15T18:35:46.384 [INFO] Apache Beam :: Examples :: Java 8 .................. SKIPPED
2017-06-15T18:35:46.384 [INFO] Apache Beam :: SDKs :: Java :: Aggregated Javadoc .. SKIPPED
2017-06-15T18:35:46.384 [INFO] ------------------------------------------------------------------------
2017-06-15T18:35:46.384 [INFO] BUILD FAILURE
2017-06-15T18:35:46.385 [INFO] ------------------------------------------------------------------------
2017-06-15T18:35:46.385 [INFO] Total time: 35:02 min
2017-06-15T18:35:46.386 [INFO] Finished at: 2017-06-15T18:35:46+00:00
2017-06-15T18:35:48.549 [INFO] Final Memory: 325M/3204M
2017-06-15T18:35:48.549 [INFO] ------------------------------------------------------------------------
Waiting for Jenkins to finish collecting data
2017-06-15T18:35:49.228 [ERROR] Failed to execute goal org.codehaus.gmaven:groovy-maven-plugin:2.0:execute
(find-supported-python-for-clean) on project beam-sdks-python: Unable to find Python 2.7 in
path -> [Help 1]
org.apache.maven.lifecycle.LifecycleExecutionException: Failed to execute goal org.codehaus.gmaven:groovy-maven-plugin:2.0:execute
(find-supported-python-for-clean) on project beam-sdks-python: Unable to find Python 2.7 in
path
	at org.apache.maven.lifecycle.internal.MojoExecutor.execute(MojoExecutor.java:212)
	at org.apache.maven.lifecycle.internal.MojoExecutor.execute(MojoExecutor.java:153)
	at org.apache.maven.lifecycle.internal.MojoExecutor.execute(MojoExecutor.java:145)
	at org.apache.maven.lifecycle.internal.LifecycleModuleBuilder.buildProject(LifecycleModuleBuilder.java:116)
	at org.apache.maven.lifecycle.internal.LifecycleModuleBuilder.buildProject(LifecycleModuleBuilder.java:80)
	at org.apache.maven.lifecycle.internal.builder.singlethreaded.SingleThreadedBuilder.build(SingleThreadedBuilder.java:51)
	at org.apache.maven.lifecycle.internal.LifecycleStarter.execute(LifecycleStarter.java:128)
	at org.apache.maven.DefaultMaven.doExecute(DefaultMaven.java:307)
	at org.apache.maven.DefaultMaven.doExecute(DefaultMaven.java:193)
	at org.apache.maven.DefaultMaven.execute(DefaultMaven.java:106)
	at org.jvnet.hudson.maven3.launcher.Maven33Launcher.main(Maven33Launcher.java:129)
	at sun.reflect.NativeMethodAccessorImpl.invoke0(Native Method)
	at sun.reflect.NativeMethodAccessorImpl.invoke(NativeMethodAccessorImpl.java:62)
	at sun.reflect.DelegatingMethodAccessorImpl.invoke(DelegatingMethodAccessorImpl.java:43)
	at java.lang.reflect.Method.invoke(Method.java:498)
	at org.codehaus.plexus.classworlds.launcher.Launcher.launchStandard(Launcher.java:330)
	at org.codehaus.plexus.classworlds.launcher.Launcher.launch(Launcher.java:238)
	at jenkins.maven3.agent.Maven33Main.launch(Maven33Main.java:176)
	at sun.reflect.NativeMethodAccessorImpl.invoke0(Native Method)
	at sun.reflect.NativeMethodAccessorImpl.invoke(NativeMethodAccessorImpl.java:62)
	at sun.reflect.DelegatingMethodAccessorImpl.invoke(DelegatingMethodAccessorImpl.java:43)
	at java.lang.reflect.Method.invoke(Method.java:498)
	at hudson.maven.Maven3Builder.call(Maven3Builder.java:139)
	at hudson.maven.Maven3Builder.call(Maven3Builder.java:70)
	at hudson.remoting.UserRequest.perform(UserRequest.java:120)
	at hudson.remoting.UserRequest.perform(UserRequest.java:48)
	at hudson.remoting.Request$2.run(Request.java:326)
	at hudson.remoting.InterceptingExecutorService$1.call(InterceptingExecutorService.java:68)
	at java.util.concurrent.FutureTask.run(FutureTask.java:266)
	at java.util.concurrent.ThreadPoolExecutor.runWorker(ThreadPoolExecutor.java:1142)
	at java.util.concurrent.ThreadPoolExecutor$Worker.run(ThreadPoolExecutor.java:617)
	at java.lang.Thread.run(Thread.java:745)
Caused by: org.apache.maven.plugin.MojoFailureException: Unable to find Python 2.7 in path
	at sun.reflect.NativeConstructorAccessorImpl.newInstance0(Native Method)
	at sun.reflect.NativeConstructorAccessorImpl.newInstance(NativeConstructorAccessorImpl.java:62)
	at sun.reflect.DelegatingConstructorAccessorImpl.newInstance(DelegatingConstructorAccessorImpl.java:45)
	at java.lang.reflect.Constructor.newInstance(Constructor.java:423)
	at org.codehaus.groovy.reflection.CachedConstructor.invoke(CachedConstructor.java:77)
	at org.codehaus.groovy.runtime.callsite.ConstructorSite$ConstructorSiteNoUnwrapNoCoerce.callConstructor(ConstructorSite.java:102)
	at org.codehaus.groovy.runtime.callsite.CallSiteArray.defaultCallConstructor(CallSiteArray.java:57)
	at org.codehaus.groovy.runtime.callsite.AbstractCallSite.callConstructor(AbstractCallSite.java:182)
	at org.codehaus.groovy.runtime.callsite.AbstractCallSite.callConstructor(AbstractCallSite.java:190)
	at findSupportedPython.run(findSupportedPython.groovy:70)
	at groovy.lang.GroovyShell.evaluate(GroovyShell.java:518)
	at org.codehaus.gmaven.adapter.impl.ScriptExecutorImpl.execute(ScriptExecutorImpl.java:80)
	at org.codehaus.gmaven.plugin.ExecuteMojo$1.run(ExecuteMojo.java:100)
	at org.codehaus.gmaven.plugin.util.SystemNoExitGuard.run(SystemNoExitGuard.java:45)
	at org.codehaus.gmaven.plugin.ExecuteMojo.run(ExecuteMojo.java:96)
	at org.codehaus.gmaven.plugin.MojoSupport.execute(MojoSupport.java:45)
	at org.apache.maven.plugin.DefaultBuildPluginManager.executeMojo(DefaultBuildPluginManager.java:134)
	at org.apache.maven.lifecycle.internal.MojoExecutor.execute(MojoExecutor.java:208)
	... 31 more
2017-06-15T18:35:49.231 [ERROR] 
2017-06-15T18:35:49.231 [ERROR] Re-run Maven using the -X switch to enable full debug logging.
2017-06-15T18:35:49.231 [ERROR] 
2017-06-15T18:35:49.231 [ERROR] For more information about the errors and possible solutions,
please read the following articles:
2017-06-15T18:35:49.231 [ERROR] [Help 1] http://cwiki.apache.org/confluence/display/MAVEN/MojoFailureException
2017-06-15T18:35:49.232 [ERROR] 
2017-06-15T18:35:49.232 [ERROR] After correcting the problems, you can resume the build with
the command
2017-06-15T18:35:49.232 [ERROR]   mvn <goals> -rf :beam-sdks-python
channel stopped
Not sending mail to unregistered user aljoscha.krettek@gmail.com
Not sending mail to unregistered user github@nakomis.com
Not sending mail to unregistered user hepei.hp@alibaba-inc.com
Not sending mail to unregistered user sourabhbajaj@google.com
Not sending mail to unregistered user klk@google.com
Not sending mail to unregistered user ccy@google.com
Not sending mail to unregistered user kirpichov@google.com
Not sending mail to unregistered user mingmxu@ebay.com

Mime
View raw message