beam-commits mailing list archives

Site index · List index
Message view « Date » · « Thread »
Top « Date » · « Thread »
From Apache Jenkins Server <jenk...@builds.apache.org>
Subject Build failed in Jenkins: beam_PostCommit_Java_JDK_Versions_Test » OpenJDK 7 (on Ubuntu only),beam #59
Date Thu, 08 Jun 2017 06:30:22 GMT
See <https://builds.apache.org/job/beam_PostCommit_Java_JDK_Versions_Test/jdk=OpenJDK%207%20(on%20Ubuntu%20only),label=beam/59/display/redirect?page=changes>

Changes:

[ccy] Remove support for NativeSinks from the Python DirectRunner

[lcwik] Make BytesCoder to be a known type

[robertwb] Add coder info to pubsub io

------------------------------------------
[...truncated 1.26 MB...]
2017-06-08\T\06:30:11.050 [INFO] Downloading: https://repo.maven.apache.org/maven2/org/clapper/grizzled-slf4j_2.10/1.0.2/grizzled-slf4j_2.10-1.0.2.pom
2017-06-08\T\06:30:11.077 [INFO] Downloaded: https://repo.maven.apache.org/maven2/org/clapper/grizzled-slf4j_2.10/1.0.2/grizzled-slf4j_2.10-1.0.2.pom
(2 KB at 69.3 KB/sec)
2017-06-08\T\06:30:11.078 [INFO] Downloading: https://repo.maven.apache.org/maven2/org/scala-lang/scala-library/2.10.3/scala-library-2.10.3.pom
2017-06-08\T\06:30:11.104 [INFO] Downloaded: https://repo.maven.apache.org/maven2/org/scala-lang/scala-library/2.10.3/scala-library-2.10.3.pom
(2 KB at 76.8 KB/sec)
2017-06-08\T\06:30:11.105 [INFO] Downloading: https://repo.maven.apache.org/maven2/com/github/scopt/scopt_2.10/3.5.0/scopt_2.10-3.5.0.pom
2017-06-08\T\06:30:11.131 [INFO] Downloaded: https://repo.maven.apache.org/maven2/com/github/scopt/scopt_2.10/3.5.0/scopt_2.10-3.5.0.pom
(2 KB at 62.9 KB/sec)
2017-06-08\T\06:30:11.132 [INFO] Downloading: https://repo.maven.apache.org/maven2/com/twitter/chill_2.10/0.7.4/chill_2.10-0.7.4.pom
2017-06-08\T\06:30:11.157 [INFO] Downloaded: https://repo.maven.apache.org/maven2/com/twitter/chill_2.10/0.7.4/chill_2.10-0.7.4.pom
(3 KB at 92.7 KB/sec)
2017-06-08\T\06:30:11.159 [INFO] Downloading: https://repo.maven.apache.org/maven2/org/scala-lang/scala-library/2.10.5/scala-library-2.10.5.pom
2017-06-08\T\06:30:11.184 [INFO] Downloaded: https://repo.maven.apache.org/maven2/org/scala-lang/scala-library/2.10.5/scala-library-2.10.5.pom
(2 KB at 79.8 KB/sec)
2017-06-08\T\06:30:11.186 [INFO] Downloading: https://repo.maven.apache.org/maven2/com/twitter/chill-java/0.7.4/chill-java-0.7.4.pom
2017-06-08\T\06:30:11.211 [INFO] Downloaded: https://repo.maven.apache.org/maven2/com/twitter/chill-java/0.7.4/chill-java-0.7.4.pom
(2 KB at 76.4 KB/sec)
2017-06-08\T\06:30:11.213 [INFO] Downloading: https://repo.maven.apache.org/maven2/org/apache/flink/flink-optimizer_2.10/1.3.0/flink-optimizer_2.10-1.3.0.pom
2017-06-08\T\06:30:11.238 [INFO] Downloaded: https://repo.maven.apache.org/maven2/org/apache/flink/flink-optimizer_2.10/1.3.0/flink-optimizer_2.10-1.3.0.pom
(5 KB at 168.7 KB/sec)
2017-06-08\T\06:30:11.242 [INFO] Downloading: https://repo.maven.apache.org/maven2/org/apache/flink/flink-streaming-java_2.10/1.3.0/flink-streaming-java_2.10-1.3.0.pom
2017-06-08\T\06:30:11.274 [INFO] Downloaded: https://repo.maven.apache.org/maven2/org/apache/flink/flink-streaming-java_2.10/1.3.0/flink-streaming-java_2.10-1.3.0.pom
(7 KB at 188.4 KB/sec)
2017-06-08\T\06:30:11.278 [INFO] Downloading: https://repo.maven.apache.org/maven2/org/apache/sling/org.apache.sling.commons.json/2.0.6/org.apache.sling.commons.json-2.0.6.pom
2017-06-08\T\06:30:11.304 [INFO] Downloaded: https://repo.maven.apache.org/maven2/org/apache/sling/org.apache.sling.commons.json/2.0.6/org.apache.sling.commons.json-2.0.6.pom
(4 KB at 121.7 KB/sec)
2017-06-08\T\06:30:11.306 [INFO] Downloading: https://repo.maven.apache.org/maven2/org/apache/sling/sling/10/sling-10.pom
2017-06-08\T\06:30:11.333 [INFO] Downloaded: https://repo.maven.apache.org/maven2/org/apache/sling/sling/10/sling-10.pom
(26 KB at 895.2 KB/sec)
2017-06-08\T\06:30:11.334 [INFO] Downloading: https://repo.maven.apache.org/maven2/org/apache/apache/8/apache-8.pom
2017-06-08\T\06:30:11.361 [INFO] Downloaded: https://repo.maven.apache.org/maven2/org/apache/apache/8/apache-8.pom
(14 KB at 508.3 KB/sec)
2017-06-08\T\06:30:11.373 [INFO] Downloading: https://repo.maven.apache.org/maven2/org/apache/flink/flink-test-utils_2.10/1.3.0/flink-test-utils_2.10-1.3.0.pom
2017-06-08\T\06:30:11.399 [INFO] Downloaded: https://repo.maven.apache.org/maven2/org/apache/flink/flink-test-utils_2.10/1.3.0/flink-test-utils_2.10-1.3.0.pom
(5 KB at 178.1 KB/sec)
2017-06-08\T\06:30:11.400 [INFO] Downloading: https://repo.maven.apache.org/maven2/org/apache/flink/flink-test-utils-parent/1.3.0/flink-test-utils-parent-1.3.0.pom
2017-06-08\T\06:30:11.427 [INFO] Downloaded: https://repo.maven.apache.org/maven2/org/apache/flink/flink-test-utils-parent/1.3.0/flink-test-utils-parent-1.3.0.pom
(2 KB at 52.1 KB/sec)
2017-06-08\T\06:30:11.430 [INFO] Downloading: https://repo.maven.apache.org/maven2/org/apache/flink/flink-test-utils-junit/1.3.0/flink-test-utils-junit-1.3.0.pom
2017-06-08\T\06:30:11.459 [INFO] Downloaded: https://repo.maven.apache.org/maven2/org/apache/flink/flink-test-utils-junit/1.3.0/flink-test-utils-junit-1.3.0.pom
(4 KB at 110.7 KB/sec)
2017-06-08\T\06:30:11.464 [INFO] Downloading: https://repo.maven.apache.org/maven2/org/apache/curator/curator-test/2.12.0/curator-test-2.12.0.pom
2017-06-08\T\06:30:11.489 [INFO] Downloaded: https://repo.maven.apache.org/maven2/org/apache/curator/curator-test/2.12.0/curator-test-2.12.0.pom
(5 KB at 162.0 KB/sec)
2017-06-08\T\06:30:11.491 [INFO] Downloading: https://repo.maven.apache.org/maven2/org/apache/curator/apache-curator/2.12.0/apache-curator-2.12.0.pom
2017-06-08\T\06:30:11.518 [INFO] Downloaded: https://repo.maven.apache.org/maven2/org/apache/curator/apache-curator/2.12.0/apache-curator-2.12.0.pom
(32 KB at 1169.3 KB/sec)
2017-06-08\T\06:30:11.521 [INFO] Downloading: https://repo.maven.apache.org/maven2/org/apache/zookeeper/zookeeper/3.4.8/zookeeper-3.4.8.pom
2017-06-08\T\06:30:11.547 [INFO] Downloaded: https://repo.maven.apache.org/maven2/org/apache/zookeeper/zookeeper/3.4.8/zookeeper-3.4.8.pom
(4 KB at 151.2 KB/sec)
2017-06-08\T\06:30:11.548 [INFO] Downloading: https://repo.maven.apache.org/maven2/org/javassist/javassist/3.18.1-GA/javassist-3.18.1-GA.pom
2017-06-08\T\06:30:11.574 [INFO] Downloaded: https://repo.maven.apache.org/maven2/org/javassist/javassist/3.18.1-GA/javassist-3.18.1-GA.pom
(10 KB at 357.6 KB/sec)
2017-06-08\T\06:30:11.687 [INFO] Downloading: https://repo.maven.apache.org/maven2/org/apache/flink/flink-clients_2.10/1.3.0/flink-clients_2.10-1.3.0.jar
2017-06-08\T\06:30:11.688 [INFO] Downloading: https://repo.maven.apache.org/maven2/org/apache/flink/flink-optimizer_2.10/1.3.0/flink-optimizer_2.10-1.3.0.jar
2017-06-08\T\06:30:11.688 [INFO] Downloading: https://repo.maven.apache.org/maven2/org/apache/flink/force-shading/1.3.0/force-shading-1.3.0.jar
2017-06-08\T\06:30:11.688 [INFO] Downloading: https://repo.maven.apache.org/maven2/org/apache/flink/flink-core/1.3.0/flink-core-1.3.0.jar
2017-06-08\T\06:30:11.688 [INFO] Downloading: https://repo.maven.apache.org/maven2/org/apache/flink/flink-annotations/1.3.0/flink-annotations-1.3.0.jar
2017-06-08\T\06:30:11.715 [INFO] Downloaded: https://repo.maven.apache.org/maven2/org/apache/flink/flink-annotations/1.3.0/flink-annotations-1.3.0.jar
(8 KB at 267.1 KB/sec)
2017-06-08\T\06:30:11.715 [INFO] Downloading: https://repo.maven.apache.org/maven2/com/esotericsoftware/kryo/kryo/2.24.0/kryo-2.24.0.jar
2017-06-08\T\06:30:11.716 [INFO] Downloaded: https://repo.maven.apache.org/maven2/org/apache/flink/force-shading/1.3.0/force-shading-1.3.0.jar
(8 KB at 253.9 KB/sec)
2017-06-08\T\06:30:11.716 [INFO] Downloading: https://repo.maven.apache.org/maven2/org/objenesis/objenesis/2.1/objenesis-2.1.jar
2017-06-08\T\06:30:11.719 [INFO] Downloaded: https://repo.maven.apache.org/maven2/org/apache/flink/flink-clients_2.10/1.3.0/flink-clients_2.10-1.3.0.jar
(89 KB at 2772.1 KB/sec)
2017-06-08\T\06:30:11.720 [INFO] Downloading: https://repo.maven.apache.org/maven2/org/apache/flink/flink-metrics-core/1.3.0/flink-metrics-core-1.3.0.jar
2017-06-08\T\06:30:11.746 [INFO] Downloaded: https://repo.maven.apache.org/maven2/org/apache/flink/flink-metrics-core/1.3.0/flink-metrics-core-1.3.0.jar
(16 KB at 269.2 KB/sec)
2017-06-08\T\06:30:11.746 [INFO] Downloading: https://repo.maven.apache.org/maven2/org/apache/flink/flink-java/1.3.0/flink-java-1.3.0.jar
2017-06-08\T\06:30:11.747 [INFO] Downloaded: https://repo.maven.apache.org/maven2/org/objenesis/objenesis/2.1/objenesis-2.1.jar
(41 KB at 691.1 KB/sec)
2017-06-08\T\06:30:11.748 [INFO] Downloading: https://repo.maven.apache.org/maven2/org/apache/flink/flink-shaded-hadoop2/1.3.0/flink-shaded-hadoop2-1.3.0.jar
2017-06-08\T\06:30:11.772 [INFO] Downloaded: https://repo.maven.apache.org/maven2/com/esotericsoftware/kryo/kryo/2.24.0/kryo-2.24.0.jar
(332 KB at 3944.4 KB/sec)
2017-06-08\T\06:30:11.772 [INFO] Downloading: https://repo.maven.apache.org/maven2/commons-configuration/commons-configuration/1.7/commons-configuration-1.7.jar
2017-06-08\T\06:30:11.835 [INFO] Downloaded: https://repo.maven.apache.org/maven2/org/apache/flink/flink-core/1.3.0/flink-core-1.3.0.jar
(1362 KB at 9261.9 KB/sec)
2017-06-08\T\06:30:11.835 [INFO] Downloading: https://repo.maven.apache.org/maven2/commons-digester/commons-digester/1.8.1/commons-digester-1.8.1.jar
2017-06-08\T\06:30:11.839 [INFO] Downloaded: https://repo.maven.apache.org/maven2/commons-configuration/commons-configuration/1.7/commons-configuration-1.7.jar
(343 KB at 2280.8 KB/sec)
2017-06-08\T\06:30:11.839 [INFO] Downloading: https://repo.maven.apache.org/maven2/commons-beanutils/commons-beanutils-bean-collections/1.8.3/commons-beanutils-bean-collections-1.8.3.jar
2017-06-08\T\06:30:11.846 [INFO] Downloaded: https://repo.maven.apache.org/maven2/org/apache/flink/flink-java/1.3.0/flink-java-1.3.0.jar
(752 KB at 4758.8 KB/sec)
2017-06-08\T\06:30:11.846 [INFO] Downloading: https://repo.maven.apache.org/maven2/org/apache/commons/commons-math3/3.5/commons-math3-3.5.jar
2017-06-08\T\06:30:11.868 [INFO] Downloaded: https://repo.maven.apache.org/maven2/commons-digester/commons-digester/1.8.1/commons-digester-1.8.1.jar
(143 KB at 797.1 KB/sec)
2017-06-08\T\06:30:11.868 [INFO] Downloading: https://repo.maven.apache.org/maven2/org/apache/flink/flink-runtime_2.10/1.3.0/flink-runtime_2.10-1.3.0.jar
2017-06-08\T\06:30:11.869 [INFO] Downloaded: https://repo.maven.apache.org/maven2/commons-beanutils/commons-beanutils-bean-collections/1.8.3/commons-beanutils-bean-collections-1.8.3.jar
(26 KB at 144.2 KB/sec)
2017-06-08\T\06:30:11.869 [INFO] Downloading: https://repo.maven.apache.org/maven2/io/netty/netty-all/4.0.27.Final/netty-all-4.0.27.Final.jar
2017-06-08\T\06:30:11.939 [INFO] Downloaded: https://repo.maven.apache.org/maven2/org/apache/flink/flink-optimizer_2.10/1.3.0/flink-optimizer_2.10-1.3.0.jar
(2679 KB at 10630.7 KB/sec)
2017-06-08\T\06:30:11.939 [INFO] Downloading: https://repo.maven.apache.org/maven2/org/javassist/javassist/3.18.2-GA/javassist-3.18.2-GA.jar
2017-06-08\T\06:30:12.063 [INFO] Downloaded: https://repo.maven.apache.org/maven2/io/netty/netty-all/4.0.27.Final/netty-all-4.0.27.Final.jar
(1894 KB at 5064.1 KB/sec)
2017-06-08\T\06:30:12.063 [INFO] Downloading: https://repo.maven.apache.org/maven2/org/scala-lang/scala-library/2.10.4/scala-library-2.10.4.jar
2017-06-08\T\06:30:12.065 [INFO] Downloaded: https://repo.maven.apache.org/maven2/org/javassist/javassist/3.18.2-GA/javassist-3.18.2-GA.jar
(698 KB at 1855.8 KB/sec)
2017-06-08\T\06:30:12.065 [INFO] Downloading: https://repo.maven.apache.org/maven2/com/data-artisans/flakka-actor_2.10/2.3-custom/flakka-actor_2.10-2.3-custom.jar
2017-06-08\T\06:30:12.111 [INFO] Downloaded: https://repo.maven.apache.org/maven2/org/apache/commons/commons-math3/3.5/commons-math3-3.5.jar
(1991 KB at 4717.3 KB/sec)
2017-06-08\T\06:30:12.111 [INFO] Downloading: https://repo.maven.apache.org/maven2/com/typesafe/config/1.2.1/config-1.2.1.jar
2017-06-08\T\06:30:12.171 [INFO] Downloaded: https://repo.maven.apache.org/maven2/com/typesafe/config/1.2.1/config-1.2.1.jar
(215 KB at 444.8 KB/sec)
2017-06-08\T\06:30:12.171 [INFO] Downloading: https://repo.maven.apache.org/maven2/com/data-artisans/flakka-remote_2.10/2.3-custom/flakka-remote_2.10-2.3-custom.jar
2017-06-08\T\06:30:12.317 [INFO] Downloaded: https://repo.maven.apache.org/maven2/com/data-artisans/flakka-remote_2.10/2.3-custom/flakka-remote_2.10-2.3-custom.jar
(1347 KB at 2144.8 KB/sec)
2017-06-08\T\06:30:12.317 [INFO] Downloading: https://repo.maven.apache.org/maven2/io/netty/netty/3.8.0.Final/netty-3.8.0.Final.jar
2017-06-08\T\06:30:12.324 [INFO] Downloaded: https://repo.maven.apache.org/maven2/com/data-artisans/flakka-actor_2.10/2.3-custom/flakka-actor_2.10-2.3-custom.jar
(2754 KB at 4336.1 KB/sec)
2017-06-08\T\06:30:12.324 [INFO] Downloading: https://repo.maven.apache.org/maven2/org/uncommons/maths/uncommons-maths/1.2.2a/uncommons-maths-1.2.2a.jar
2017-06-08\T\06:30:12.355 [INFO] Downloaded: https://repo.maven.apache.org/maven2/org/uncommons/maths/uncommons-maths/1.2.2a/uncommons-maths-1.2.2a.jar
(48 KB at 71.9 KB/sec)
2017-06-08\T\06:30:12.355 [INFO] Downloading: https://repo.maven.apache.org/maven2/com/data-artisans/flakka-slf4j_2.10/2.3-custom/flakka-slf4j_2.10-2.3-custom.jar
2017-06-08\T\06:30:12.382 [INFO] Downloaded: https://repo.maven.apache.org/maven2/com/data-artisans/flakka-slf4j_2.10/2.3-custom/flakka-slf4j_2.10-2.3-custom.jar
(16 KB at 21.9 KB/sec)
2017-06-08\T\06:30:12.382 [INFO] Downloading: https://repo.maven.apache.org/maven2/org/clapper/grizzled-slf4j_2.10/1.0.2/grizzled-slf4j_2.10-1.0.2.jar
2017-06-08\T\06:30:12.408 [INFO] Downloaded: https://repo.maven.apache.org/maven2/org/clapper/grizzled-slf4j_2.10/1.0.2/grizzled-slf4j_2.10-1.0.2.jar
(7 KB at 8.7 KB/sec)
2017-06-08\T\06:30:12.409 [INFO] Downloading: https://repo.maven.apache.org/maven2/com/github/scopt/scopt_2.10/3.5.0/scopt_2.10-3.5.0.jar
2017-06-08\T\06:30:12.447 [INFO] Downloaded: https://repo.maven.apache.org/maven2/io/netty/netty/3.8.0.Final/netty-3.8.0.Final.jar
(1202 KB at 1584.9 KB/sec)
2017-06-08\T\06:30:12.447 [INFO] Downloading: https://repo.maven.apache.org/maven2/jline/jline/0.9.94/jline-0.9.94.jar
2017-06-08\T\06:30:12.448 [INFO] Downloaded: https://repo.maven.apache.org/maven2/com/github/scopt/scopt_2.10/3.5.0/scopt_2.10-3.5.0.jar
(140 KB at 184.1 KB/sec)
2017-06-08\T\06:30:12.448 [INFO] Downloading: https://repo.maven.apache.org/maven2/com/twitter/chill_2.10/0.7.4/chill_2.10-0.7.4.jar
2017-06-08\T\06:30:12.487 [INFO] Downloaded: https://repo.maven.apache.org/maven2/jline/jline/0.9.94/jline-0.9.94.jar
(86 KB at 106.9 KB/sec)
2017-06-08\T\06:30:12.487 [INFO] Downloading: https://repo.maven.apache.org/maven2/com/twitter/chill-java/0.7.4/chill-java-0.7.4.jar
2017-06-08\T\06:30:12.499 [INFO] Downloaded: https://repo.maven.apache.org/maven2/com/twitter/chill_2.10/0.7.4/chill_2.10-0.7.4.jar
(217 KB at 266.7 KB/sec)
2017-06-08\T\06:30:12.499 [INFO] Downloading: https://repo.maven.apache.org/maven2/org/apache/flink/flink-streaming-java_2.10/1.3.0/flink-streaming-java_2.10-1.3.0.jar
2017-06-08\T\06:30:12.516 [INFO] Downloaded: https://repo.maven.apache.org/maven2/com/twitter/chill-java/0.7.4/chill-java-0.7.4.jar
(50 KB at 59.5 KB/sec)
2017-06-08\T\06:30:12.516 [INFO] Downloading: https://repo.maven.apache.org/maven2/org/apache/sling/org.apache.sling.commons.json/2.0.6/org.apache.sling.commons.json-2.0.6.jar
2017-06-08\T\06:30:12.545 [INFO] Downloaded: https://repo.maven.apache.org/maven2/org/apache/sling/org.apache.sling.commons.json/2.0.6/org.apache.sling.commons.json-2.0.6.jar
(47 KB at 54.6 KB/sec)
2017-06-08\T\06:30:12.545 [INFO] Downloading: https://repo.maven.apache.org/maven2/org/apache/flink/flink-core/1.3.0/flink-core-1.3.0-tests.jar
2017-06-08\T\06:30:12.573 [INFO] Downloaded: https://repo.maven.apache.org/maven2/org/apache/flink/flink-runtime_2.10/1.3.0/flink-runtime_2.10-1.3.0.jar
(9005 KB at 10185.7 KB/sec)
2017-06-08\T\06:30:12.573 [INFO] Downloading: https://repo.maven.apache.org/maven2/org/apache/flink/flink-runtime_2.10/1.3.0/flink-runtime_2.10-1.3.0-tests.jar
2017-06-08\T\06:30:12.683 [INFO] Downloaded: https://repo.maven.apache.org/maven2/org/apache/flink/flink-core/1.3.0/flink-core-1.3.0-tests.jar
(753 KB at 756.7 KB/sec)
2017-06-08\T\06:30:12.683 [INFO] Downloading: https://repo.maven.apache.org/maven2/org/apache/flink/flink-streaming-java_2.10/1.3.0/flink-streaming-java_2.10-1.3.0-tests.jar
2017-06-08\T\06:30:12.771 [INFO] Downloaded: https://repo.maven.apache.org/maven2/org/scala-lang/scala-library/2.10.4/scala-library-2.10.4.jar
(6960 KB at 6431.9 KB/sec)
2017-06-08\T\06:30:12.771 [INFO] Downloading: https://repo.maven.apache.org/maven2/org/apache/flink/flink-test-utils_2.10/1.3.0/flink-test-utils_2.10-1.3.0.jar
2017-06-08\T\06:30:12.787 [INFO] Downloaded: https://repo.maven.apache.org/maven2/org/apache/flink/flink-streaming-java_2.10/1.3.0/flink-streaming-java_2.10-1.3.0.jar
(3128 KB at 2848.2 KB/sec)
2017-06-08\T\06:30:12.787 [INFO] Downloading: https://repo.maven.apache.org/maven2/org/apache/flink/flink-test-utils-junit/1.3.0/flink-test-utils-junit-1.3.0.jar
2017-06-08\T\06:30:12.827 [INFO] Downloaded: https://repo.maven.apache.org/maven2/org/apache/flink/flink-test-utils-junit/1.3.0/flink-test-utils-junit-1.3.0.jar
(26 KB at 22.3 KB/sec)
2017-06-08\T\06:30:12.827 [INFO] Downloading: https://repo.maven.apache.org/maven2/org/apache/curator/curator-test/2.12.0/curator-test-2.12.0.jar
2017-06-08\T\06:30:12.828 [INFO] Downloaded: https://repo.maven.apache.org/maven2/org/apache/flink/flink-streaming-java_2.10/1.3.0/flink-streaming-java_2.10-1.3.0-tests.jar
(1133 KB at 994.5 KB/sec)
2017-06-08\T\06:30:12.878 [INFO] Downloaded: https://repo.maven.apache.org/maven2/org/apache/flink/flink-runtime_2.10/1.3.0/flink-runtime_2.10-1.3.0-tests.jar
(2841 KB at 2389.0 KB/sec)
2017-06-08\T\06:30:12.944 [INFO] Downloaded: https://repo.maven.apache.org/maven2/org/apache/flink/flink-test-utils_2.10/1.3.0/flink-test-utils_2.10-1.3.0.jar
(2365 KB at 1883.9 KB/sec)
2017-06-08\T\06:30:13.008 [INFO] Downloaded: https://repo.maven.apache.org/maven2/org/apache/flink/flink-shaded-hadoop2/1.3.0/flink-shaded-hadoop2-1.3.0.jar
(16586 KB at 12583.7 KB/sec)
2017-06-08\T\06:30:13.010 [INFO] Downloaded: https://repo.maven.apache.org/maven2/org/apache/curator/curator-test/2.12.0/curator-test-2.12.0.jar
(2368 KB at 1792.3 KB/sec)
2017-06-08\T\06:30:13.062 [INFO] 
2017-06-08\T\06:30:13.062 [INFO] --- maven-clean-plugin:3.0.0:clean (default-clean) @ beam-runners-flink_2.10
---
2017-06-08\T\06:30:13.064 [INFO] Deleting <https://builds.apache.org/job/beam_PostCommit_Java_JDK_Versions_Test/jdk=OpenJDK%207%20(on%20Ubuntu%20only),label=beam/ws/runners/flink>
(includes = [**/*.pyc, **/*.egg-info/, **/sdks/python/LICENSE, **/sdks/python/NOTICE, **/sdks/python/README.md],
excludes = [])
2017-06-08\T\06:30:13.067 [INFO] 
2017-06-08\T\06:30:13.067 [INFO] --- maven-enforcer-plugin:1.4.1:enforce (enforce) @ beam-runners-flink_2.10
---
2017-06-08\T\06:30:15.391 [INFO] 
2017-06-08\T\06:30:15.391 [INFO] --- maven-enforcer-plugin:1.4.1:enforce (enforce-banned-dependencies)
@ beam-runners-flink_2.10 ---
2017-06-08\T\06:30:15.408 [INFO] 
2017-06-08\T\06:30:15.408 [INFO] --- maven-remote-resources-plugin:1.5:process (process-resource-bundles)
@ beam-runners-flink_2.10 ---
2017-06-08\T\06:30:15.946 [INFO] 
2017-06-08\T\06:30:15.946 [INFO] --- maven-resources-plugin:3.0.2:resources (default-resources)
@ beam-runners-flink_2.10 ---
2017-06-08\T\06:30:15.947 [INFO] Using 'UTF-8' encoding to copy filtered resources.
2017-06-08\T\06:30:15.947 [INFO] Copying 1 resource
2017-06-08\T\06:30:15.961 [INFO] Copying 3 resources
2017-06-08\T\06:30:15.961 [INFO] 
2017-06-08\T\06:30:15.962 [INFO] --- maven-compiler-plugin:3.6.1:compile (default-compile)
@ beam-runners-flink_2.10 ---
2017-06-08\T\06:30:15.976 [INFO] Changes detected - recompiling the module!
2017-06-08\T\06:30:15.976 [INFO] Compiling 65 source files to <https://builds.apache.org/job/beam_PostCommit_Java_JDK_Versions_Test/jdk=OpenJDK%207%20(on%20Ubuntu%20only),label=beam/ws/runners/flink/target/classes>
2017-06-08\T\06:30:17.503 [INFO] <https://builds.apache.org/job/beam_PostCommit_Java_JDK_Versions_Test/jdk=OpenJDK%207%20(on%20Ubuntu%20only),label=beam/ws/runners/flink/src/main/java/org/apache/beam/runners/flink/translation/wrappers/streaming/io/DedupingOperator.java>:
Some input files use or override a deprecated API.
2017-06-08\T\06:30:17.503 [INFO] <https://builds.apache.org/job/beam_PostCommit_Java_JDK_Versions_Test/jdk=OpenJDK%207%20(on%20Ubuntu%20only),label=beam/ws/runners/flink/src/main/java/org/apache/beam/runners/flink/translation/wrappers/streaming/io/DedupingOperator.java>:
Recompile with -Xlint:deprecation for details.
2017-06-08\T\06:30:17.503 [INFO] <https://builds.apache.org/job/beam_PostCommit_Java_JDK_Versions_Test/jdk=OpenJDK%207%20(on%20Ubuntu%20only),label=beam/ws/runners/flink/src/main/java/org/apache/beam/runners/flink/translation/wrappers/streaming/io/UnboundedSocketSource.java>:
Some input files use unchecked or unsafe operations.
2017-06-08\T\06:30:17.503 [INFO] <https://builds.apache.org/job/beam_PostCommit_Java_JDK_Versions_Test/jdk=OpenJDK%207%20(on%20Ubuntu%20only),label=beam/ws/runners/flink/src/main/java/org/apache/beam/runners/flink/translation/wrappers/streaming/io/UnboundedSocketSource.java>:
Recompile with -Xlint:unchecked for details.
2017-06-08\T\06:30:17.503 [INFO] -------------------------------------------------------------
2017-06-08\T\06:30:17.503 [ERROR] COMPILATION ERROR : 
2017-06-08\T\06:30:17.503 [INFO] -------------------------------------------------------------
2017-06-08\T\06:30:17.503 [ERROR] <https://builds.apache.org/job/beam_PostCommit_Java_JDK_Versions_Test/jdk=OpenJDK%207%20(on%20Ubuntu%20only),label=beam/ws/runners/flink/src/main/java/org/apache/beam/runners/flink/FlinkStreamingTransformTranslators.java>:[366,27]
method put in interface java.util.Map<K,V> cannot be applied to given types;
  required: org.apache.beam.sdk.values.TupleTag<?>,org.apache.flink.util.OutputTag<org.apache.beam.sdk.util.WindowedValue<?>>
  found: org.apache.beam.sdk.values.TupleTag<capture#1 of ?>,org.apache.flink.util.OutputTag<java.lang.Object>
  reason: actual argument org.apache.flink.util.OutputTag<java.lang.Object> cannot be
converted to org.apache.flink.util.OutputTag<org.apache.beam.sdk.util.WindowedValue<?>>
by method invocation conversion
2017-06-08\T\06:30:17.503 [INFO] 1 error
2017-06-08\T\06:30:17.503 [INFO] -------------------------------------------------------------
2017-06-08\T\06:30:17.504 [INFO] ------------------------------------------------------------------------
2017-06-08\T\06:30:17.504 [INFO] Reactor Summary:
2017-06-08\T\06:30:17.504 [INFO] 
2017-06-08\T\06:30:17.504 [INFO] Apache Beam :: Parent .............................. SUCCESS
[ 23.252 s]
2017-06-08\T\06:30:17.504 [INFO] Apache Beam :: SDKs :: Java :: Build Tools ......... SUCCESS
[  9.324 s]
2017-06-08\T\06:30:17.504 [INFO] Apache Beam :: SDKs ................................ SUCCESS
[  0.655 s]
2017-06-08\T\06:30:17.504 [INFO] Apache Beam :: SDKs :: Common ...................... SUCCESS
[  0.698 s]
2017-06-08\T\06:30:17.504 [INFO] Apache Beam :: SDKs :: Common :: Runner API ........ SUCCESS
[ 10.195 s]
2017-06-08\T\06:30:17.504 [INFO] Apache Beam :: SDKs :: Common :: Fn API ............ SUCCESS
[  6.214 s]
2017-06-08\T\06:30:17.504 [INFO] Apache Beam :: SDKs :: Java ........................ SUCCESS
[  0.627 s]
2017-06-08\T\06:30:17.504 [INFO] Apache Beam :: SDKs :: Java :: Core ................ SUCCESS
[01:49 min]
2017-06-08\T\06:30:17.504 [INFO] Apache Beam :: Runners ............................. SUCCESS
[  0.392 s]
2017-06-08\T\06:30:17.504 [INFO] Apache Beam :: Runners :: Core Construction Java ... SUCCESS
[ 18.267 s]
2017-06-08\T\06:30:17.504 [INFO] Apache Beam :: Runners :: Core Java ................ SUCCESS
[ 36.456 s]
2017-06-08\T\06:30:17.504 [INFO] Apache Beam :: Runners :: Direct Java .............. SUCCESS
[03:22 min]
2017-06-08\T\06:30:17.505 [INFO] Apache Beam :: SDKs :: Java :: IO .................. SUCCESS
[  0.398 s]
2017-06-08\T\06:30:17.505 [INFO] Apache Beam :: SDKs :: Java :: IO :: Common ........ SUCCESS
[  2.652 s]
2017-06-08\T\06:30:17.505 [INFO] Apache Beam :: SDKs :: Java :: IO :: Cassandra ..... SUCCESS
[ 15.067 s]
2017-06-08\T\06:30:17.505 [INFO] Apache Beam :: SDKs :: Java :: IO :: Elasticsearch . SUCCESS
[ 23.676 s]
2017-06-08\T\06:30:17.505 [INFO] Apache Beam :: SDKs :: Java :: Extensions .......... SUCCESS
[  0.389 s]
2017-06-08\T\06:30:17.505 [INFO] Apache Beam :: SDKs :: Java :: Extensions :: Google Cloud
Platform Core SUCCESS [ 20.674 s]
2017-06-08\T\06:30:17.505 [INFO] Apache Beam :: SDKs :: Java :: Extensions :: Protobuf SUCCESS
[  7.749 s]
2017-06-08\T\06:30:17.505 [INFO] Apache Beam :: SDKs :: Java :: IO :: Google Cloud Platform
SUCCESS [01:00 min]
2017-06-08\T\06:30:17.505 [INFO] Apache Beam :: SDKs :: Java :: IO :: Hadoop Common . SUCCESS
[ 10.869 s]
2017-06-08\T\06:30:17.505 [INFO] Apache Beam :: SDKs :: Java :: IO :: Hadoop File System SUCCESS
[ 32.659 s]
2017-06-08\T\06:30:17.505 [INFO] Apache Beam :: SDKs :: Java :: IO :: Hadoop ........ SUCCESS
[  2.682 s]
2017-06-08\T\06:30:17.505 [INFO] Apache Beam :: SDKs :: Java :: IO :: Hadoop :: input-format
SUCCESS [  9.160 s]
2017-06-08\T\06:30:17.505 [INFO] Apache Beam :: SDKs :: Java :: IO :: HBase ......... SUCCESS
[ 49.945 s]
2017-06-08\T\06:30:17.505 [INFO] Apache Beam :: Runners :: Google Cloud Dataflow .... SUCCESS
[05:41 min]
2017-06-08\T\06:30:17.505 [INFO] Apache Beam :: SDKs :: Java :: IO :: JDBC .......... SUCCESS
[ 27.477 s]
2017-06-08\T\06:30:17.505 [INFO] Apache Beam :: SDKs :: Java :: IO :: JMS ........... SUCCESS
[ 13.492 s]
2017-06-08\T\06:30:17.505 [INFO] Apache Beam :: SDKs :: Java :: IO :: Kafka ......... SUCCESS
[ 34.986 s]
2017-06-08\T\06:30:17.505 [INFO] Apache Beam :: SDKs :: Java :: IO :: Kinesis ....... SUCCESS
[ 17.116 s]
2017-06-08\T\06:30:17.505 [INFO] Apache Beam :: SDKs :: Java :: IO :: MongoDB ....... SUCCESS
[ 32.781 s]
2017-06-08\T\06:30:17.505 [INFO] Apache Beam :: SDKs :: Java :: IO :: MQTT .......... SUCCESS
[ 11.455 s]
2017-06-08\T\06:30:17.505 [INFO] Apache Beam :: SDKs :: Java :: IO :: XML ........... SUCCESS
[ 12.548 s]
2017-06-08\T\06:30:17.505 [INFO] Apache Beam :: SDKs :: Java :: Maven Archetypes .... SUCCESS
[  0.383 s]
2017-06-08\T\06:30:17.505 [INFO] Apache Beam :: SDKs :: Java :: Maven Archetypes :: Starter
SUCCESS [ 11.616 s]
2017-06-08\T\06:30:17.505 [INFO] Apache Beam :: Examples ............................ SUCCESS
[  0.401 s]
2017-06-08\T\06:30:17.505 [INFO] Apache Beam :: Examples :: Java .................... SUCCESS
[07:06 min]
2017-06-08\T\06:30:17.505 [INFO] Apache Beam :: SDKs :: Java :: Maven Archetypes :: Examples
SUCCESS [ 26.519 s]
2017-06-08\T\06:30:17.505 [INFO] Apache Beam :: SDKs :: Java :: Extensions :: Jackson SUCCESS
[  5.936 s]
2017-06-08\T\06:30:17.505 [INFO] Apache Beam :: SDKs :: Java :: Extensions :: Join library
SUCCESS [  7.763 s]
2017-06-08\T\06:30:17.505 [INFO] Apache Beam :: SDKs :: Java :: Extensions :: Sorter  SUCCESS
[ 23.041 s]
2017-06-08\T\06:30:17.505 [INFO] Apache Beam :: Runners :: Flink .................... FAILURE
[  7.389 s]
2017-06-08\T\06:30:17.505 [INFO] Apache Beam :: Runners :: Spark .................... SKIPPED
2017-06-08\T\06:30:17.505 [INFO] Apache Beam :: SDKs :: Java :: Aggregated Javadoc .. SKIPPED
2017-06-08\T\06:30:17.505 [INFO] ------------------------------------------------------------------------
2017-06-08\T\06:30:17.505 [INFO] BUILD FAILURE
2017-06-08\T\06:30:17.505 [INFO] ------------------------------------------------------------------------
2017-06-08\T\06:30:17.505 [INFO] Total time: 27:39 min
2017-06-08\T\06:30:17.505 [INFO] Finished at: 2017-06-08T06:30:17+00:00
2017-06-08\T\06:30:18.653 [INFO] Final Memory: 226M/1688M
2017-06-08\T\06:30:18.653 [INFO] ------------------------------------------------------------------------
2017-06-08\T\06:30:18.655 [ERROR] Failed to execute goal org.apache.maven.plugins:maven-compiler-plugin:3.6.1:compile
(default-compile) on project beam-runners-flink_2.10: Compilation failure
2017-06-08\T\06:30:18.655 [ERROR] <https://builds.apache.org/job/beam_PostCommit_Java_JDK_Versions_Test/jdk=OpenJDK%207%20(on%20Ubuntu%20only),label=beam/ws/runners/flink/src/main/java/org/apache/beam/runners/flink/FlinkStreamingTransformTranslators.java>:[366,27]
method put in interface java.util.Map<K,V> cannot be applied to given types;
2017-06-08\T\06:30:18.655 [ERROR] required: org.apache.beam.sdk.values.TupleTag<?>,org.apache.flink.util.OutputTag<org.apache.beam.sdk.util.WindowedValue<?>>
2017-06-08\T\06:30:18.655 [ERROR] found: org.apache.beam.sdk.values.TupleTag<capture#1
of ?>,org.apache.flink.util.OutputTag<java.lang.Object>
2017-06-08\T\06:30:18.655 [ERROR] reason: actual argument org.apache.flink.util.OutputTag<java.lang.Object>
cannot be converted to org.apache.flink.util.OutputTag<org.apache.beam.sdk.util.WindowedValue<?>>
by method invocation conversion
2017-06-08\T\06:30:18.655 [ERROR] -> [Help 1]
org.apache.maven.lifecycle.LifecycleExecutionException: Failed to execute goal org.apache.maven.plugins:maven-compiler-plugin:3.6.1:compile
(default-compile) on project beam-runners-flink_2.10: Compilation failure
<https://builds.apache.org/job/beam_PostCommit_Java_JDK_Versions_Test/jdk=OpenJDK%207%20(on%20Ubuntu%20only),label=beam/ws/runners/flink/src/main/java/org/apache/beam/runners/flink/FlinkStreamingTransformTranslators.java>:[366,27]
method put in interface java.util.Map<K,V> cannot be applied to given types;
  required: org.apache.beam.sdk.values.TupleTag<?>,org.apache.flink.util.OutputTag<org.apache.beam.sdk.util.WindowedValue<?>>
  found: org.apache.beam.sdk.values.TupleTag<capture#1 of ?>,org.apache.flink.util.OutputTag<java.lang.Object>
  reason: actual argument org.apache.flink.util.OutputTag<java.lang.Object> cannot be
converted to org.apache.flink.util.OutputTag<org.apache.beam.sdk.util.WindowedValue<?>>
by method invocation conversion

	at org.apache.maven.lifecycle.internal.MojoExecutor.execute(MojoExecutor.java:212)
	at org.apache.maven.lifecycle.internal.MojoExecutor.execute(MojoExecutor.java:153)
	at org.apache.maven.lifecycle.internal.MojoExecutor.execute(MojoExecutor.java:145)
	at org.apache.maven.lifecycle.internal.LifecycleModuleBuilder.buildProject(LifecycleModuleBuilder.java:116)
	at org.apache.maven.lifecycle.internal.LifecycleModuleBuilder.buildProject(LifecycleModuleBuilder.java:80)
	at org.apache.maven.lifecycle.internal.builder.singlethreaded.SingleThreadedBuilder.build(SingleThreadedBuilder.java:51)
	at org.apache.maven.lifecycle.internal.LifecycleStarter.execute(LifecycleStarter.java:128)
	at org.apache.maven.DefaultMaven.doExecute(DefaultMaven.java:307)
	at org.apache.maven.DefaultMaven.doExecute(DefaultMaven.java:193)
	at org.apache.maven.DefaultMaven.execute(DefaultMaven.java:106)
	at org.apache.maven.cli.MavenCli.execute(MavenCli.java:862)
	at org.apache.maven.cli.MavenCli.doMain(MavenCli.java:286)
	at org.apache.maven.cli.MavenCli.main(MavenCli.java:197)
	at sun.reflect.NativeMethodAccessorImpl.invoke0(Native Method)
	at sun.reflect.NativeMethodAccessorImpl.invoke(NativeMethodAccessorImpl.java:57)
	at sun.reflect.DelegatingMethodAccessorImpl.invoke(DelegatingMethodAccessorImpl.java:43)
	at java.lang.reflect.Method.invoke(Method.java:606)
	at org.codehaus.plexus.classworlds.launcher.Launcher.launchEnhanced(Launcher.java:289)
	at org.codehaus.plexus.classworlds.launcher.Launcher.launch(Launcher.java:229)
	at org.codehaus.plexus.classworlds.launcher.Launcher.mainWithExitCode(Launcher.java:415)
	at org.codehaus.plexus.classworlds.launcher.Launcher.main(Launcher.java:356)
Caused by: org.apache.maven.plugin.compiler.CompilationFailureException: Compilation failure
<https://builds.apache.org/job/beam_PostCommit_Java_JDK_Versions_Test/jdk=OpenJDK%207%20(on%20Ubuntu%20only),label=beam/ws/runners/flink/src/main/java/org/apache/beam/runners/flink/FlinkStreamingTransformTranslators.java>:[366,27]
method put in interface java.util.Map<K,V> cannot be applied to given types;
  required: org.apache.beam.sdk.values.TupleTag<?>,org.apache.flink.util.OutputTag<org.apache.beam.sdk.util.WindowedValue<?>>
  found: org.apache.beam.sdk.values.TupleTag<capture#1 of ?>,org.apache.flink.util.OutputTag<java.lang.Object>
  reason: actual argument org.apache.flink.util.OutputTag<java.lang.Object> cannot be
converted to org.apache.flink.util.OutputTag<org.apache.beam.sdk.util.WindowedValue<?>>
by method invocation conversion

	at org.apache.maven.plugin.compiler.AbstractCompilerMojo.execute(AbstractCompilerMojo.java:1029)
	at org.apache.maven.plugin.compiler.CompilerMojo.execute(CompilerMojo.java:137)
	at org.apache.maven.plugin.DefaultBuildPluginManager.executeMojo(DefaultBuildPluginManager.java:134)
	at org.apache.maven.lifecycle.internal.MojoExecutor.execute(MojoExecutor.java:208)
	... 20 more
2017-06-08\T\06:30:18.656 [ERROR] 
2017-06-08\T\06:30:18.656 [ERROR] Re-run Maven using the -X switch to enable full debug logging.
2017-06-08\T\06:30:18.656 [ERROR] 
2017-06-08\T\06:30:18.656 [ERROR] For more information about the errors and possible solutions,
please read the following articles:
2017-06-08\T\06:30:18.656 [ERROR] [Help 1] http://cwiki.apache.org/confluence/display/MAVEN/MojoFailureException
2017-06-08\T\06:30:18.656 [ERROR] 
2017-06-08\T\06:30:18.656 [ERROR] After correcting the problems, you can resume the build
with the command
2017-06-08\T\06:30:18.656 [ERROR]   mvn <goals> -rf :beam-runners-flink_2.10
Build step 'Invoke top-level Maven targets' marked build as failure
Not sending mail to unregistered user ccy@google.com

Mime
View raw message