beam-commits mailing list archives

Site index · List index
Message view « Date » · « Thread »
Top « Date » · « Thread »
From Apache Jenkins Server <jenk...@builds.apache.org>
Subject Build failed in Jenkins: beam_PostCommit_Java_MavenInstall #4153
Date Tue, 20 Jun 2017 16:25:13 GMT
See <https://builds.apache.org/job/beam_PostCommit_Java_MavenInstall/4153/display/redirect?page=changes>

Changes:

[lcwik] Retries http code 0 (usually network error)

------------------------------------------
[...truncated 1.20 MB...]
2017-06-20T16:23:37.361 [INFO] Downloading: https://repo.maven.apache.org/maven2/org/apache/hive/hive-service-rpc/2.1.0/hive-service-rpc-2.1.0.jar
2017-06-20T16:23:37.499 [INFO] Downloaded: https://repo.maven.apache.org/maven2/org/apache/hive/hive-serde/2.1.0/hive-serde-2.1.0.jar
(895 KB at 295.3 KB/sec)
2017-06-20T16:23:37.499 [INFO] Downloading: https://repo.maven.apache.org/maven2/org/apache/parquet/parquet-hadoop-bundle/1.8.1/parquet-hadoop-bundle-1.8.1.jar
2017-06-20T16:23:37.662 [INFO] Downloaded: https://repo.maven.apache.org/maven2/org/apache/hadoop/hadoop-hdfs/2.6.0/hadoop-hdfs-2.6.0.jar
(7640 KB at 2394.0 KB/sec)
2017-06-20T16:23:37.662 [INFO] Downloading: https://repo.maven.apache.org/maven2/org/apache/hive/hive-service/2.1.0/hive-service-2.1.0.jar
2017-06-20T16:23:37.814 [INFO] Downloaded: https://repo.maven.apache.org/maven2/org/apache/hive/hive-service/2.1.0/hive-service-2.1.0.jar
(472 KB at 141.2 KB/sec)
2017-06-20T16:23:37.814 [INFO] Downloading: https://repo.maven.apache.org/maven2/org/apache/hive/hive-llap-server/2.1.0/hive-llap-server-2.1.0.jar
2017-06-20T16:23:37.960 [INFO] Downloaded: https://repo.maven.apache.org/maven2/org/apache/hive/hive-service-rpc/2.1.0/hive-service-rpc-2.1.0.jar
(1503 KB at 430.6 KB/sec)
2017-06-20T16:23:37.961 [INFO] Downloading: https://repo.maven.apache.org/maven2/org/apache/slider/slider-core/0.90.2-incubating/slider-core-0.90.2-incubating.jar
2017-06-20T16:23:37.970 [INFO] Downloaded: https://repo.maven.apache.org/maven2/org/apache/hive/hive-llap-server/2.1.0/hive-llap-server-2.1.0.jar
(545 KB at 155.7 KB/sec)
2017-06-20T16:23:37.970 [INFO] Downloading: https://repo.maven.apache.org/maven2/com/beust/jcommander/1.30/jcommander-1.30.jar
2017-06-20T16:23:37.971 [INFO] Downloaded: https://repo.maven.apache.org/maven2/org/apache/parquet/parquet-hadoop-bundle/1.8.1/parquet-hadoop-bundle-1.8.1.jar
(2835 KB at 809.8 KB/sec)
2017-06-20T16:23:37.971 [INFO] Downloading: https://repo.maven.apache.org/maven2/org/apache/hadoop/hadoop-yarn-registry/2.7.1/hadoop-yarn-registry-2.7.1.jar
2017-06-20T16:23:38.002 [INFO] Downloaded: https://repo.maven.apache.org/maven2/com/beust/jcommander/1.30/jcommander-1.30.jar
(59 KB at 16.7 KB/sec)
2017-06-20T16:23:38.003 [INFO] Downloading: https://repo.maven.apache.org/maven2/org/apache/hbase/hbase-hadoop2-compat/1.1.1/hbase-hadoop2-compat-1.1.1.jar
2017-06-20T16:23:38.026 [INFO] Downloading: https://repo.maven.apache.org/maven2/org/apache/hbase/hbase-server/1.1.1/hbase-server-1.1.1.jar
2017-06-20T16:23:38.073 [INFO] Downloaded: https://repo.maven.apache.org/maven2/org/apache/hadoop/hadoop-yarn-registry/2.7.1/hadoop-yarn-registry-2.7.1.jar
(96 KB at 26.6 KB/sec)
2017-06-20T16:23:38.073 [INFO] Downloading: https://repo.maven.apache.org/maven2/org/apache/hbase/hbase-procedure/1.1.1/hbase-procedure-1.1.1.jar
2017-06-20T16:23:38.076 [INFO] Downloaded: https://repo.maven.apache.org/maven2/org/apache/hbase/hbase-hadoop2-compat/1.1.1/hbase-hadoop2-compat-1.1.1.jar
(80 KB at 22.0 KB/sec)
2017-06-20T16:23:38.076 [INFO] Downloading: https://repo.maven.apache.org/maven2/org/apache/hbase/hbase-common/1.1.1/hbase-common-1.1.1-tests.jar
2017-06-20T16:23:38.116 [INFO] Downloaded: https://repo.maven.apache.org/maven2/org/apache/hive/hive-exec/2.1.0/hive-exec-2.1.0.jar
(31655 KB at 8646.5 KB/sec)
2017-06-20T16:23:38.116 [INFO] Downloading: https://repo.maven.apache.org/maven2/org/apache/hbase/hbase-prefix-tree/1.1.1/hbase-prefix-tree-1.1.1.jar
2017-06-20T16:23:38.130 [INFO] Downloaded: https://repo.maven.apache.org/maven2/org/apache/hbase/hbase-common/1.1.1/hbase-common-1.1.1-tests.jar
(206 KB at 56.1 KB/sec)
2017-06-20T16:23:38.131 [INFO] Downloading: https://repo.maven.apache.org/maven2/org/apache/hbase/hbase-hadoop-compat/1.1.1/hbase-hadoop-compat-1.1.1.jar
2017-06-20T16:23:38.156 [INFO] Downloaded: https://repo.maven.apache.org/maven2/org/apache/hbase/hbase-prefix-tree/1.1.1/hbase-prefix-tree-1.1.1.jar
(100 KB at 27.1 KB/sec)
2017-06-20T16:23:38.156 [INFO] Downloading: https://repo.maven.apache.org/maven2/javax/servlet/jsp-api/2.0/jsp-api-2.0.jar
2017-06-20T16:23:38.159 [INFO] Downloaded: https://repo.maven.apache.org/maven2/org/apache/slider/slider-core/0.90.2-incubating/slider-core-0.90.2-incubating.jar
(1744 KB at 472.7 KB/sec)
2017-06-20T16:23:38.159 [INFO] Downloading: https://repo.maven.apache.org/maven2/org/jamon/jamon-runtime/2.3.1/jamon-runtime-2.3.1.jar
2017-06-20T16:23:38.161 [INFO] Downloaded: https://repo.maven.apache.org/maven2/org/apache/hbase/hbase-hadoop-compat/1.1.1/hbase-hadoop-compat-1.1.1.jar
(36 KB at 9.5 KB/sec)
2017-06-20T16:23:38.161 [INFO] Downloading: https://repo.maven.apache.org/maven2/org/apache/thrift/libthrift/0.9.3/libthrift-0.9.3.jar
2017-06-20T16:23:38.167 [INFO] Downloaded: https://repo.maven.apache.org/maven2/org/apache/hbase/hbase-procedure/1.1.1/hbase-procedure-1.1.1.jar
(100 KB at 26.9 KB/sec)
2017-06-20T16:23:38.186 [INFO] Downloaded: https://repo.maven.apache.org/maven2/javax/servlet/jsp-api/2.0/jsp-api-2.0.jar
(50 KB at 13.3 KB/sec)
2017-06-20T16:23:38.188 [INFO] Downloaded: https://repo.maven.apache.org/maven2/org/jamon/jamon-runtime/2.3.1/jamon-runtime-2.3.1.jar
(21 KB at 5.4 KB/sec)
2017-06-20T16:23:38.204 [INFO] Downloaded: https://repo.maven.apache.org/maven2/org/apache/thrift/libthrift/0.9.3/libthrift-0.9.3.jar
(229 KB at 61.3 KB/sec)
2017-06-20T16:23:38.362 [INFO] Downloaded: https://repo.maven.apache.org/maven2/org/apache/hbase/hbase-server/1.1.1/hbase-server-1.1.1.jar
(3878 KB at 996.5 KB/sec)
2017-06-20T16:23:38.382 [INFO] Downloading: http://www.datanucleus.org/downloads/maven2/org/pentaho/pentaho-aggdesigner-algorithm/5.1.5-jhyde/pentaho-aggdesigner-algorithm-5.1.5-jhyde.jar
2017-06-20T16:23:38.382 [INFO] Downloading: http://www.datanucleus.org/downloads/maven2/it/unimi/dsi/fastutil/6.5.6/fastutil-6.5.6.jar
2017-06-20T16:23:38.633 [INFO] Downloading: http://conjars.org/repo/org/pentaho/pentaho-aggdesigner-algorithm/5.1.5-jhyde/pentaho-aggdesigner-algorithm-5.1.5-jhyde.jar
2017-06-20T16:23:38.742 [INFO] Downloaded: http://conjars.org/repo/org/pentaho/pentaho-aggdesigner-algorithm/5.1.5-jhyde/pentaho-aggdesigner-algorithm-5.1.5-jhyde.jar
(0 B at 0.0 KB/sec)
2017-06-20T16:23:38.743 [INFO] Downloading: https://repository.continuuity.com/content/groups/public/it/unimi/dsi/fastutil/6.5.6/fastutil-6.5.6.jar
[JENKINS] Archiving disabled
2017-06-20T16:23:39.341 [INFO]                                                           
             
2017-06-20T16:23:39.341 [INFO] ------------------------------------------------------------------------
2017-06-20T16:23:39.341 [INFO] Skipping Apache Beam :: Parent
2017-06-20T16:23:39.341 [INFO] This project has been banned from the build due to previous
failures.
2017-06-20T16:23:39.341 [INFO] ------------------------------------------------------------------------
[JENKINS] Archiving disabled
[JENKINS] Archiving disabled
[JENKINS] Archiving disabled
[JENKINS] Archiving disabled
[JENKINS] Archiving disabled
[JENKINS] Archiving disabled
[JENKINS] Archiving disabled
[JENKINS] Archiving disabled
[JENKINS] Archiving disabled
[JENKINS] Archiving disabled
[JENKINS] Archiving disabled
[JENKINS] Archiving disabled
[JENKINS] Archiving disabled
[JENKINS] Archiving disabled
[JENKINS] Archiving disabled
[JENKINS] Archiving disabled
[JENKINS] Archiving disabled
[JENKINS] Archiving disabled
[JENKINS] Archiving disabled
[JENKINS] Archiving disabled
[JENKINS] Archiving disabled
[JENKINS] Archiving disabled
[JENKINS] Archiving disabled
[JENKINS] Archiving disabled
[JENKINS] Archiving disabled
[JENKINS] Archiving disabled
[JENKINS] Archiving disabled
[JENKINS] Archiving disabled
[JENKINS] Archiving disabled
[JENKINS] Archiving disabled
[JENKINS] Archiving disabled
[JENKINS] Archiving disabled
[JENKINS] Archiving disabled
[JENKINS] Archiving disabled
[JENKINS] Archiving disabled
[JENKINS] Archiving disabled
[JENKINS] Archiving disabled
[JENKINS] Archiving disabled
[JENKINS] Archiving disabled
[JENKINS] Archiving disabled
[JENKINS] Archiving disabled
[JENKINS] Archiving disabled
[JENKINS] Archiving disabled
[JENKINS] Archiving disabled
[JENKINS] Archiving disabled
[JENKINS] Archiving disabled
[JENKINS] Archiving disabled
[JENKINS] Archiving disabled2017-06-20T16:24:01.462 [INFO] ------------------------------------------------------------------------
2017-06-20T16:24:01.462 [INFO] Reactor Summary:
2017-06-20T16:24:01.462 [INFO] 
2017-06-20T16:24:01.462 [INFO] Apache Beam :: Parent .............................. SUCCESS
[ 22.781 s]
2017-06-20T16:24:01.462 [INFO] Apache Beam :: SDKs :: Java :: Build Tools ......... SUCCESS
[ 11.046 s]
2017-06-20T16:24:01.462 [INFO] Apache Beam :: SDKs ................................ SUCCESS
[  4.595 s]
2017-06-20T16:24:01.462 [INFO] Apache Beam :: SDKs :: Common ...................... SUCCESS
[  1.770 s]
2017-06-20T16:24:01.462 [INFO] Apache Beam :: SDKs :: Common :: Runner API ........ SUCCESS
[ 14.899 s]
2017-06-20T16:24:01.463 [INFO] Apache Beam :: SDKs :: Common :: Fn API ............ SUCCESS
[ 17.095 s]
2017-06-20T16:24:01.463 [INFO] Apache Beam :: SDKs :: Java ........................ SUCCESS
[  2.228 s]
2017-06-20T16:24:01.463 [INFO] Apache Beam :: SDKs :: Java :: Core ................ SUCCESS
[02:33 min]
2017-06-20T16:24:01.463 [INFO] Apache Beam :: Runners ............................. SUCCESS
[  2.879 s]
2017-06-20T16:24:01.463 [INFO] Apache Beam :: Runners :: Core Construction Java ... SUCCESS
[ 33.380 s]
2017-06-20T16:24:01.463 [INFO] Apache Beam :: Runners :: Core Java ................ SUCCESS
[ 53.063 s]
2017-06-20T16:24:01.463 [INFO] Apache Beam :: Runners :: Direct Java .............. SUCCESS
[04:46 min]
2017-06-20T16:24:01.463 [INFO] Apache Beam :: SDKs :: Java :: IO .................. SUCCESS
[  2.025 s]
2017-06-20T16:24:01.463 [INFO] Apache Beam :: SDKs :: Java :: IO :: Common ........ SUCCESS
[  6.515 s]
2017-06-20T16:24:01.463 [INFO] Apache Beam :: SDKs :: Java :: IO :: Cassandra ..... SUCCESS
[ 39.536 s]
2017-06-20T16:24:01.463 [INFO] Apache Beam :: SDKs :: Java :: IO :: Elasticsearch . SUCCESS
[ 56.409 s]
2017-06-20T16:24:01.463 [INFO] Apache Beam :: SDKs :: Java :: Extensions .......... SUCCESS
[  2.179 s]
2017-06-20T16:24:01.463 [INFO] Apache Beam :: SDKs :: Java :: Extensions :: Google Cloud Platform
Core SUCCESS [ 49.167 s]
2017-06-20T16:24:01.463 [INFO] Apache Beam :: SDKs :: Java :: Extensions :: Protobuf SUCCESS
[ 28.617 s]
2017-06-20T16:24:01.463 [INFO] Apache Beam :: SDKs :: Java :: IO :: Google Cloud Platform
SUCCESS [01:33 min]
2017-06-20T16:24:01.463 [INFO] Apache Beam :: SDKs :: Java :: IO :: Hadoop Common . SUCCESS
[ 21.446 s]
2017-06-20T16:24:01.463 [INFO] Apache Beam :: SDKs :: Java :: IO :: Hadoop File System SUCCESS
[ 55.717 s]
2017-06-20T16:24:01.463 [INFO] Apache Beam :: SDKs :: Java :: IO :: Hadoop ........ SUCCESS
[  4.264 s]
2017-06-20T16:24:01.463 [INFO] Apache Beam :: SDKs :: Java :: IO :: Hadoop :: input-format
SUCCESS [ 28.054 s]
2017-06-20T16:24:01.463 [INFO] Apache Beam :: Runners :: Google Cloud Dataflow .... SUCCESS
[07:50 min]
2017-06-20T16:24:01.463 [INFO] Apache Beam :: SDKs :: Java :: IO :: Hadoop :: jdk1.8-tests
SUCCESS [01:37 min]
2017-06-20T16:24:01.463 [INFO] Apache Beam :: SDKs :: Java :: IO :: HBase ......... SUCCESS
[01:08 min]
2017-06-20T16:24:01.463 [INFO] Apache Beam :: SDKs :: Java :: IO :: HCatalog ...... FAILURE
[  9.477 s]
2017-06-20T16:24:01.463 [INFO] Apache Beam :: SDKs :: Java :: IO :: JDBC .......... SKIPPED
2017-06-20T16:24:01.463 [INFO] Apache Beam :: SDKs :: Java :: IO :: JMS ........... SKIPPED
2017-06-20T16:24:01.463 [INFO] Apache Beam :: SDKs :: Java :: IO :: Kafka ......... SKIPPED
2017-06-20T16:24:01.463 [INFO] Apache Beam :: SDKs :: Java :: IO :: Kinesis ....... SKIPPED
2017-06-20T16:24:01.463 [INFO] Apache Beam :: SDKs :: Java :: IO :: MongoDB ....... SKIPPED
2017-06-20T16:24:01.463 [INFO] Apache Beam :: SDKs :: Java :: IO :: MQTT .......... SKIPPED
2017-06-20T16:24:01.463 [INFO] Apache Beam :: SDKs :: Java :: IO :: XML ........... SKIPPED
2017-06-20T16:24:01.463 [INFO] Apache Beam :: SDKs :: Java :: Maven Archetypes .... SKIPPED
2017-06-20T16:24:01.463 [INFO] Apache Beam :: SDKs :: Java :: Maven Archetypes :: Starter
SKIPPED
2017-06-20T16:24:01.463 [INFO] Apache Beam :: Examples ............................ SKIPPED
2017-06-20T16:24:01.463 [INFO] Apache Beam :: Examples :: Java .................... SKIPPED
2017-06-20T16:24:01.463 [INFO] Apache Beam :: SDKs :: Java :: Maven Archetypes :: Examples
SKIPPED
2017-06-20T16:24:01.463 [INFO] Apache Beam :: Examples :: Java 8 .................. SKIPPED
2017-06-20T16:24:01.463 [INFO] Apache Beam :: SDKs :: Java :: Maven Archetypes :: Examples
- Java 8 SKIPPED
2017-06-20T16:24:01.463 [INFO] Apache Beam :: SDKs :: Java :: Extensions :: Jackson SKIPPED
2017-06-20T16:24:01.463 [INFO] Apache Beam :: SDKs :: Java :: Extensions :: Join library SKIPPED
2017-06-20T16:24:01.463 [INFO] Apache Beam :: SDKs :: Java :: Extensions :: Sorter  SKIPPED
2017-06-20T16:24:01.463 [INFO] Apache Beam :: SDKs :: Java :: Harness ............. SKIPPED
2017-06-20T16:24:01.463 [INFO] Apache Beam :: SDKs :: Java :: Java 8 Tests ........ SKIPPED
2017-06-20T16:24:01.463 [INFO] Apache Beam :: SDKs :: Python ...................... SKIPPED
2017-06-20T16:24:01.463 [INFO] Apache Beam :: Runners :: Flink .................... SKIPPED
2017-06-20T16:24:01.463 [INFO] Apache Beam :: Runners :: Spark .................... SKIPPED
2017-06-20T16:24:01.463 [INFO] Apache Beam :: Runners :: Apex ..................... SKIPPED
2017-06-20T16:24:01.463 [INFO] Apache Beam :: SDKs :: Java :: Aggregated Javadoc .. SKIPPED
2017-06-20T16:24:01.463 [INFO] ------------------------------------------------------------------------
2017-06-20T16:24:01.463 [INFO] BUILD FAILURE
2017-06-20T16:24:01.463 [INFO] ------------------------------------------------------------------------
2017-06-20T16:24:01.463 [INFO] Total time: 28:19 min
2017-06-20T16:24:01.463 [INFO] Finished at: 2017-06-20T16:24:01+00:00

2017-06-20T16:24:02.156 [INFO] Final Memory: 235M/1667M
2017-06-20T16:24:02.156 [INFO] ------------------------------------------------------------------------
Waiting for Jenkins to finish collecting data
2017-06-20T16:24:25.295 [ERROR] Failed to execute goal on project beam-sdks-java-io-hcatalog:
Could not resolve dependencies for project org.apache.beam:beam-sdks-java-io-hcatalog:jar:2.1.0-SNAPSHOT:
Could not transfer artifact it.unimi.dsi:fastutil:jar:6.5.6 from/to central (https://repo.maven.apache.org/maven2):
GET request of: it/unimi/dsi/fastutil/6.5.6/fastutil-6.5.6.jar from central failed: Connection
reset -> [Help 1]
org.apache.maven.lifecycle.LifecycleExecutionException: Failed to execute goal on project
beam-sdks-java-io-hcatalog: Could not resolve dependencies for project org.apache.beam:beam-sdks-java-io-hcatalog:jar:2.1.0-SNAPSHOT:
Could not transfer artifact it.unimi.dsi:fastutil:jar:6.5.6 from/to central (https://repo.maven.apache.org/maven2):
GET request of: it/unimi/dsi/fastutil/6.5.6/fastutil-6.5.6.jar from central failed
	at org.apache.maven.lifecycle.internal.LifecycleDependencyResolver.getDependencies(LifecycleDependencyResolver.java:221)
	at org.apache.maven.lifecycle.internal.LifecycleDependencyResolver.resolveProjectDependencies(LifecycleDependencyResolver.java:127)
	at org.apache.maven.lifecycle.internal.MojoExecutor.ensureDependenciesAreResolved(MojoExecutor.java:257)
	at org.apache.maven.lifecycle.internal.MojoExecutor.execute(MojoExecutor.java:200)
	at org.apache.maven.lifecycle.internal.MojoExecutor.execute(MojoExecutor.java:153)
	at org.apache.maven.lifecycle.internal.MojoExecutor.execute(MojoExecutor.java:145)
	at org.apache.maven.lifecycle.internal.LifecycleModuleBuilder.buildProject(LifecycleModuleBuilder.java:116)
	at org.apache.maven.lifecycle.internal.LifecycleModuleBuilder.buildProject(LifecycleModuleBuilder.java:80)
	at org.apache.maven.lifecycle.internal.builder.singlethreaded.SingleThreadedBuilder.build(SingleThreadedBuilder.java:51)
	at org.apache.maven.lifecycle.internal.LifecycleStarter.execute(LifecycleStarter.java:128)
	at org.apache.maven.DefaultMaven.doExecute(DefaultMaven.java:307)
	at org.apache.maven.DefaultMaven.doExecute(DefaultMaven.java:193)
	at org.apache.maven.DefaultMaven.execute(DefaultMaven.java:106)
	at org.jvnet.hudson.maven3.launcher.Maven33Launcher.main(Maven33Launcher.java:129)
	at sun.reflect.NativeMethodAccessorImpl.invoke0(Native Method)
	at sun.reflect.NativeMethodAccessorImpl.invoke(NativeMethodAccessorImpl.java:62)
	at sun.reflect.DelegatingMethodAccessorImpl.invoke(DelegatingMethodAccessorImpl.java:43)
	at java.lang.reflect.Method.invoke(Method.java:498)
	at org.codehaus.plexus.classworlds.launcher.Launcher.launchStandard(Launcher.java:330)
	at org.codehaus.plexus.classworlds.launcher.Launcher.launch(Launcher.java:238)
	at jenkins.maven3.agent.Maven33Main.launch(Maven33Main.java:176)
	at sun.reflect.NativeMethodAccessorImpl.invoke0(Native Method)
	at sun.reflect.NativeMethodAccessorImpl.invoke(NativeMethodAccessorImpl.java:62)
	at sun.reflect.DelegatingMethodAccessorImpl.invoke(DelegatingMethodAccessorImpl.java:43)
	at java.lang.reflect.Method.invoke(Method.java:498)
	at hudson.maven.Maven3Builder.call(Maven3Builder.java:139)
	at hudson.maven.Maven3Builder.call(Maven3Builder.java:70)
	at hudson.remoting.UserRequest.perform(UserRequest.java:153)
	at hudson.remoting.UserRequest.perform(UserRequest.java:50)
	at hudson.remoting.Request$2.run(Request.java:336)
	at hudson.remoting.InterceptingExecutorService$1.call(InterceptingExecutorService.java:68)
	at java.util.concurrent.FutureTask.run(FutureTask.java:266)
	at java.util.concurrent.ThreadPoolExecutor.runWorker(ThreadPoolExecutor.java:1142)
	at java.util.concurrent.ThreadPoolExecutor$Worker.run(ThreadPoolExecutor.java:617)
	at java.lang.Thread.run(Thread.java:748)
Caused by: org.apache.maven.project.DependencyResolutionException: Could not resolve dependencies
for project org.apache.beam:beam-sdks-java-io-hcatalog:jar:2.1.0-SNAPSHOT: Could not transfer
artifact it.unimi.dsi:fastutil:jar:6.5.6 from/to central (https://repo.maven.apache.org/maven2):
GET request of: it/unimi/dsi/fastutil/6.5.6/fastutil-6.5.6.jar from central failed
	at org.apache.maven.project.DefaultProjectDependenciesResolver.resolve(DefaultProjectDependenciesResolver.java:211)
	at org.apache.maven.lifecycle.internal.LifecycleDependencyResolver.getDependencies(LifecycleDependencyResolver.java:195)
	... 34 more
Caused by: org.eclipse.aether.resolution.DependencyResolutionException: Could not transfer
artifact it.unimi.dsi:fastutil:jar:6.5.6 from/to central (https://repo.maven.apache.org/maven2):
GET request of: it/unimi/dsi/fastutil/6.5.6/fastutil-6.5.6.jar from central failed
	at org.eclipse.aether.internal.impl.DefaultRepositorySystem.resolveDependencies(DefaultRepositorySystem.java:384)
	at org.apache.maven.project.DefaultProjectDependenciesResolver.resolve(DefaultProjectDependenciesResolver.java:205)
	... 35 more
Caused by: org.eclipse.aether.resolution.ArtifactResolutionException: Could not transfer artifact
it.unimi.dsi:fastutil:jar:6.5.6 from/to central (https://repo.maven.apache.org/maven2): GET
request of: it/unimi/dsi/fastutil/6.5.6/fastutil-6.5.6.jar from central failed
	at org.eclipse.aether.internal.impl.DefaultArtifactResolver.resolve(DefaultArtifactResolver.java:444)
	at org.eclipse.aether.internal.impl.DefaultArtifactResolver.resolveArtifacts(DefaultArtifactResolver.java:246)
	at org.eclipse.aether.internal.impl.DefaultRepositorySystem.resolveDependencies(DefaultRepositorySystem.java:367)
	... 36 more
Caused by: org.eclipse.aether.transfer.ArtifactTransferException: Could not transfer artifact
it.unimi.dsi:fastutil:jar:6.5.6 from/to central (https://repo.maven.apache.org/maven2): GET
request of: it/unimi/dsi/fastutil/6.5.6/fastutil-6.5.6.jar from central failed
	at org.eclipse.aether.connector.basic.ArtifactTransportListener.transferFailed(ArtifactTransportListener.java:43)
	at org.eclipse.aether.connector.basic.BasicRepositoryConnector$TaskRunner.run(BasicRepositoryConnector.java:355)
	at org.eclipse.aether.util.concurrency.RunnableErrorForwarder$1.run(RunnableErrorForwarder.java:67)
	... 3 more
Caused by: org.apache.maven.wagon.TransferFailedException: GET request of: it/unimi/dsi/fastutil/6.5.6/fastutil-6.5.6.jar
from central failed
	at org.apache.maven.wagon.AbstractWagon.getTransfer(AbstractWagon.java:363)
	at org.apache.maven.wagon.AbstractWagon.getTransfer(AbstractWagon.java:316)
	at org.apache.maven.wagon.AbstractWagon.getTransfer(AbstractWagon.java:285)
	at org.apache.maven.wagon.StreamWagon.getIfNewer(StreamWagon.java:97)
	at org.apache.maven.wagon.StreamWagon.get(StreamWagon.java:61)
	at org.eclipse.aether.transport.wagon.WagonTransporter$GetTaskRunner.run(WagonTransporter.java:560)
	at org.eclipse.aether.transport.wagon.WagonTransporter.execute(WagonTransporter.java:427)
	at org.eclipse.aether.transport.wagon.WagonTransporter.get(WagonTransporter.java:404)
	at org.eclipse.aether.connector.basic.BasicRepositoryConnector$GetTaskRunner.runTask(BasicRepositoryConnector.java:447)
	at org.eclipse.aether.connector.basic.BasicRepositoryConnector$TaskRunner.run(BasicRepositoryConnector.java:350)
	... 4 more
Caused by: java.net.SocketException: Connection reset
	at java.net.SocketInputStream.read(SocketInputStream.java:210)
	at java.net.SocketInputStream.read(SocketInputStream.java:141)
	at sun.security.ssl.InputRecord.readFully(InputRecord.java:465)
	at sun.security.ssl.InputRecord.readV3Record(InputRecord.java:593)
	at sun.security.ssl.InputRecord.read(InputRecord.java:532)
	at sun.security.ssl.SSLSocketImpl.readRecord(SSLSocketImpl.java:973)
	at sun.security.ssl.SSLSocketImpl.readDataRecord(SSLSocketImpl.java:930)
	at sun.security.ssl.AppInputStream.read(AppInputStream.java:105)
	at org.apache.maven.wagon.providers.http.httpclient.impl.io.SessionInputBufferImpl.streamRead(SessionInputBufferImpl.java:136)
	at org.apache.maven.wagon.providers.http.httpclient.impl.io.SessionInputBufferImpl.read(SessionInputBufferImpl.java:195)
	at org.apache.maven.wagon.providers.http.httpclient.impl.io.ContentLengthInputStream.read(ContentLengthInputStream.java:178)
	at org.apache.maven.wagon.providers.http.httpclient.conn.EofSensorInputStream.read(EofSensorInputStream.java:137)
	at org.apache.maven.wagon.AbstractWagon.transfer(AbstractWagon.java:531)
	at org.apache.maven.wagon.AbstractWagon.getTransfer(AbstractWagon.java:353)
	... 13 more
2017-06-20T16:24:25.297 [ERROR] 
2017-06-20T16:24:25.297 [ERROR] Re-run Maven using the -X switch to enable full debug logging.
2017-06-20T16:24:25.297 [ERROR] 
2017-06-20T16:24:25.297 [ERROR] For more information about the errors and possible solutions,
please read the following articles:
2017-06-20T16:24:25.297 [ERROR] [Help 1] http://cwiki.apache.org/confluence/display/MAVEN/DependencyResolutionException
2017-06-20T16:24:25.297 [ERROR] 
2017-06-20T16:24:25.297 [ERROR] After correcting the problems, you can resume the build with
the command
2017-06-20T16:24:25.297 [ERROR]   mvn <goals> -rf :beam-sdks-java-io-hcatalog
channel stopped

Mime
View raw message