beam-commits mailing list archives

Site index · List index
Message view « Date » · « Thread »
Top « Date » · « Thread »
From Apache Jenkins Server <jenk...@builds.apache.org>
Subject Build failed in Jenkins: beam_PostCommit_Java_JDK_Versions_Test » OpenJDK 8 (on Ubuntu only),beam #107
Date Tue, 20 Jun 2017 06:07:34 GMT
See <https://builds.apache.org/job/beam_PostCommit_Java_JDK_Versions_Test/jdk=OpenJDK%208%20(on%20Ubuntu%20only),label=beam/107/display/redirect>

------------------------------------------
[...truncated 542.14 KB...]
2017-06-20\T\06:07:25.668 [INFO] Excluding net.bytebuddy:byte-buddy:jar:1.6.8 from the shaded
jar.
2017-06-20\T\06:07:25.669 [INFO] Excluding org.apache.avro:avro:jar:1.8.2 from the shaded
jar.
2017-06-20\T\06:07:25.669 [INFO] Excluding org.codehaus.jackson:jackson-core-asl:jar:1.9.13
from the shaded jar.
2017-06-20\T\06:07:25.670 [INFO] Excluding org.codehaus.jackson:jackson-mapper-asl:jar:1.9.13
from the shaded jar.
2017-06-20\T\06:07:25.670 [INFO] Excluding com.thoughtworks.paranamer:paranamer:jar:2.7 from
the shaded jar.
2017-06-20\T\06:07:25.670 [INFO] Excluding org.tukaani:xz:jar:1.5 from the shaded jar.
2017-06-20\T\06:07:25.670 [INFO] Excluding org.xerial.snappy:snappy-java:jar:1.1.4-M3 from
the shaded jar.
2017-06-20\T\06:07:25.671 [INFO] Excluding org.apache.commons:commons-compress:jar:1.9 from
the shaded jar.
2017-06-20\T\06:07:25.671 [INFO] Excluding org.apache.commons:commons-lang3:jar:3.5 from the
shaded jar.
2017-06-20\T\06:07:25.671 [INFO] Excluding joda-time:joda-time:jar:2.4 from the shaded jar.
2017-06-20\T\06:07:25.671 [INFO] Including com.google.guava:guava:jar:20.0 in the shaded jar.
2017-06-20\T\06:07:28.132 [INFO] Replacing original artifact with shaded artifact.
2017-06-20\T\06:07:28.132 [INFO] Replacing <https://builds.apache.org/job/beam_PostCommit_Java_JDK_Versions_Test/jdk=OpenJDK%208%20(on%20Ubuntu%20only),label=beam/ws/sdks/java/io/common/target/beam-sdks-java-io-common-2.1.0-SNAPSHOT.jar>
with <https://builds.apache.org/job/beam_PostCommit_Java_JDK_Versions_Test/jdk=OpenJDK%208%20(on%20Ubuntu%20only),label=beam/ws/sdks/java/io/common/target/beam-sdks-java-io-common-2.1.0-SNAPSHOT-shaded.jar>
2017-06-20\T\06:07:28.132 [INFO] Replacing original test artifact with shaded test artifact.
2017-06-20\T\06:07:28.132 [INFO] Replacing <https://builds.apache.org/job/beam_PostCommit_Java_JDK_Versions_Test/jdk=OpenJDK%208%20(on%20Ubuntu%20only),label=beam/ws/sdks/java/io/common/target/beam-sdks-java-io-common-2.1.0-SNAPSHOT-tests.jar>
with <https://builds.apache.org/job/beam_PostCommit_Java_JDK_Versions_Test/jdk=OpenJDK%208%20(on%20Ubuntu%20only),label=beam/ws/sdks/java/io/common/target/beam-sdks-java-io-common-2.1.0-SNAPSHOT-shaded-tests.jar>
2017-06-20\T\06:07:28.132 [INFO] Dependency-reduced POM written at: <https://builds.apache.org/job/beam_PostCommit_Java_JDK_Versions_Test/jdk=OpenJDK%208%20(on%20Ubuntu%20only),label=beam/ws/sdks/java/io/common/dependency-reduced-pom.xml>
2017-06-20\T\06:07:28.176 [INFO] 
2017-06-20\T\06:07:28.176 [INFO] --- maven-dependency-plugin:3.0.1:analyze-only (default)
@ beam-sdks-java-io-common ---
2017-06-20\T\06:07:28.203 [INFO] No dependency problems found
2017-06-20\T\06:07:28.203 [INFO] 
2017-06-20\T\06:07:28.203 [INFO] --- maven-install-plugin:2.5.2:install (default-install)
@ beam-sdks-java-io-common ---
2017-06-20\T\06:07:28.204 [INFO] Installing <https://builds.apache.org/job/beam_PostCommit_Java_JDK_Versions_Test/jdk=OpenJDK%208%20(on%20Ubuntu%20only),label=beam/ws/sdks/java/io/common/target/beam-sdks-java-io-common-2.1.0-SNAPSHOT.jar>
to <https://builds.apache.org/job/beam_PostCommit_Java_JDK_Versions_Test/jdk=OpenJDK%208%20(on%20Ubuntu%20only),label=beam/ws/.repository/org/apache/beam/beam-sdks-java-io-common/2.1.0-SNAPSHOT/beam-sdks-java-io-common-2.1.0-SNAPSHOT.jar>
2017-06-20\T\06:07:28.207 [INFO] Installing <https://builds.apache.org/job/beam_PostCommit_Java_JDK_Versions_Test/jdk=OpenJDK%208%20(on%20Ubuntu%20only),label=beam/ws/sdks/java/io/common/dependency-reduced-pom.xml>
to <https://builds.apache.org/job/beam_PostCommit_Java_JDK_Versions_Test/jdk=OpenJDK%208%20(on%20Ubuntu%20only),label=beam/ws/.repository/org/apache/beam/beam-sdks-java-io-common/2.1.0-SNAPSHOT/beam-sdks-java-io-common-2.1.0-SNAPSHOT.pom>
2017-06-20\T\06:07:28.208 [INFO] Installing <https://builds.apache.org/job/beam_PostCommit_Java_JDK_Versions_Test/jdk=OpenJDK%208%20(on%20Ubuntu%20only),label=beam/ws/sdks/java/io/common/target/beam-sdks-java-io-common-2.1.0-SNAPSHOT-tests.jar>
to <https://builds.apache.org/job/beam_PostCommit_Java_JDK_Versions_Test/jdk=OpenJDK%208%20(on%20Ubuntu%20only),label=beam/ws/.repository/org/apache/beam/beam-sdks-java-io-common/2.1.0-SNAPSHOT/beam-sdks-java-io-common-2.1.0-SNAPSHOT-tests.jar>
2017-06-20\T\06:07:28.210 [INFO] Installing <https://builds.apache.org/job/beam_PostCommit_Java_JDK_Versions_Test/jdk=OpenJDK%208%20(on%20Ubuntu%20only),label=beam/ws/sdks/java/io/common/target/beam-sdks-java-io-common-2.1.0-SNAPSHOT-tests.jar>
to <https://builds.apache.org/job/beam_PostCommit_Java_JDK_Versions_Test/jdk=OpenJDK%208%20(on%20Ubuntu%20only),label=beam/ws/.repository/org/apache/beam/beam-sdks-java-io-common/2.1.0-SNAPSHOT/beam-sdks-java-io-common-2.1.0-SNAPSHOT-tests.jar>
2017-06-20\T\06:07:28.212 [INFO]                                                         
               
2017-06-20\T\06:07:28.212 [INFO] ------------------------------------------------------------------------
2017-06-20\T\06:07:28.212 [INFO] Building Apache Beam :: SDKs :: Java :: IO :: Cassandra 2.1.0-SNAPSHOT
2017-06-20\T\06:07:28.212 [INFO] ------------------------------------------------------------------------
2017-06-20\T\06:07:28.218 [INFO] Downloading: https://repo.maven.apache.org/maven2/com/datastax/cassandra/cassandra-driver-mapping/3.2.0/cassandra-driver-mapping-3.2.0.pom
Jun 20, 2017 6:07:28 AM org.apache.maven.wagon.providers.http.httpclient.impl.execchain.RetryExec
execute
INFO: I/O exception (java.net.SocketException) caught when processing request to {s}->https://repo.maven.apache.org:443:
Connection reset
Jun 20, 2017 6:07:28 AM org.apache.maven.wagon.providers.http.httpclient.impl.execchain.RetryExec
execute
INFO: Retrying request to {s}->https://repo.maven.apache.org:443
Jun 20, 2017 6:07:28 AM org.apache.maven.wagon.providers.http.httpclient.impl.execchain.RetryExec
execute
INFO: I/O exception (java.net.SocketException) caught when processing request to {s}->https://repo.maven.apache.org:443:
Connection reset
Jun 20, 2017 6:07:28 AM org.apache.maven.wagon.providers.http.httpclient.impl.execchain.RetryExec
execute
INFO: Retrying request to {s}->https://repo.maven.apache.org:443
Jun 20, 2017 6:07:28 AM org.apache.maven.wagon.providers.http.httpclient.impl.execchain.RetryExec
execute
INFO: I/O exception (java.net.SocketException) caught when processing request to {s}->https://repo.maven.apache.org:443:
Connection reset
Jun 20, 2017 6:07:28 AM org.apache.maven.wagon.providers.http.httpclient.impl.execchain.RetryExec
execute
INFO: Retrying request to {s}->https://repo.maven.apache.org:443
2017-06-20\T\06:07:28.283 [INFO] Downloading: https://repo.maven.apache.org/maven2/com/datastax/cassandra/cassandra-driver-core/3.2.0/cassandra-driver-core-3.2.0.pom
2017-06-20\T\06:07:28.312 [INFO] Downloaded: https://repo.maven.apache.org/maven2/com/datastax/cassandra/cassandra-driver-core/3.2.0/cassandra-driver-core-3.2.0.pom
(16 KB at 549.4 KB/sec)
2017-06-20\T\06:07:28.314 [INFO] Downloading: https://repo.maven.apache.org/maven2/com/datastax/cassandra/cassandra-driver-parent/3.2.0/cassandra-driver-parent-3.2.0.pom
2017-06-20\T\06:07:28.342 [INFO] Downloaded: https://repo.maven.apache.org/maven2/com/datastax/cassandra/cassandra-driver-parent/3.2.0/cassandra-driver-parent-3.2.0.pom
(23 KB at 794.3 KB/sec)
2017-06-20\T\06:07:28.347 [INFO] Downloading: https://repo.maven.apache.org/maven2/io/netty/netty-handler/4.1.8.Final/netty-handler-4.1.8.Final.pom
2017-06-20\T\06:07:28.374 [INFO] Downloaded: https://repo.maven.apache.org/maven2/io/netty/netty-handler/4.1.8.Final/netty-handler-4.1.8.Final.pom
(3 KB at 86.7 KB/sec)
2017-06-20\T\06:07:28.376 [INFO] Downloading: https://repo.maven.apache.org/maven2/io/netty/netty-parent/4.1.8.Final/netty-parent-4.1.8.Final.pom
2017-06-20\T\06:07:28.404 [INFO] Downloaded: https://repo.maven.apache.org/maven2/io/netty/netty-parent/4.1.8.Final/netty-parent-4.1.8.Final.pom
(48 KB at 1681.7 KB/sec)
2017-06-20\T\06:07:28.410 [INFO] Downloading: https://repo.maven.apache.org/maven2/io/netty/netty-buffer/4.1.8.Final/netty-buffer-4.1.8.Final.pom
2017-06-20\T\06:07:28.437 [INFO] Downloaded: https://repo.maven.apache.org/maven2/io/netty/netty-buffer/4.1.8.Final/netty-buffer-4.1.8.Final.pom
(2 KB at 49.8 KB/sec)
2017-06-20\T\06:07:28.442 [INFO] Downloading: https://repo.maven.apache.org/maven2/io/netty/netty-common/4.1.8.Final/netty-common-4.1.8.Final.pom
2017-06-20\T\06:07:28.469 [INFO] Downloaded: https://repo.maven.apache.org/maven2/io/netty/netty-common/4.1.8.Final/netty-common-4.1.8.Final.pom
(10 KB at 364.3 KB/sec)
2017-06-20\T\06:07:28.475 [INFO] Downloading: https://repo.maven.apache.org/maven2/io/netty/netty-transport/4.1.8.Final/netty-transport-4.1.8.Final.pom
2017-06-20\T\06:07:28.501 [INFO] Downloaded: https://repo.maven.apache.org/maven2/io/netty/netty-transport/4.1.8.Final/netty-transport-4.1.8.Final.pom
(2 KB at 56.1 KB/sec)
2017-06-20\T\06:07:28.507 [INFO] Downloading: https://repo.maven.apache.org/maven2/io/netty/netty-resolver/4.1.8.Final/netty-resolver-4.1.8.Final.pom
2017-06-20\T\06:07:28.533 [INFO] Downloaded: https://repo.maven.apache.org/maven2/io/netty/netty-resolver/4.1.8.Final/netty-resolver-4.1.8.Final.pom
(2 KB at 51.9 KB/sec)
2017-06-20\T\06:07:28.537 [INFO] Downloading: https://repo.maven.apache.org/maven2/io/netty/netty-codec/4.1.8.Final/netty-codec-4.1.8.Final.pom
2017-06-20\T\06:07:28.564 [INFO] Downloaded: https://repo.maven.apache.org/maven2/io/netty/netty-codec/4.1.8.Final/netty-codec-4.1.8.Final.pom
(3 KB at 110.4 KB/sec)
2017-06-20\T\06:07:28.572 [INFO] Downloading: https://repo.maven.apache.org/maven2/io/dropwizard/metrics/metrics-core/3.1.2/metrics-core-3.1.2.pom
2017-06-20\T\06:07:28.598 [INFO] Downloaded: https://repo.maven.apache.org/maven2/io/dropwizard/metrics/metrics-core/3.1.2/metrics-core-3.1.2.pom
(846 B at 31.8 KB/sec)
2017-06-20\T\06:07:28.599 [INFO] Downloading: https://repo.maven.apache.org/maven2/io/dropwizard/metrics/metrics-parent/3.1.2/metrics-parent-3.1.2.pom
2017-06-20\T\06:07:28.625 [INFO] Downloaded: https://repo.maven.apache.org/maven2/io/dropwizard/metrics/metrics-parent/3.1.2/metrics-parent-3.1.2.pom
(12 KB at 450.8 KB/sec)
2017-06-20\T\06:07:28.628 [INFO] Downloading: https://repo.maven.apache.org/maven2/com/github/jnr/jnr-ffi/2.0.7/jnr-ffi-2.0.7.pom
2017-06-20\T\06:07:28.656 [INFO] Downloaded: https://repo.maven.apache.org/maven2/com/github/jnr/jnr-ffi/2.0.7/jnr-ffi-2.0.7.pom
(9 KB at 292.2 KB/sec)
2017-06-20\T\06:07:28.659 [INFO] Downloading: https://repo.maven.apache.org/maven2/com/github/jnr/jffi/1.2.10/jffi-1.2.10.pom
2017-06-20\T\06:07:28.688 [INFO] Downloaded: https://repo.maven.apache.org/maven2/com/github/jnr/jffi/1.2.10/jffi-1.2.10.pom
(8 KB at 259.5 KB/sec)
2017-06-20\T\06:07:28.691 [INFO] Downloading: https://repo.maven.apache.org/maven2/org/ow2/asm/asm/5.0.3/asm-5.0.3.pom
2017-06-20\T\06:07:28.717 [INFO] Downloaded: https://repo.maven.apache.org/maven2/org/ow2/asm/asm/5.0.3/asm-5.0.3.pom
(2 KB at 72.7 KB/sec)
2017-06-20\T\06:07:28.718 [INFO] Downloading: https://repo.maven.apache.org/maven2/org/ow2/asm/asm-parent/5.0.3/asm-parent-5.0.3.pom
2017-06-20\T\06:07:28.755 [INFO] Downloaded: https://repo.maven.apache.org/maven2/org/ow2/asm/asm-parent/5.0.3/asm-parent-5.0.3.pom
(6 KB at 145.0 KB/sec)
2017-06-20\T\06:07:28.757 [INFO] Downloading: https://repo.maven.apache.org/maven2/org/ow2/asm/asm-commons/5.0.3/asm-commons-5.0.3.pom
2017-06-20\T\06:07:28.794 [INFO] Downloaded: https://repo.maven.apache.org/maven2/org/ow2/asm/asm-commons/5.0.3/asm-commons-5.0.3.pom
(3 KB at 55.3 KB/sec)
2017-06-20\T\06:07:28.796 [INFO] Downloading: https://repo.maven.apache.org/maven2/org/ow2/asm/asm-tree/5.0.3/asm-tree-5.0.3.pom
2017-06-20\T\06:07:28.829 [INFO] Downloaded: https://repo.maven.apache.org/maven2/org/ow2/asm/asm-tree/5.0.3/asm-tree-5.0.3.pom
(3 KB at 61.6 KB/sec)
2017-06-20\T\06:07:28.831 [INFO] Downloading: https://repo.maven.apache.org/maven2/org/ow2/asm/asm-analysis/5.0.3/asm-analysis-5.0.3.pom
2017-06-20\T\06:07:28.858 [INFO] Downloaded: https://repo.maven.apache.org/maven2/org/ow2/asm/asm-analysis/5.0.3/asm-analysis-5.0.3.pom
(3 KB at 75.8 KB/sec)
2017-06-20\T\06:07:28.861 [INFO] Downloading: https://repo.maven.apache.org/maven2/org/ow2/asm/asm-util/5.0.3/asm-util-5.0.3.pom
2017-06-20\T\06:07:28.887 [INFO] Downloaded: https://repo.maven.apache.org/maven2/org/ow2/asm/asm-util/5.0.3/asm-util-5.0.3.pom
(3 KB at 78.4 KB/sec)
2017-06-20\T\06:07:28.889 [INFO] Downloading: https://repo.maven.apache.org/maven2/com/github/jnr/jnr-x86asm/1.0.2/jnr-x86asm-1.0.2.pom
2017-06-20\T\06:07:28.915 [INFO] Downloaded: https://repo.maven.apache.org/maven2/com/github/jnr/jnr-x86asm/1.0.2/jnr-x86asm-1.0.2.pom
(2 KB at 61.8 KB/sec)
2017-06-20\T\06:07:28.917 [INFO] Downloading: https://repo.maven.apache.org/maven2/com/github/jnr/jnr-posix/3.0.27/jnr-posix-3.0.27.pom
2017-06-20\T\06:07:28.944 [INFO] Downloaded: https://repo.maven.apache.org/maven2/com/github/jnr/jnr-posix/3.0.27/jnr-posix-3.0.27.pom
(6 KB at 212.3 KB/sec)
2017-06-20\T\06:07:28.946 [INFO] Downloading: https://repo.maven.apache.org/maven2/com/github/jnr/jnr-constants/0.9.0/jnr-constants-0.9.0.pom
2017-06-20\T\06:07:28.974 [INFO] Downloaded: https://repo.maven.apache.org/maven2/com/github/jnr/jnr-constants/0.9.0/jnr-constants-0.9.0.pom
(3 KB at 74.0 KB/sec)
2017-06-20\T\06:07:28.980 [INFO] ------------------------------------------------------------------------
2017-06-20\T\06:07:28.980 [INFO] Reactor Summary:
2017-06-20\T\06:07:28.980 [INFO] 
2017-06-20\T\06:07:28.980 [INFO] Apache Beam :: Parent .............................. SUCCESS
[ 20.310 s]
2017-06-20\T\06:07:28.980 [INFO] Apache Beam :: SDKs :: Java :: Build Tools ......... SUCCESS
[  8.088 s]
2017-06-20\T\06:07:28.980 [INFO] Apache Beam :: SDKs ................................ SUCCESS
[  1.226 s]
2017-06-20\T\06:07:28.980 [INFO] Apache Beam :: SDKs :: Common ...................... SUCCESS
[  0.403 s]
2017-06-20\T\06:07:28.980 [INFO] Apache Beam :: SDKs :: Common :: Runner API ........ SUCCESS
[  7.347 s]
2017-06-20\T\06:07:28.980 [INFO] Apache Beam :: SDKs :: Common :: Fn API ............ SUCCESS
[  7.744 s]
2017-06-20\T\06:07:28.980 [INFO] Apache Beam :: SDKs :: Java ........................ SUCCESS
[  0.927 s]
2017-06-20\T\06:07:28.980 [INFO] Apache Beam :: SDKs :: Java :: Core ................ SUCCESS
[01:26 min]
2017-06-20\T\06:07:28.980 [INFO] Apache Beam :: Runners ............................. SUCCESS
[  0.562 s]
2017-06-20\T\06:07:28.980 [INFO] Apache Beam :: Runners :: Core Construction Java ... SUCCESS
[ 13.814 s]
2017-06-20\T\06:07:28.980 [INFO] Apache Beam :: Runners :: Core Java ................ SUCCESS
[ 24.810 s]
2017-06-20\T\06:07:28.980 [INFO] Apache Beam :: Runners :: Direct Java .............. SUCCESS
[03:51 min]
2017-06-20\T\06:07:28.980 [INFO] Apache Beam :: SDKs :: Java :: IO .................. SUCCESS
[  0.627 s]
2017-06-20\T\06:07:28.980 [INFO] Apache Beam :: SDKs :: Java :: IO :: Common ........ SUCCESS
[  3.601 s]
2017-06-20\T\06:07:28.980 [INFO] Apache Beam :: SDKs :: Java :: IO :: Cassandra ..... FAILURE
[  0.768 s]
2017-06-20\T\06:07:28.981 [INFO] Apache Beam :: SDKs :: Java :: IO :: Elasticsearch . SKIPPED
2017-06-20\T\06:07:28.981 [INFO] Apache Beam :: SDKs :: Java :: Extensions .......... SKIPPED
2017-06-20\T\06:07:28.981 [INFO] Apache Beam :: SDKs :: Java :: Extensions :: Google Cloud
Platform Core SKIPPED
2017-06-20\T\06:07:28.981 [INFO] Apache Beam :: SDKs :: Java :: Extensions :: Protobuf SKIPPED
2017-06-20\T\06:07:28.981 [INFO] Apache Beam :: SDKs :: Java :: IO :: Google Cloud Platform
SKIPPED
2017-06-20\T\06:07:28.981 [INFO] Apache Beam :: SDKs :: Java :: IO :: Hadoop Common . SKIPPED
2017-06-20\T\06:07:28.981 [INFO] Apache Beam :: SDKs :: Java :: IO :: Hadoop File System SKIPPED
2017-06-20\T\06:07:28.981 [INFO] Apache Beam :: SDKs :: Java :: IO :: Hadoop ........ SKIPPED
2017-06-20\T\06:07:28.981 [INFO] Apache Beam :: SDKs :: Java :: IO :: Hadoop :: input-format
SKIPPED
2017-06-20\T\06:07:28.981 [INFO] Apache Beam :: SDKs :: Java :: IO :: HBase ......... SKIPPED
2017-06-20\T\06:07:28.981 [INFO] Apache Beam :: SDKs :: Java :: IO :: HCatalog ...... SKIPPED
2017-06-20\T\06:07:28.981 [INFO] Apache Beam :: Runners :: Google Cloud Dataflow .... SKIPPED
2017-06-20\T\06:07:28.981 [INFO] Apache Beam :: SDKs :: Java :: IO :: JDBC .......... SKIPPED
2017-06-20\T\06:07:28.981 [INFO] Apache Beam :: SDKs :: Java :: IO :: JMS ........... SKIPPED
2017-06-20\T\06:07:28.981 [INFO] Apache Beam :: SDKs :: Java :: IO :: Kafka ......... SKIPPED
2017-06-20\T\06:07:28.981 [INFO] Apache Beam :: SDKs :: Java :: IO :: Kinesis ....... SKIPPED
2017-06-20\T\06:07:28.981 [INFO] Apache Beam :: SDKs :: Java :: IO :: MongoDB ....... SKIPPED
2017-06-20\T\06:07:28.981 [INFO] Apache Beam :: SDKs :: Java :: IO :: MQTT .......... SKIPPED
2017-06-20\T\06:07:28.981 [INFO] Apache Beam :: SDKs :: Java :: IO :: XML ........... SKIPPED
2017-06-20\T\06:07:28.981 [INFO] Apache Beam :: SDKs :: Java :: Maven Archetypes .... SKIPPED
2017-06-20\T\06:07:28.981 [INFO] Apache Beam :: SDKs :: Java :: Maven Archetypes :: Starter
SKIPPED
2017-06-20\T\06:07:28.981 [INFO] Apache Beam :: Examples ............................ SKIPPED
2017-06-20\T\06:07:28.981 [INFO] Apache Beam :: Examples :: Java .................... SKIPPED
2017-06-20\T\06:07:28.981 [INFO] Apache Beam :: SDKs :: Java :: Maven Archetypes :: Examples
SKIPPED
2017-06-20\T\06:07:28.981 [INFO] Apache Beam :: SDKs :: Java :: Extensions :: Jackson SKIPPED
2017-06-20\T\06:07:28.981 [INFO] Apache Beam :: SDKs :: Java :: Extensions :: Join library
SKIPPED
2017-06-20\T\06:07:28.981 [INFO] Apache Beam :: SDKs :: Java :: Extensions :: Sorter  SKIPPED
2017-06-20\T\06:07:28.981 [INFO] Apache Beam :: Runners :: Flink .................... SKIPPED
2017-06-20\T\06:07:28.981 [INFO] Apache Beam :: Runners :: Spark .................... SKIPPED
2017-06-20\T\06:07:28.981 [INFO] Apache Beam :: SDKs :: Java :: Aggregated Javadoc .. SKIPPED
2017-06-20\T\06:07:28.981 [INFO] ------------------------------------------------------------------------
2017-06-20\T\06:07:28.981 [INFO] BUILD FAILURE
2017-06-20\T\06:07:28.981 [INFO] ------------------------------------------------------------------------
2017-06-20\T\06:07:28.981 [INFO] Total time: 06:53 min
2017-06-20\T\06:07:28.981 [INFO] Finished at: 2017-06-20T06:07:28+00:00
2017-06-20\T\06:07:29.735 [INFO] Final Memory: 116M/1458M
2017-06-20\T\06:07:29.735 [INFO] ------------------------------------------------------------------------
2017-06-20\T\06:07:29.737 [ERROR] Failed to execute goal on project beam-sdks-java-io-cassandra:
Could not resolve dependencies for project org.apache.beam:beam-sdks-java-io-cassandra:jar:2.1.0-SNAPSHOT:
Failed to collect dependencies at com.datastax.cassandra:cassandra-driver-mapping:jar:3.2.0:
Failed to read artifact descriptor for com.datastax.cassandra:cassandra-driver-mapping:jar:3.2.0:
Could not transfer artifact com.datastax.cassandra:cassandra-driver-mapping:pom:3.2.0 from/to
central (https://repo.maven.apache.org/maven2): Connection reset -> [Help 1]
org.apache.maven.lifecycle.LifecycleExecutionException: Failed to execute goal on project
beam-sdks-java-io-cassandra: Could not resolve dependencies for project org.apache.beam:beam-sdks-java-io-cassandra:jar:2.1.0-SNAPSHOT:
Failed to collect dependencies at com.datastax.cassandra:cassandra-driver-mapping:jar:3.2.0
	at org.apache.maven.lifecycle.internal.LifecycleDependencyResolver.getDependencies(LifecycleDependencyResolver.java:221)
	at org.apache.maven.lifecycle.internal.LifecycleDependencyResolver.resolveProjectDependencies(LifecycleDependencyResolver.java:127)
	at org.apache.maven.lifecycle.internal.MojoExecutor.ensureDependenciesAreResolved(MojoExecutor.java:257)
	at org.apache.maven.lifecycle.internal.MojoExecutor.execute(MojoExecutor.java:200)
	at org.apache.maven.lifecycle.internal.MojoExecutor.execute(MojoExecutor.java:153)
	at org.apache.maven.lifecycle.internal.MojoExecutor.execute(MojoExecutor.java:145)
	at org.apache.maven.lifecycle.internal.LifecycleModuleBuilder.buildProject(LifecycleModuleBuilder.java:116)
	at org.apache.maven.lifecycle.internal.LifecycleModuleBuilder.buildProject(LifecycleModuleBuilder.java:80)
	at org.apache.maven.lifecycle.internal.builder.singlethreaded.SingleThreadedBuilder.build(SingleThreadedBuilder.java:51)
	at org.apache.maven.lifecycle.internal.LifecycleStarter.execute(LifecycleStarter.java:128)
	at org.apache.maven.DefaultMaven.doExecute(DefaultMaven.java:307)
	at org.apache.maven.DefaultMaven.doExecute(DefaultMaven.java:193)
	at org.apache.maven.DefaultMaven.execute(DefaultMaven.java:106)
	at org.apache.maven.cli.MavenCli.execute(MavenCli.java:862)
	at org.apache.maven.cli.MavenCli.doMain(MavenCli.java:286)
	at org.apache.maven.cli.MavenCli.main(MavenCli.java:197)
	at sun.reflect.NativeMethodAccessorImpl.invoke0(Native Method)
	at sun.reflect.NativeMethodAccessorImpl.invoke(NativeMethodAccessorImpl.java:57)
	at sun.reflect.DelegatingMethodAccessorImpl.invoke(DelegatingMethodAccessorImpl.java:43)
	at java.lang.reflect.Method.invoke(Method.java:606)
	at org.codehaus.plexus.classworlds.launcher.Launcher.launchEnhanced(Launcher.java:289)
	at org.codehaus.plexus.classworlds.launcher.Launcher.launch(Launcher.java:229)
	at org.codehaus.plexus.classworlds.launcher.Launcher.mainWithExitCode(Launcher.java:415)
	at org.codehaus.plexus.classworlds.launcher.Launcher.main(Launcher.java:356)
Caused by: org.apache.maven.project.DependencyResolutionException: Could not resolve dependencies
for project org.apache.beam:beam-sdks-java-io-cassandra:jar:2.1.0-SNAPSHOT: Failed to collect
dependencies at com.datastax.cassandra:cassandra-driver-mapping:jar:3.2.0
	at org.apache.maven.project.DefaultProjectDependenciesResolver.resolve(DefaultProjectDependenciesResolver.java:180)
	at org.apache.maven.lifecycle.internal.LifecycleDependencyResolver.getDependencies(LifecycleDependencyResolver.java:195)
	... 23 more
Caused by: org.eclipse.aether.collection.DependencyCollectionException: Failed to collect
dependencies at com.datastax.cassandra:cassandra-driver-mapping:jar:3.2.0
	at org.eclipse.aether.internal.impl.DefaultDependencyCollector.collectDependencies(DefaultDependencyCollector.java:291)
	at org.eclipse.aether.internal.impl.DefaultRepositorySystem.collectDependencies(DefaultRepositorySystem.java:316)
	at org.apache.maven.project.DefaultProjectDependenciesResolver.resolve(DefaultProjectDependenciesResolver.java:172)
	... 24 more
Caused by: org.eclipse.aether.resolution.ArtifactDescriptorException: Failed to read artifact
descriptor for com.datastax.cassandra:cassandra-driver-mapping:jar:3.2.0
	at org.apache.maven.repository.internal.DefaultArtifactDescriptorReader.loadPom(DefaultArtifactDescriptorReader.java:302)
	at org.apache.maven.repository.internal.DefaultArtifactDescriptorReader.readArtifactDescriptor(DefaultArtifactDescriptorReader.java:218)
	at org.eclipse.aether.internal.impl.DefaultDependencyCollector.resolveCachedArtifactDescriptor(DefaultDependencyCollector.java:535)
	at org.eclipse.aether.internal.impl.DefaultDependencyCollector.getArtifactDescriptorResult(DefaultDependencyCollector.java:519)
	at org.eclipse.aether.internal.impl.DefaultDependencyCollector.processDependency(DefaultDependencyCollector.java:409)
	at org.eclipse.aether.internal.impl.DefaultDependencyCollector.processDependency(DefaultDependencyCollector.java:363)
	at org.eclipse.aether.internal.impl.DefaultDependencyCollector.process(DefaultDependencyCollector.java:351)
	at org.eclipse.aether.internal.impl.DefaultDependencyCollector.collectDependencies(DefaultDependencyCollector.java:254)
	... 26 more
Caused by: org.eclipse.aether.resolution.ArtifactResolutionException: Could not transfer artifact
com.datastax.cassandra:cassandra-driver-mapping:pom:3.2.0 from/to central (https://repo.maven.apache.org/maven2):
Connection reset
	at org.eclipse.aether.internal.impl.DefaultArtifactResolver.resolve(DefaultArtifactResolver.java:444)
	at org.eclipse.aether.internal.impl.DefaultArtifactResolver.resolveArtifacts(DefaultArtifactResolver.java:246)
	at org.eclipse.aether.internal.impl.DefaultArtifactResolver.resolveArtifact(DefaultArtifactResolver.java:223)
	at org.apache.maven.repository.internal.DefaultArtifactDescriptorReader.loadPom(DefaultArtifactDescriptorReader.java:287)
	... 33 more
Caused by: org.eclipse.aether.transfer.ArtifactTransferException: Could not transfer artifact
com.datastax.cassandra:cassandra-driver-mapping:pom:3.2.0 from/to central (https://repo.maven.apache.org/maven2):
Connection reset
	at org.eclipse.aether.connector.basic.ArtifactTransportListener.transferFailed(ArtifactTransportListener.java:43)
	at org.eclipse.aether.connector.basic.BasicRepositoryConnector$TaskRunner.run(BasicRepositoryConnector.java:355)
	at org.eclipse.aether.util.concurrency.RunnableErrorForwarder$1.run(RunnableErrorForwarder.java:67)
	at org.eclipse.aether.connector.basic.BasicRepositoryConnector$DirectExecutor.execute(BasicRepositoryConnector.java:581)
	at org.eclipse.aether.connector.basic.BasicRepositoryConnector.get(BasicRepositoryConnector.java:249)
	at org.eclipse.aether.internal.impl.DefaultArtifactResolver.performDownloads(DefaultArtifactResolver.java:520)
	at org.eclipse.aether.internal.impl.DefaultArtifactResolver.resolve(DefaultArtifactResolver.java:421)
	... 36 more
Caused by: org.apache.maven.wagon.TransferFailedException: Connection reset
	at org.apache.maven.wagon.providers.http.AbstractHttpClientWagon.fillInputData(AbstractHttpClientWagon.java:1066)
	at org.apache.maven.wagon.providers.http.AbstractHttpClientWagon.fillInputData(AbstractHttpClientWagon.java:960)
	at org.apache.maven.wagon.StreamWagon.getInputStream(StreamWagon.java:116)
	at org.apache.maven.wagon.StreamWagon.getIfNewer(StreamWagon.java:88)
	at org.apache.maven.wagon.StreamWagon.get(StreamWagon.java:61)
	at org.eclipse.aether.transport.wagon.WagonTransporter$GetTaskRunner.run(WagonTransporter.java:560)
	at org.eclipse.aether.transport.wagon.WagonTransporter.execute(WagonTransporter.java:427)
	at org.eclipse.aether.transport.wagon.WagonTransporter.get(WagonTransporter.java:404)
	at org.eclipse.aether.connector.basic.BasicRepositoryConnector$GetTaskRunner.runTask(BasicRepositoryConnector.java:447)
	at org.eclipse.aether.connector.basic.BasicRepositoryConnector$TaskRunner.run(BasicRepositoryConnector.java:350)
	... 41 more
Caused by: java.net.SocketException: Connection reset
	at java.net.SocketInputStream.read(SocketInputStream.java:197)
	at java.net.SocketInputStream.read(SocketInputStream.java:122)
	at sun.security.ssl.InputRecord.readFully(InputRecord.java:442)
	at sun.security.ssl.InputRecord.read(InputRecord.java:480)
	at sun.security.ssl.SSLSocketImpl.readRecord(SSLSocketImpl.java:944)
	at sun.security.ssl.SSLSocketImpl.readDataRecord(SSLSocketImpl.java:901)
	at sun.security.ssl.AppInputStream.read(AppInputStream.java:102)
	at org.apache.maven.wagon.providers.http.httpclient.impl.io.SessionInputBufferImpl.streamRead(SessionInputBufferImpl.java:136)
	at org.apache.maven.wagon.providers.http.httpclient.impl.io.SessionInputBufferImpl.fillBuffer(SessionInputBufferImpl.java:152)
	at org.apache.maven.wagon.providers.http.httpclient.impl.io.SessionInputBufferImpl.readLine(SessionInputBufferImpl.java:270)
	at org.apache.maven.wagon.providers.http.httpclient.impl.conn.DefaultHttpResponseParser.parseHead(DefaultHttpResponseParser.java:140)
	at org.apache.maven.wagon.providers.http.httpclient.impl.conn.DefaultHttpResponseParser.parseHead(DefaultHttpResponseParser.java:57)
	at org.apache.maven.wagon.providers.http.httpclient.impl.io.AbstractMessageParser.parse(AbstractMessageParser.java:260)
	at org.apache.maven.wagon.providers.http.httpclient.impl.DefaultBHttpClientConnection.receiveResponseHeader(DefaultBHttpClientConnection.java:161)
	at org.apache.maven.wagon.providers.http.httpclient.impl.conn.CPoolProxy.receiveResponseHeader(CPoolProxy.java:153)
	at org.apache.maven.wagon.providers.http.httpclient.protocol.HttpRequestExecutor.doReceiveResponse(HttpRequestExecutor.java:271)
	at org.apache.maven.wagon.providers.http.httpclient.protocol.HttpRequestExecutor.execute(HttpRequestExecutor.java:123)
	at org.apache.maven.wagon.providers.http.httpclient.impl.execchain.MainClientExec.execute(MainClientExec.java:254)
	at org.apache.maven.wagon.providers.http.httpclient.impl.execchain.ProtocolExec.execute(ProtocolExec.java:195)
	at org.apache.maven.wagon.providers.http.httpclient.impl.execchain.RetryExec.execute(RetryExec.java:86)
	at org.apache.maven.wagon.providers.http.httpclient.impl.execchain.RedirectExec.execute(RedirectExec.java:108)
	at org.apache.maven.wagon.providers.http.httpclient.impl.client.InternalHttpClient.doExecute(InternalHttpClient.java:184)
	at org.apache.maven.wagon.providers.http.httpclient.impl.client.CloseableHttpClient.execute(CloseableHttpClient.java:82)
	at org.apache.maven.wagon.providers.http.AbstractHttpClientWagon.execute(AbstractHttpClientWagon.java:832)
	at org.apache.maven.wagon.providers.http.AbstractHttpClientWagon.fillInputData(AbstractHttpClientWagon.java:983)
	... 50 more
2017-06-20\T\06:07:29.739 [ERROR] 
2017-06-20\T\06:07:29.739 [ERROR] Re-run Maven using the -X switch to enable full debug logging.
2017-06-20\T\06:07:29.739 [ERROR] 
2017-06-20\T\06:07:29.739 [ERROR] For more information about the errors and possible solutions,
please read the following articles:
2017-06-20\T\06:07:29.739 [ERROR] [Help 1] http://cwiki.apache.org/confluence/display/MAVEN/DependencyResolutionException
2017-06-20\T\06:07:29.739 [ERROR] 
2017-06-20\T\06:07:29.739 [ERROR] After correcting the problems, you can resume the build
with the command
2017-06-20\T\06:07:29.739 [ERROR]   mvn <goals> -rf :beam-sdks-java-io-cassandra
Build step 'Invoke top-level Maven targets' marked build as failure

Mime
View raw message