beam-commits mailing list archives

Site index · List index
Message view « Date » · « Thread »
Top « Date » · « Thread »
From Apache Jenkins Server <jenk...@builds.apache.org>
Subject Build failed in Jenkins: beam_PostCommit_Java_MavenInstall_Windows #78
Date Thu, 01 Jun 2017 00:35:11 GMT
See <https://builds.apache.org/job/beam_PostCommit_Java_MavenInstall_Windows/78/display/redirect?page=changes>

Changes:

[dhalperi] Flink*DoFnFunction: fix check for single-output dofns

[dhalperi] Add RawUnion code to FlinkDoFnFunction

[jbonofre] [BEAM-2246] Use CLIENT_ACK instead of AUTO_ACK in JmsIO

------------------------------------------
[...truncated 2.53 MB...]
2017-06-01T00:32:52.397 [INFO] 
2017-06-01T00:32:52.397 [INFO] --- groovy-maven-plugin:2.0:execute (find-supported-python-for-clean)
@ beam-sdks-python ---
2017-06-01T00:32:52.403 [INFO] Downloading: https://repo.maven.apache.org/maven2/org/sonatype/gossip/gossip-slf4j/1.8/gossip-slf4j-1.8.pom
2017-06-01T00:32:52.415 [INFO] Downloaded: https://repo.maven.apache.org/maven2/org/sonatype/gossip/gossip-slf4j/1.8/gossip-slf4j-1.8.pom
(2 KB at 120.6 KB/sec)
2017-06-01T00:32:52.418 [INFO] Downloading: https://repo.maven.apache.org/maven2/org/sonatype/gossip/gossip/1.8/gossip-1.8.pom
2017-06-01T00:32:52.431 [INFO] Downloaded: https://repo.maven.apache.org/maven2/org/sonatype/gossip/gossip/1.8/gossip-1.8.pom
(12 KB at 865.8 KB/sec)
2017-06-01T00:32:52.436 [INFO] Downloading: https://repo.maven.apache.org/maven2/org/sonatype/forge/forge-parent/9/forge-parent-9.pom
2017-06-01T00:32:52.446 [INFO] Downloaded: https://repo.maven.apache.org/maven2/org/sonatype/forge/forge-parent/9/forge-parent-9.pom
(13 KB at 1283.4 KB/sec)
2017-06-01T00:32:52.452 [INFO] Downloading: https://repo.maven.apache.org/maven2/org/sonatype/gossip/gossip-core/1.8/gossip-core-1.8.pom
2017-06-01T00:32:52.464 [INFO] Downloaded: https://repo.maven.apache.org/maven2/org/sonatype/gossip/gossip-core/1.8/gossip-core-1.8.pom
(3 KB at 181.1 KB/sec)
2017-06-01T00:32:52.468 [INFO] Downloading: https://repo.maven.apache.org/maven2/org/sonatype/gossip/gossip-bootstrap/1.8/gossip-bootstrap-1.8.pom
2017-06-01T00:32:52.477 [INFO] Downloaded: https://repo.maven.apache.org/maven2/org/sonatype/gossip/gossip-bootstrap/1.8/gossip-bootstrap-1.8.pom
(2 KB at 174.8 KB/sec)
2017-06-01T00:32:52.481 [INFO] Downloading: https://repo.maven.apache.org/maven2/com/google/guava/guava/14.0.1/guava-14.0.1.pom
2017-06-01T00:32:52.491 [INFO] Downloaded: https://repo.maven.apache.org/maven2/com/google/guava/guava/14.0.1/guava-14.0.1.pom
(6 KB at 525.0 KB/sec)
2017-06-01T00:32:52.495 [INFO] Downloading: https://repo.maven.apache.org/maven2/com/google/guava/guava-parent/14.0.1/guava-parent-14.0.1.pom
2017-06-01T00:32:52.506 [INFO] Downloaded: https://repo.maven.apache.org/maven2/com/google/guava/guava-parent/14.0.1/guava-parent-14.0.1.pom
(3 KB at 226.8 KB/sec)
2017-06-01T00:32:52.510 [INFO] Downloading: https://repo.maven.apache.org/maven2/org/codehaus/plexus/plexus-classworlds/2.4.2/plexus-classworlds-2.4.2.pom
2017-06-01T00:32:52.522 [INFO] Downloaded: https://repo.maven.apache.org/maven2/org/codehaus/plexus/plexus-classworlds/2.4.2/plexus-classworlds-2.4.2.pom
(4 KB at 285.6 KB/sec)
2017-06-01T00:32:52.526 [INFO] Downloading: https://repo.maven.apache.org/maven2/org/codehaus/plexus/plexus-interpolation/1.16/plexus-interpolation-1.16.pom
2017-06-01T00:32:52.536 [INFO] Downloaded: https://repo.maven.apache.org/maven2/org/codehaus/plexus/plexus-interpolation/1.16/plexus-interpolation-1.16.pom
(2 KB at 100.3 KB/sec)
2017-06-01T00:32:52.540 [INFO] Downloading: https://repo.maven.apache.org/maven2/org/eclipse/aether/aether-api/0.9.0.M2/aether-api-0.9.0.M2.pom
2017-06-01T00:32:52.550 [INFO] Downloaded: https://repo.maven.apache.org/maven2/org/eclipse/aether/aether-api/0.9.0.M2/aether-api-0.9.0.M2.pom
(2 KB at 169.6 KB/sec)
2017-06-01T00:32:52.557 [INFO] Downloading: https://repo.maven.apache.org/maven2/org/codehaus/gmaven/gmaven-adapter-api/2.0/gmaven-adapter-api-2.0.pom
2017-06-01T00:32:52.566 [INFO] Downloaded: https://repo.maven.apache.org/maven2/org/codehaus/gmaven/gmaven-adapter-api/2.0/gmaven-adapter-api-2.0.pom
(2 KB at 196.0 KB/sec)
2017-06-01T00:32:52.570 [INFO] Downloading: https://repo.maven.apache.org/maven2/org/codehaus/gmaven/gmaven-adapter-impl/2.0/gmaven-adapter-impl-2.0.pom
2017-06-01T00:32:52.582 [INFO] Downloaded: https://repo.maven.apache.org/maven2/org/codehaus/gmaven/gmaven-adapter-impl/2.0/gmaven-adapter-impl-2.0.pom
(3 KB at 221.2 KB/sec)
2017-06-01T00:32:52.586 [INFO] Downloading: https://repo.maven.apache.org/maven2/org/codehaus/groovy/groovy-all/2.1.5/groovy-all-2.1.5.pom
2017-06-01T00:32:52.598 [INFO] Downloaded: https://repo.maven.apache.org/maven2/org/codehaus/groovy/groovy-all/2.1.5/groovy-all-2.1.5.pom
(18 KB at 1468.0 KB/sec)
2017-06-01T00:32:52.603 [INFO] Downloading: https://repo.maven.apache.org/maven2/org/apache/ant/ant/1.8.4/ant-1.8.4.pom
2017-06-01T00:32:52.615 [INFO] Downloaded: https://repo.maven.apache.org/maven2/org/apache/ant/ant/1.8.4/ant-1.8.4.pom
(10 KB at 785.6 KB/sec)
2017-06-01T00:32:52.620 [INFO] Downloading: https://repo.maven.apache.org/maven2/org/apache/ant/ant-parent/1.8.4/ant-parent-1.8.4.pom
2017-06-01T00:32:52.632 [INFO] Downloaded: https://repo.maven.apache.org/maven2/org/apache/ant/ant-parent/1.8.4/ant-parent-1.8.4.pom
(5 KB at 371.2 KB/sec)
2017-06-01T00:32:52.636 [INFO] Downloading: https://repo.maven.apache.org/maven2/org/apache/ant/ant-launcher/1.8.4/ant-launcher-1.8.4.pom
2017-06-01T00:32:52.645 [INFO] Downloaded: https://repo.maven.apache.org/maven2/org/apache/ant/ant-launcher/1.8.4/ant-launcher-1.8.4.pom
(3 KB at 256.2 KB/sec)
2017-06-01T00:32:52.648 [INFO] Downloading: https://repo.maven.apache.org/maven2/org/fusesource/jansi/jansi/1.11/jansi-1.11.pom
2017-06-01T00:32:52.667 [INFO] Downloaded: https://repo.maven.apache.org/maven2/org/fusesource/jansi/jansi/1.11/jansi-1.11.pom
(4 KB at 185.1 KB/sec)
2017-06-01T00:32:52.671 [INFO] Downloading: https://repo.maven.apache.org/maven2/org/fusesource/jansi/jansi-project/1.11/jansi-project-1.11.pom
2017-06-01T00:32:52.682 [INFO] Downloaded: https://repo.maven.apache.org/maven2/org/fusesource/jansi/jansi-project/1.11/jansi-project-1.11.pom
(12 KB at 1016.2 KB/sec)
2017-06-01T00:32:52.686 [INFO] Downloading: https://repo.maven.apache.org/maven2/org/fusesource/fusesource-pom/1.8/fusesource-pom-1.8.pom
2017-06-01T00:32:52.696 [INFO] Downloaded: https://repo.maven.apache.org/maven2/org/fusesource/fusesource-pom/1.8/fusesource-pom-1.8.pom
(15 KB at 1431.2 KB/sec)
2017-06-01T00:32:52.709 [INFO] Downloading: https://repo.maven.apache.org/maven2/org/sonatype/gossip/gossip-slf4j/1.8/gossip-slf4j-1.8.jar
2017-06-01T00:32:52.710 [INFO] Downloading: https://repo.maven.apache.org/maven2/org/sonatype/gossip/gossip-core/1.8/gossip-core-1.8.jar
2017-06-01T00:32:52.711 [INFO] Downloading: https://repo.maven.apache.org/maven2/org/codehaus/plexus/plexus-classworlds/2.4.2/plexus-classworlds-2.4.2.jar
2017-06-01T00:32:52.711 [INFO] Downloading: https://repo.maven.apache.org/maven2/com/google/guava/guava/14.0.1/guava-14.0.1.jar
2017-06-01T00:32:52.711 [INFO] Downloading: https://repo.maven.apache.org/maven2/org/sonatype/gossip/gossip-bootstrap/1.8/gossip-bootstrap-1.8.jar
2017-06-01T00:32:52.727 [INFO] Downloaded: https://repo.maven.apache.org/maven2/org/sonatype/gossip/gossip-slf4j/1.8/gossip-slf4j-1.8.jar
(5 KB at 229.3 KB/sec)
2017-06-01T00:32:52.727 [INFO] Downloading: https://repo.maven.apache.org/maven2/org/codehaus/plexus/plexus-interpolation/1.16/plexus-interpolation-1.16.jar
2017-06-01T00:32:52.733 [INFO] Downloaded: https://repo.maven.apache.org/maven2/org/sonatype/gossip/gossip-bootstrap/1.8/gossip-bootstrap-1.8.jar
(20 KB at 804.0 KB/sec)
2017-06-01T00:32:52.734 [INFO] Downloading: https://repo.maven.apache.org/maven2/org/eclipse/aether/aether-api/0.9.0.M2/aether-api-0.9.0.M2.jar
2017-06-01T00:32:52.735 [INFO] Downloaded: https://repo.maven.apache.org/maven2/org/sonatype/gossip/gossip-core/1.8/gossip-core-1.8.jar
(57 KB at 2171.5 KB/sec)
2017-06-01T00:32:52.735 [INFO] Downloading: https://repo.maven.apache.org/maven2/org/codehaus/gmaven/gmaven-adapter-api/2.0/gmaven-adapter-api-2.0.jar
2017-06-01T00:32:52.735 [INFO] Downloaded: https://repo.maven.apache.org/maven2/org/codehaus/plexus/plexus-classworlds/2.4.2/plexus-classworlds-2.4.2.jar
(46 KB at 1834.7 KB/sec)
2017-06-01T00:32:52.736 [INFO] Downloading: https://repo.maven.apache.org/maven2/org/codehaus/gmaven/gmaven-adapter-impl/2.0/gmaven-adapter-impl-2.0.jar
2017-06-01T00:32:52.747 [INFO] Downloaded: https://repo.maven.apache.org/maven2/org/codehaus/gmaven/gmaven-adapter-api/2.0/gmaven-adapter-api-2.0.jar
(7 KB at 186.8 KB/sec)
2017-06-01T00:32:52.747 [INFO] Downloading: https://repo.maven.apache.org/maven2/org/codehaus/groovy/groovy-all/2.1.5/groovy-all-2.1.5.jar
2017-06-01T00:32:52.748 [INFO] Downloaded: https://repo.maven.apache.org/maven2/org/codehaus/plexus/plexus-interpolation/1.16/plexus-interpolation-1.16.jar
(60 KB at 1575.6 KB/sec)
2017-06-01T00:32:52.748 [INFO] Downloading: https://repo.maven.apache.org/maven2/org/apache/ant/ant/1.8.4/ant-1.8.4.jar
2017-06-01T00:32:52.749 [INFO] Downloaded: https://repo.maven.apache.org/maven2/org/codehaus/gmaven/gmaven-adapter-impl/2.0/gmaven-adapter-impl-2.0.jar
(16 KB at 404.9 KB/sec)
2017-06-01T00:32:52.749 [INFO] Downloading: https://repo.maven.apache.org/maven2/org/apache/ant/ant-launcher/1.8.4/ant-launcher-1.8.4.jar
2017-06-01T00:32:52.769 [INFO] Downloaded: https://repo.maven.apache.org/maven2/org/eclipse/aether/aether-api/0.9.0.M2/aether-api-0.9.0.M2.jar
(131 KB at 2217.2 KB/sec)
2017-06-01T00:32:52.769 [INFO] Downloading: https://repo.maven.apache.org/maven2/org/fusesource/jansi/jansi/1.11/jansi-1.11.jar
2017-06-01T00:32:52.779 [INFO] Downloaded: https://repo.maven.apache.org/maven2/org/apache/ant/ant-launcher/1.8.4/ant-launcher-1.8.4.jar
(18 KB at 260.8 KB/sec)
2017-06-01T00:32:52.797 [INFO] Downloaded: https://repo.maven.apache.org/maven2/org/fusesource/jansi/jansi/1.11/jansi-1.11.jar
(112 KB at 1284.3 KB/sec)
2017-06-01T00:32:52.966 [INFO] Downloaded: https://repo.maven.apache.org/maven2/com/google/guava/guava/14.0.1/guava-14.0.1.jar
(2138 KB at 8350.8 KB/sec)
2017-06-01T00:32:52.973 [INFO] Downloaded: https://repo.maven.apache.org/maven2/org/apache/ant/ant/1.8.4/ant-1.8.4.jar
(1897 KB at 7210.0 KB/sec)
2017-06-01T00:32:53.378 [INFO] Downloaded: https://repo.maven.apache.org/maven2/org/codehaus/groovy/groovy-all/2.1.5/groovy-all-2.1.5.jar
(6219 KB at 9308.8 KB/sec)
[JENKINS] Archiving disabled
2017-06-01T00:32:56.706 [INFO]                                                           
             
2017-06-01T00:32:56.706 [INFO] ------------------------------------------------------------------------
2017-06-01T00:32:56.706 [INFO] Skipping Apache Beam :: Parent
2017-06-01T00:32:56.706 [INFO] This project has been banned from the build due to previous
failures.
2017-06-01T00:32:56.706 [INFO] ------------------------------------------------------------------------
[JENKINS] Archiving disabled
[JENKINS] Archiving disabled
[JENKINS] Archiving disabled
[JENKINS] Archiving disabled
[JENKINS] Archiving disabled
[JENKINS] Archiving disabled
[JENKINS] Archiving disabled
[JENKINS] Archiving disabled
[JENKINS] Archiving disabled
[JENKINS] Archiving disabled
[JENKINS] Archiving disabled
[JENKINS] Archiving disabled
[JENKINS] Archiving disabled
[JENKINS] Archiving disabled
[JENKINS] Archiving disabled
[JENKINS] Archiving disabled
[JENKINS] Archiving disabled
[JENKINS] Archiving disabled
[JENKINS] Archiving disabled
[JENKINS] Archiving disabled
[JENKINS] Archiving disabled
[JENKINS] Archiving disabled
[JENKINS] Archiving disabled
[JENKINS] Archiving disabled
[JENKINS] Archiving disabled
[JENKINS] Archiving disabled
[JENKINS] Archiving disabled
[JENKINS] Archiving disabled
[JENKINS] Archiving disabled
[JENKINS] Archiving disabled
[JENKINS] Archiving disabled
[JENKINS] Archiving disabled
[JENKINS] Archiving disabled
[JENKINS] Archiving disabled
[JENKINS] Archiving disabled
[JENKINS] Archiving disabled
[JENKINS] Archiving disabled
[JENKINS] Archiving disabled
[JENKINS] Archiving disabled
[JENKINS] Archiving disabled
[JENKINS] Archiving disabled
[JENKINS] Archiving disabled
[JENKINS] Archiving disabled
[JENKINS] Archiving disabled
[JENKINS] Archiving disabled
[JENKINS] Archiving disabled
[JENKINS] Archiving disabled
[JENKINS] Archiving disabled
2017-06-01T00:34:40.716 [INFO] ------------------------------------------------------------------------
2017-06-01T00:34:40.716 [INFO] Reactor Summary:
2017-06-01T00:34:40.716 [INFO] 
2017-06-01T00:34:40.717 [INFO] Apache Beam :: Parent .............................. SUCCESS
[ 41.250 s]
2017-06-01T00:34:40.717 [INFO] Apache Beam :: SDKs :: Java :: Build Tools ......... SUCCESS
[ 18.030 s]
2017-06-01T00:34:40.717 [INFO] Apache Beam :: SDKs ................................ SUCCESS
[  9.008 s]
2017-06-01T00:34:40.717 [INFO] Apache Beam :: SDKs :: Common ...................... SUCCESS
[  5.804 s]
2017-06-01T00:34:40.717 [INFO] Apache Beam :: SDKs :: Common :: Fn API ............ SUCCESS
[ 33.040 s]
2017-06-01T00:34:40.717 [INFO] Apache Beam :: SDKs :: Common :: Runner API ........ SUCCESS
[ 21.945 s]
2017-06-01T00:34:40.717 [INFO] Apache Beam :: SDKs :: Java ........................ SUCCESS
[  5.784 s]
2017-06-01T00:34:40.717 [INFO] Apache Beam :: SDKs :: Java :: Core ................ SUCCESS
[04:23 min]
2017-06-01T00:34:40.717 [INFO] Apache Beam :: SDKs :: Java :: IO .................. SUCCESS
[  5.781 s]
2017-06-01T00:34:40.717 [INFO] Apache Beam :: SDKs :: Java :: IO :: Common ........ SUCCESS
[  9.468 s]
2017-06-01T00:34:40.717 [INFO] Apache Beam :: Runners ............................. SUCCESS
[  5.703 s]
2017-06-01T00:34:40.717 [INFO] Apache Beam :: Runners :: Core Construction Java ... SUCCESS
[ 46.281 s]
2017-06-01T00:34:40.718 [INFO] Apache Beam :: Runners :: Core Java ................ SUCCESS
[01:09 min]
2017-06-01T00:34:40.718 [INFO] Apache Beam :: Runners :: Direct Java .............. SUCCESS
[03:24 min]
2017-06-01T00:34:40.718 [INFO] Apache Beam :: SDKs :: Java :: IO :: Elasticsearch . SUCCESS
[01:00 min]
2017-06-01T00:34:40.718 [INFO] Apache Beam :: SDKs :: Java :: Extensions .......... SUCCESS
[  5.857 s]
2017-06-01T00:34:40.718 [INFO] Apache Beam :: SDKs :: Java :: Extensions :: Google Cloud Platform
Core SUCCESS [01:04 min]
2017-06-01T00:34:40.718 [INFO] Apache Beam :: SDKs :: Java :: Extensions :: Protobuf SUCCESS
[ 32.652 s]
2017-06-01T00:34:40.718 [INFO] Apache Beam :: SDKs :: Java :: IO :: Google Cloud Platform
SUCCESS [01:35 min]
2017-06-01T00:34:40.718 [INFO] Apache Beam :: SDKs :: Java :: IO :: Hadoop Common . SUCCESS
[ 33.463 s]
2017-06-01T00:34:40.718 [INFO] Apache Beam :: SDKs :: Java :: IO :: Hadoop File System SUCCESS
[ 41.641 s]
2017-06-01T00:34:40.718 [INFO] Apache Beam :: SDKs :: Java :: IO :: Hadoop ........ SUCCESS
[ 11.451 s]
2017-06-01T00:34:40.718 [INFO] Apache Beam :: SDKs :: Java :: IO :: Hadoop :: input-format
SUCCESS [ 34.375 s]
2017-06-01T00:34:40.718 [INFO] Apache Beam :: SDKs :: Java :: IO :: Hadoop :: jdk1.8-tests
SUCCESS [01:49 min]
2017-06-01T00:34:40.718 [INFO] Apache Beam :: SDKs :: Java :: IO :: HBase ......... SUCCESS
[ 46.360 s]
2017-06-01T00:34:40.718 [INFO] Apache Beam :: SDKs :: Java :: IO :: JDBC .......... SUCCESS
[ 44.548 s]
2017-06-01T00:34:40.718 [INFO] Apache Beam :: SDKs :: Java :: IO :: JMS ........... SUCCESS
[ 37.864 s]
2017-06-01T00:34:40.718 [INFO] Apache Beam :: SDKs :: Java :: IO :: Kafka ......... SUCCESS
[ 43.852 s]
2017-06-01T00:34:40.718 [INFO] Apache Beam :: SDKs :: Java :: IO :: Kinesis ....... SUCCESS
[ 40.326 s]
2017-06-01T00:34:40.718 [INFO] Apache Beam :: SDKs :: Java :: IO :: MongoDB ....... SUCCESS
[ 47.468 s]
2017-06-01T00:34:40.718 [INFO] Apache Beam :: SDKs :: Java :: IO :: MQTT .......... SUCCESS
[ 32.266 s]
2017-06-01T00:34:40.719 [INFO] Apache Beam :: SDKs :: Java :: IO :: XML ........... SUCCESS
[ 30.453 s]
2017-06-01T00:34:40.719 [INFO] Apache Beam :: SDKs :: Java :: Maven Archetypes .... SUCCESS
[  5.359 s]
2017-06-01T00:34:40.719 [INFO] Apache Beam :: SDKs :: Java :: Maven Archetypes :: Starter
SUCCESS [ 26.921 s]
2017-06-01T00:34:40.719 [INFO] Apache Beam :: SDKs :: Java :: Extensions :: Jackson SUCCESS
[ 26.797 s]
2017-06-01T00:34:40.719 [INFO] Apache Beam :: SDKs :: Java :: Extensions :: Join library SUCCESS
[ 27.625 s]
2017-06-01T00:34:40.719 [INFO] Apache Beam :: SDKs :: Java :: Extensions :: Sorter  SUCCESS
[ 37.370 s]
2017-06-01T00:34:40.719 [INFO] Apache Beam :: Runners :: Google Cloud Dataflow .... SUCCESS
[ 52.391 s]
2017-06-01T00:34:40.719 [INFO] Apache Beam :: SDKs :: Java :: Harness ............. SUCCESS
[ 57.753 s]
2017-06-01T00:34:40.719 [INFO] Apache Beam :: SDKs :: Java :: Java 8 Tests ........ SUCCESS
[ 24.341 s]
2017-06-01T00:34:40.719 [INFO] Apache Beam :: SDKs :: Python ...................... FAILURE
[  3.445 s]
2017-06-01T00:34:40.719 [INFO] Apache Beam :: Runners :: Flink .................... SKIPPED
2017-06-01T00:34:40.719 [INFO] Apache Beam :: Runners :: Spark .................... SKIPPED
2017-06-01T00:34:40.719 [INFO] Apache Beam :: Runners :: Apex ..................... SKIPPED
2017-06-01T00:34:40.719 [INFO] Apache Beam :: Examples ............................ SKIPPED
2017-06-01T00:34:40.719 [INFO] Apache Beam :: Examples :: Java .................... SKIPPED
2017-06-01T00:34:40.719 [INFO] Apache Beam :: Examples :: Java 8 .................. SKIPPED
2017-06-01T00:34:40.719 [INFO] Apache Beam :: SDKs :: Java :: Aggregated Javadoc .. SKIPPED
2017-06-01T00:34:40.719 [INFO] ------------------------------------------------------------------------
2017-06-01T00:34:40.719 [INFO] BUILD FAILURE
2017-06-01T00:34:40.719 [INFO] ------------------------------------------------------------------------
2017-06-01T00:34:40.719 [INFO] Total time: 33:59 min
2017-06-01T00:34:40.720 [INFO] Finished at: 2017-06-01T00:34:40+00:00
2017-06-01T00:34:41.913 [INFO] Final Memory: 296M/3131M
2017-06-01T00:34:41.913 [INFO] ------------------------------------------------------------------------
Waiting for Jenkins to finish collecting data
2017-06-01T00:34:52.103 [ERROR] Failed to execute goal org.codehaus.gmaven:groovy-maven-plugin:2.0:execute
(find-supported-python-for-clean) on project beam-sdks-python: Unable to find Python 2.7 in
path -> [Help 1]
org.apache.maven.lifecycle.LifecycleExecutionException: Failed to execute goal org.codehaus.gmaven:groovy-maven-plugin:2.0:execute
(find-supported-python-for-clean) on project beam-sdks-python: Unable to find Python 2.7 in
path
	at org.apache.maven.lifecycle.internal.MojoExecutor.execute(MojoExecutor.java:212)
	at org.apache.maven.lifecycle.internal.MojoExecutor.execute(MojoExecutor.java:153)
	at org.apache.maven.lifecycle.internal.MojoExecutor.execute(MojoExecutor.java:145)
	at org.apache.maven.lifecycle.internal.LifecycleModuleBuilder.buildProject(LifecycleModuleBuilder.java:116)
	at org.apache.maven.lifecycle.internal.LifecycleModuleBuilder.buildProject(LifecycleModuleBuilder.java:80)
	at org.apache.maven.lifecycle.internal.builder.singlethreaded.SingleThreadedBuilder.build(SingleThreadedBuilder.java:51)
	at org.apache.maven.lifecycle.internal.LifecycleStarter.execute(LifecycleStarter.java:128)
	at org.apache.maven.DefaultMaven.doExecute(DefaultMaven.java:307)
	at org.apache.maven.DefaultMaven.doExecute(DefaultMaven.java:193)
	at org.apache.maven.DefaultMaven.execute(DefaultMaven.java:106)
	at org.jvnet.hudson.maven3.launcher.Maven33Launcher.main(Maven33Launcher.java:129)
	at sun.reflect.NativeMethodAccessorImpl.invoke0(Native Method)
	at sun.reflect.NativeMethodAccessorImpl.invoke(NativeMethodAccessorImpl.java:62)
	at sun.reflect.DelegatingMethodAccessorImpl.invoke(DelegatingMethodAccessorImpl.java:43)
	at java.lang.reflect.Method.invoke(Method.java:498)
	at org.codehaus.plexus.classworlds.launcher.Launcher.launchStandard(Launcher.java:330)
	at org.codehaus.plexus.classworlds.launcher.Launcher.launch(Launcher.java:238)
	at jenkins.maven3.agent.Maven33Main.launch(Maven33Main.java:176)
	at sun.reflect.NativeMethodAccessorImpl.invoke0(Native Method)
	at sun.reflect.NativeMethodAccessorImpl.invoke(NativeMethodAccessorImpl.java:62)
	at sun.reflect.DelegatingMethodAccessorImpl.invoke(DelegatingMethodAccessorImpl.java:43)
	at java.lang.reflect.Method.invoke(Method.java:498)
	at hudson.maven.Maven3Builder.call(Maven3Builder.java:139)
	at hudson.maven.Maven3Builder.call(Maven3Builder.java:70)
	at hudson.remoting.UserRequest.perform(UserRequest.java:120)
	at hudson.remoting.UserRequest.perform(UserRequest.java:48)
	at hudson.remoting.Request$2.run(Request.java:326)
	at hudson.remoting.InterceptingExecutorService$1.call(InterceptingExecutorService.java:68)
	at java.util.concurrent.FutureTask.run(FutureTask.java:266)
	at java.util.concurrent.ThreadPoolExecutor.runWorker(ThreadPoolExecutor.java:1142)
	at java.util.concurrent.ThreadPoolExecutor$Worker.run(ThreadPoolExecutor.java:617)
	at java.lang.Thread.run(Thread.java:745)
Caused by: org.apache.maven.plugin.MojoFailureException: Unable to find Python 2.7 in path
	at sun.reflect.NativeConstructorAccessorImpl.newInstance0(Native Method)
	at sun.reflect.NativeConstructorAccessorImpl.newInstance(NativeConstructorAccessorImpl.java:62)
	at sun.reflect.DelegatingConstructorAccessorImpl.newInstance(DelegatingConstructorAccessorImpl.java:45)
	at java.lang.reflect.Constructor.newInstance(Constructor.java:423)
	at org.codehaus.groovy.reflection.CachedConstructor.invoke(CachedConstructor.java:77)
	at org.codehaus.groovy.runtime.callsite.ConstructorSite$ConstructorSiteNoUnwrapNoCoerce.callConstructor(ConstructorSite.java:102)
	at org.codehaus.groovy.runtime.callsite.CallSiteArray.defaultCallConstructor(CallSiteArray.java:57)
	at org.codehaus.groovy.runtime.callsite.AbstractCallSite.callConstructor(AbstractCallSite.java:182)
	at org.codehaus.groovy.runtime.callsite.AbstractCallSite.callConstructor(AbstractCallSite.java:190)
	at findSupportedPython.run(findSupportedPython.groovy:70)
	at groovy.lang.GroovyShell.evaluate(GroovyShell.java:518)
	at org.codehaus.gmaven.adapter.impl.ScriptExecutorImpl.execute(ScriptExecutorImpl.java:80)
	at org.codehaus.gmaven.plugin.ExecuteMojo$1.run(ExecuteMojo.java:100)
	at org.codehaus.gmaven.plugin.util.SystemNoExitGuard.run(SystemNoExitGuard.java:45)
	at org.codehaus.gmaven.plugin.ExecuteMojo.run(ExecuteMojo.java:96)
	at org.codehaus.gmaven.plugin.MojoSupport.execute(MojoSupport.java:45)
	at org.apache.maven.plugin.DefaultBuildPluginManager.executeMojo(DefaultBuildPluginManager.java:134)
	at org.apache.maven.lifecycle.internal.MojoExecutor.execute(MojoExecutor.java:208)
	... 31 more
2017-06-01T00:34:52.105 [ERROR] 
2017-06-01T00:34:52.105 [ERROR] Re-run Maven using the -X switch to enable full debug logging.
2017-06-01T00:34:52.105 [ERROR] 
2017-06-01T00:34:52.105 [ERROR] For more information about the errors and possible solutions,
please read the following articles:
2017-06-01T00:34:52.105 [ERROR] [Help 1] http://cwiki.apache.org/confluence/display/MAVEN/MojoFailureException
2017-06-01T00:34:52.106 [ERROR] 
2017-06-01T00:34:52.106 [ERROR] After correcting the problems, you can resume the build with
the command
2017-06-01T00:34:52.106 [ERROR]   mvn <goals> -rf :beam-sdks-python
channel stopped
Not sending mail to unregistered user github@nakomis.com
Not sending mail to unregistered user mingmxu@ebay.com
Not sending mail to unregistered user kirpichov@google.com
Not sending mail to unregistered user aljoscha.krettek@gmail.com
Not sending mail to unregistered user klk@google.com
Not sending mail to unregistered user sourabhbajaj@google.com
Not sending mail to unregistered user hepei.hp@alibaba-inc.com

Mime
View raw message