beam-commits mailing list archives

Site index · List index
Message view « Date » · « Thread »
Top « Date » · « Thread »
From Apache Jenkins Server <jenk...@builds.apache.org>
Subject Build failed in Jenkins: beam_PostCommit_Java_MavenInstall_Windows #148
Date Sun, 18 Jun 2017 12:41:57 GMT
See <https://builds.apache.org/job/beam_PostCommit_Java_MavenInstall_Windows/148/display/redirect>

------------------------------------------
[...truncated 2.65 MB...]
2017-06-18T12:36:05.200 [INFO] Downloaded: https://repo.maven.apache.org/maven2/org/sonatype/gossip/gossip/1.8/gossip-1.8.pom
(12 KB at 469.0 KB/sec)
2017-06-18T12:36:05.204 [INFO] Downloading: https://repo.maven.apache.org/maven2/org/sonatype/forge/forge-parent/9/forge-parent-9.pom
2017-06-18T12:36:05.229 [INFO] Downloaded: https://repo.maven.apache.org/maven2/org/sonatype/forge/forge-parent/9/forge-parent-9.pom
(13 KB at 513.4 KB/sec)
2017-06-18T12:36:05.233 [INFO] Downloading: https://repo.maven.apache.org/maven2/org/sonatype/gossip/gossip-core/1.8/gossip-core-1.8.pom
2017-06-18T12:36:05.259 [INFO] Downloaded: https://repo.maven.apache.org/maven2/org/sonatype/gossip/gossip-core/1.8/gossip-core-1.8.pom
(3 KB at 83.6 KB/sec)
2017-06-18T12:36:05.263 [INFO] Downloading: https://repo.maven.apache.org/maven2/org/sonatype/gossip/gossip-bootstrap/1.8/gossip-bootstrap-1.8.pom
2017-06-18T12:36:05.286 [INFO] Downloaded: https://repo.maven.apache.org/maven2/org/sonatype/gossip/gossip-bootstrap/1.8/gossip-bootstrap-1.8.pom
(2 KB at 68.4 KB/sec)
2017-06-18T12:36:05.291 [INFO] Downloading: https://repo.maven.apache.org/maven2/com/google/guava/guava/14.0.1/guava-14.0.1.pom
2017-06-18T12:36:05.315 [INFO] Downloaded: https://repo.maven.apache.org/maven2/com/google/guava/guava/14.0.1/guava-14.0.1.pom
(6 KB at 210.0 KB/sec)
2017-06-18T12:36:05.319 [INFO] Downloading: https://repo.maven.apache.org/maven2/com/google/guava/guava-parent/14.0.1/guava-parent-14.0.1.pom
2017-06-18T12:36:05.346 [INFO] Downloaded: https://repo.maven.apache.org/maven2/com/google/guava/guava-parent/14.0.1/guava-parent-14.0.1.pom
(3 KB at 92.4 KB/sec)
2017-06-18T12:36:05.349 [INFO] Downloading: https://repo.maven.apache.org/maven2/org/codehaus/plexus/plexus-classworlds/2.4.2/plexus-classworlds-2.4.2.pom
2017-06-18T12:36:05.372 [INFO] Downloaded: https://repo.maven.apache.org/maven2/org/codehaus/plexus/plexus-classworlds/2.4.2/plexus-classworlds-2.4.2.pom
(4 KB at 149.0 KB/sec)
2017-06-18T12:36:05.376 [INFO] Downloading: https://repo.maven.apache.org/maven2/org/codehaus/plexus/plexus-interpolation/1.16/plexus-interpolation-1.16.pom
2017-06-18T12:36:05.399 [INFO] Downloaded: https://repo.maven.apache.org/maven2/org/codehaus/plexus/plexus-interpolation/1.16/plexus-interpolation-1.16.pom
(2 KB at 43.6 KB/sec)
2017-06-18T12:36:05.404 [INFO] Downloading: https://repo.maven.apache.org/maven2/org/eclipse/aether/aether-api/0.9.0.M2/aether-api-0.9.0.M2.pom
2017-06-18T12:36:05.428 [INFO] Downloaded: https://repo.maven.apache.org/maven2/org/eclipse/aether/aether-api/0.9.0.M2/aether-api-0.9.0.M2.pom
(2 KB at 70.7 KB/sec)
2017-06-18T12:36:05.433 [INFO] Downloading: https://repo.maven.apache.org/maven2/org/codehaus/gmaven/gmaven-adapter-api/2.0/gmaven-adapter-api-2.0.pom
2017-06-18T12:36:05.460 [INFO] Downloaded: https://repo.maven.apache.org/maven2/org/codehaus/gmaven/gmaven-adapter-api/2.0/gmaven-adapter-api-2.0.pom
(2 KB at 65.3 KB/sec)
2017-06-18T12:36:05.465 [INFO] Downloading: https://repo.maven.apache.org/maven2/org/codehaus/gmaven/gmaven-adapter-impl/2.0/gmaven-adapter-impl-2.0.pom
2017-06-18T12:36:05.490 [INFO] Downloaded: https://repo.maven.apache.org/maven2/org/codehaus/gmaven/gmaven-adapter-impl/2.0/gmaven-adapter-impl-2.0.pom
(3 KB at 106.2 KB/sec)
2017-06-18T12:36:05.495 [INFO] Downloading: https://repo.maven.apache.org/maven2/org/codehaus/groovy/groovy-all/2.1.5/groovy-all-2.1.5.pom
2017-06-18T12:36:05.522 [INFO] Downloaded: https://repo.maven.apache.org/maven2/org/codehaus/groovy/groovy-all/2.1.5/groovy-all-2.1.5.pom
(18 KB at 652.5 KB/sec)
2017-06-18T12:36:05.527 [INFO] Downloading: https://repo.maven.apache.org/maven2/org/apache/ant/ant/1.8.4/ant-1.8.4.pom
2017-06-18T12:36:05.550 [INFO] Downloaded: https://repo.maven.apache.org/maven2/org/apache/ant/ant/1.8.4/ant-1.8.4.pom
(10 KB at 409.9 KB/sec)
2017-06-18T12:36:05.553 [INFO] Downloading: https://repo.maven.apache.org/maven2/org/apache/ant/ant-parent/1.8.4/ant-parent-1.8.4.pom
2017-06-18T12:36:05.578 [INFO] Downloaded: https://repo.maven.apache.org/maven2/org/apache/ant/ant-parent/1.8.4/ant-parent-1.8.4.pom
(5 KB at 178.2 KB/sec)
2017-06-18T12:36:05.582 [INFO] Downloading: https://repo.maven.apache.org/maven2/org/apache/ant/ant-launcher/1.8.4/ant-launcher-1.8.4.pom
2017-06-18T12:36:05.608 [INFO] Downloaded: https://repo.maven.apache.org/maven2/org/apache/ant/ant-launcher/1.8.4/ant-launcher-1.8.4.pom
(3 KB at 88.7 KB/sec)
2017-06-18T12:36:05.612 [INFO] Downloading: https://repo.maven.apache.org/maven2/org/fusesource/jansi/jansi/1.11/jansi-1.11.pom
2017-06-18T12:36:05.639 [INFO] Downloaded: https://repo.maven.apache.org/maven2/org/fusesource/jansi/jansi/1.11/jansi-1.11.pom
(4 KB at 130.2 KB/sec)
2017-06-18T12:36:05.643 [INFO] Downloading: https://repo.maven.apache.org/maven2/org/fusesource/jansi/jansi-project/1.11/jansi-project-1.11.pom
2017-06-18T12:36:05.669 [INFO] Downloaded: https://repo.maven.apache.org/maven2/org/fusesource/jansi/jansi-project/1.11/jansi-project-1.11.pom
(12 KB at 430.0 KB/sec)
2017-06-18T12:36:05.673 [INFO] Downloading: https://repo.maven.apache.org/maven2/org/fusesource/fusesource-pom/1.8/fusesource-pom-1.8.pom
2017-06-18T12:36:05.699 [INFO] Downloaded: https://repo.maven.apache.org/maven2/org/fusesource/fusesource-pom/1.8/fusesource-pom-1.8.pom
(15 KB at 550.4 KB/sec)
2017-06-18T12:36:05.713 [INFO] Downloading: https://repo.maven.apache.org/maven2/org/sonatype/gossip/gossip-slf4j/1.8/gossip-slf4j-1.8.jar
2017-06-18T12:36:05.714 [INFO] Downloading: https://repo.maven.apache.org/maven2/org/sonatype/gossip/gossip-bootstrap/1.8/gossip-bootstrap-1.8.jar
2017-06-18T12:36:05.714 [INFO] Downloading: https://repo.maven.apache.org/maven2/org/sonatype/gossip/gossip-core/1.8/gossip-core-1.8.jar
2017-06-18T12:36:05.715 [INFO] Downloading: https://repo.maven.apache.org/maven2/org/codehaus/plexus/plexus-classworlds/2.4.2/plexus-classworlds-2.4.2.jar
2017-06-18T12:36:05.715 [INFO] Downloading: https://repo.maven.apache.org/maven2/com/google/guava/guava/14.0.1/guava-14.0.1.jar
2017-06-18T12:36:05.742 [INFO] Downloaded: https://repo.maven.apache.org/maven2/org/sonatype/gossip/gossip-slf4j/1.8/gossip-slf4j-1.8.jar
(5 KB at 142.3 KB/sec)
2017-06-18T12:36:05.742 [INFO] Downloading: https://repo.maven.apache.org/maven2/org/codehaus/plexus/plexus-interpolation/1.16/plexus-interpolation-1.16.jar
2017-06-18T12:36:05.745 [INFO] Downloaded: https://repo.maven.apache.org/maven2/org/sonatype/gossip/gossip-bootstrap/1.8/gossip-bootstrap-1.8.jar
(20 KB at 603.0 KB/sec)
2017-06-18T12:36:05.745 [INFO] Downloading: https://repo.maven.apache.org/maven2/org/eclipse/aether/aether-api/0.9.0.M2/aether-api-0.9.0.M2.jar
2017-06-18T12:36:05.749 [INFO] Downloaded: https://repo.maven.apache.org/maven2/org/codehaus/plexus/plexus-classworlds/2.4.2/plexus-classworlds-2.4.2.jar
(46 KB at 1310.5 KB/sec)
2017-06-18T12:36:05.749 [INFO] Downloading: https://repo.maven.apache.org/maven2/org/codehaus/gmaven/gmaven-adapter-api/2.0/gmaven-adapter-api-2.0.jar
2017-06-18T12:36:05.753 [INFO] Downloaded: https://repo.maven.apache.org/maven2/org/sonatype/gossip/gossip-core/1.8/gossip-core-1.8.jar
(57 KB at 1411.5 KB/sec)
2017-06-18T12:36:05.753 [INFO] Downloading: https://repo.maven.apache.org/maven2/org/codehaus/gmaven/gmaven-adapter-impl/2.0/gmaven-adapter-impl-2.0.jar
2017-06-18T12:36:05.774 [INFO] Downloaded: https://repo.maven.apache.org/maven2/org/codehaus/plexus/plexus-interpolation/1.16/plexus-interpolation-1.16.jar
(60 KB at 997.9 KB/sec)
2017-06-18T12:36:05.774 [INFO] Downloaded: https://repo.maven.apache.org/maven2/org/codehaus/gmaven/gmaven-adapter-api/2.0/gmaven-adapter-api-2.0.jar
(7 KB at 115.2 KB/sec)
2017-06-18T12:36:05.774 [INFO] Downloading: https://repo.maven.apache.org/maven2/org/codehaus/groovy/groovy-all/2.1.5/groovy-all-2.1.5.jar
2017-06-18T12:36:05.774 [INFO] Downloading: https://repo.maven.apache.org/maven2/org/apache/ant/ant/1.8.4/ant-1.8.4.jar
2017-06-18T12:36:05.786 [INFO] Downloaded: https://repo.maven.apache.org/maven2/org/codehaus/gmaven/gmaven-adapter-impl/2.0/gmaven-adapter-impl-2.0.jar
(16 KB at 219.3 KB/sec)
2017-06-18T12:36:05.786 [INFO] Downloading: https://repo.maven.apache.org/maven2/org/apache/ant/ant-launcher/1.8.4/ant-launcher-1.8.4.jar
2017-06-18T12:36:05.786 [INFO] Downloaded: https://repo.maven.apache.org/maven2/org/eclipse/aether/aether-api/0.9.0.M2/aether-api-0.9.0.M2.jar
(131 KB at 1816.9 KB/sec)
2017-06-18T12:36:05.786 [INFO] Downloading: https://repo.maven.apache.org/maven2/org/fusesource/jansi/jansi/1.11/jansi-1.11.jar
2017-06-18T12:36:05.832 [INFO] Downloaded: https://repo.maven.apache.org/maven2/org/fusesource/jansi/jansi/1.11/jansi-1.11.jar
(112 KB at 946.9 KB/sec)
2017-06-18T12:36:05.835 [INFO] Downloaded: https://repo.maven.apache.org/maven2/org/apache/ant/ant-launcher/1.8.4/ant-launcher-1.8.4.jar
(18 KB at 148.7 KB/sec)
2017-06-18T12:36:05.978 [INFO] Downloaded: https://repo.maven.apache.org/maven2/com/google/guava/guava/14.0.1/guava-14.0.1.jar
(2138 KB at 8067.2 KB/sec)
2017-06-18T12:36:05.994 [INFO] Downloaded: https://repo.maven.apache.org/maven2/org/apache/ant/ant/1.8.4/ant-1.8.4.jar
(1897 KB at 6772.2 KB/sec)
2017-06-18T12:36:06.368 [INFO] Downloaded: https://repo.maven.apache.org/maven2/org/codehaus/groovy/groovy-all/2.1.5/groovy-all-2.1.5.jar
(6219 KB at 9508.1 KB/sec)
[JENKINS] Archiving disabled
2017-06-18T12:36:15.932 [INFO]                                                           
             
2017-06-18T12:36:15.932 [INFO] ------------------------------------------------------------------------
2017-06-18T12:36:15.932 [INFO] Skipping Apache Beam :: Parent
2017-06-18T12:36:15.932 [INFO] This project has been banned from the build due to previous
failures.
2017-06-18T12:36:15.932 [INFO] ------------------------------------------------------------------------
[JENKINS] Archiving disabled
[JENKINS] Archiving disabled
[JENKINS] Archiving disabled
[JENKINS] Archiving disabled
[JENKINS] Archiving disabled
[JENKINS] Archiving disabled
[JENKINS] Archiving disabled
[JENKINS] Archiving disabled
[JENKINS] Archiving disabled
[JENKINS] Archiving disabled
[JENKINS] Archiving disabled
[JENKINS] Archiving disabled
[JENKINS] Archiving disabled
[JENKINS] Archiving disabled
[JENKINS] Archiving disabled
[JENKINS] Archiving disabled
[JENKINS] Archiving disabled
[JENKINS] Archiving disabled
[JENKINS] Archiving disabled
[JENKINS] Archiving disabled
[JENKINS] Archiving disabled
[JENKINS] Archiving disabled
[JENKINS] Archiving disabled
[JENKINS] Archiving disabled
[JENKINS] Archiving disabled
[JENKINS] Archiving disabled
[JENKINS] Archiving disabled
[JENKINS] Archiving disabled
[JENKINS] Archiving disabled
[JENKINS] Archiving disabled
[JENKINS] Archiving disabled
[JENKINS] Archiving disabled
[JENKINS] Archiving disabled
[JENKINS] Archiving disabled
[JENKINS] Archiving disabled
[JENKINS] Archiving disabled
[JENKINS] Archiving disabled
[JENKINS] Archiving disabled
[JENKINS] Archiving disabled
[JENKINS] Archiving disabled
[JENKINS] Archiving disabled
[JENKINS] Archiving disabled
[JENKINS] Archiving disabled
[JENKINS] Archiving disabled
[JENKINS] Archiving disabled
[JENKINS] Archiving disabled
[JENKINS] Archiving disabled
[JENKINS] Archiving disabled
[JENKINS] Archiving disabled
[JENKINS] Archiving disabled
2017-06-18T12:37:27.855 [INFO] ------------------------------------------------------------------------
2017-06-18T12:37:27.855 [INFO] Reactor Summary:
2017-06-18T12:37:27.855 [INFO] 
2017-06-18T12:37:27.856 [INFO] Apache Beam :: Parent .............................. SUCCESS
[ 25.548 s]
2017-06-18T12:37:27.856 [INFO] Apache Beam :: SDKs :: Java :: Build Tools ......... SUCCESS
[ 17.507 s]
2017-06-18T12:37:27.856 [INFO] Apache Beam :: SDKs ................................ SUCCESS
[  8.513 s]
2017-06-18T12:37:27.856 [INFO] Apache Beam :: SDKs :: Common ...................... SUCCESS
[  5.318 s]
2017-06-18T12:37:27.856 [INFO] Apache Beam :: SDKs :: Common :: Runner API ........ SUCCESS
[ 23.162 s]
2017-06-18T12:37:27.856 [INFO] Apache Beam :: SDKs :: Common :: Fn API ............ SUCCESS
[ 22.196 s]
2017-06-18T12:37:27.859 [INFO] Apache Beam :: SDKs :: Java ........................ SUCCESS
[  6.011 s]
2017-06-18T12:37:27.859 [INFO] Apache Beam :: SDKs :: Java :: Core ................ SUCCESS
[04:12 min]
2017-06-18T12:37:27.859 [INFO] Apache Beam :: Runners ............................. SUCCESS
[  5.504 s]
2017-06-18T12:37:27.859 [INFO] Apache Beam :: Runners :: Core Construction Java ... SUCCESS
[ 48.057 s]
2017-06-18T12:37:27.859 [INFO] Apache Beam :: Runners :: Core Java ................ SUCCESS
[01:14 min]
2017-06-18T12:37:27.859 [INFO] Apache Beam :: Runners :: Direct Java .............. SUCCESS
[03:45 min]
2017-06-18T12:37:27.859 [INFO] Apache Beam :: SDKs :: Java :: IO .................. SUCCESS
[  5.722 s]
2017-06-18T12:37:27.860 [INFO] Apache Beam :: SDKs :: Java :: IO :: Common ........ SUCCESS
[ 11.061 s]
2017-06-18T12:37:27.860 [INFO] Apache Beam :: SDKs :: Java :: IO :: Cassandra ..... SUCCESS
[ 38.152 s]
2017-06-18T12:37:27.860 [INFO] Apache Beam :: SDKs :: Java :: IO :: Elasticsearch . SUCCESS
[ 54.949 s]
2017-06-18T12:37:27.860 [INFO] Apache Beam :: SDKs :: Java :: Extensions .......... SUCCESS
[  6.509 s]
2017-06-18T12:37:27.860 [INFO] Apache Beam :: SDKs :: Java :: Extensions :: Google Cloud Platform
Core SUCCESS [ 56.108 s]
2017-06-18T12:37:27.860 [INFO] Apache Beam :: SDKs :: Java :: Extensions :: Protobuf SUCCESS
[ 30.757 s]
2017-06-18T12:37:27.860 [INFO] Apache Beam :: SDKs :: Java :: IO :: Google Cloud Platform
SUCCESS [01:35 min]
2017-06-18T12:37:27.860 [INFO] Apache Beam :: SDKs :: Java :: IO :: Hadoop Common . SUCCESS
[ 32.217 s]
2017-06-18T12:37:27.860 [INFO] Apache Beam :: SDKs :: Java :: IO :: Hadoop File System SUCCESS
[ 42.331 s]
2017-06-18T12:37:27.860 [INFO] Apache Beam :: SDKs :: Java :: IO :: Hadoop ........ SUCCESS
[ 10.493 s]
2017-06-18T12:37:27.860 [INFO] Apache Beam :: SDKs :: Java :: IO :: Hadoop :: input-format
SUCCESS [ 34.676 s]
2017-06-18T12:37:27.860 [INFO] Apache Beam :: SDKs :: Java :: IO :: Hadoop :: jdk1.8-tests
SUCCESS [01:48 min]
2017-06-18T12:37:27.860 [INFO] Apache Beam :: SDKs :: Java :: IO :: HBase ......... SUCCESS
[ 50.698 s]
2017-06-18T12:37:27.861 [INFO] Apache Beam :: SDKs :: Java :: IO :: HCatalog ...... SUCCESS
[01:12 min]
2017-06-18T12:37:27.861 [INFO] Apache Beam :: SDKs :: Java :: IO :: JDBC .......... SUCCESS
[ 42.250 s]
2017-06-18T12:37:27.861 [INFO] Apache Beam :: SDKs :: Java :: IO :: JMS ........... SUCCESS
[ 35.007 s]
2017-06-18T12:37:27.861 [INFO] Apache Beam :: SDKs :: Java :: IO :: Kafka ......... SUCCESS
[ 45.266 s]
2017-06-18T12:37:27.861 [INFO] Apache Beam :: SDKs :: Java :: IO :: Kinesis ....... SUCCESS
[ 40.047 s]
2017-06-18T12:37:27.861 [INFO] Apache Beam :: SDKs :: Java :: IO :: MongoDB ....... SUCCESS
[ 47.578 s]
2017-06-18T12:37:27.861 [INFO] Apache Beam :: SDKs :: Java :: IO :: MQTT .......... SUCCESS
[ 38.255 s]
2017-06-18T12:37:27.861 [INFO] Apache Beam :: SDKs :: Java :: IO :: XML ........... SUCCESS
[ 41.732 s]
2017-06-18T12:37:27.861 [INFO] Apache Beam :: SDKs :: Java :: Maven Archetypes .... SUCCESS
[  7.675 s]
2017-06-18T12:37:27.861 [INFO] Apache Beam :: SDKs :: Java :: Maven Archetypes :: Starter
SUCCESS [ 29.686 s]
2017-06-18T12:37:27.861 [INFO] Apache Beam :: SDKs :: Java :: Extensions :: Jackson SUCCESS
[ 29.735 s]
2017-06-18T12:37:27.861 [INFO] Apache Beam :: SDKs :: Java :: Extensions :: Join library SUCCESS
[ 38.043 s]
2017-06-18T12:37:27.861 [INFO] Apache Beam :: SDKs :: Java :: Extensions :: Sorter  SUCCESS
[ 44.922 s]
2017-06-18T12:37:27.861 [INFO] Apache Beam :: Runners :: Google Cloud Dataflow .... SUCCESS
[ 58.000 s]
2017-06-18T12:37:27.861 [INFO] Apache Beam :: SDKs :: Java :: Harness ............. SUCCESS
[01:08 min]
2017-06-18T12:37:27.861 [INFO] Apache Beam :: SDKs :: Java :: Java 8 Tests ........ SUCCESS
[ 29.204 s]
2017-06-18T12:37:27.862 [INFO] Apache Beam :: SDKs :: Python ...................... FAILURE
[  8.928 s]
2017-06-18T12:37:27.862 [INFO] Apache Beam :: Runners :: Flink .................... SKIPPED
2017-06-18T12:37:27.862 [INFO] Apache Beam :: Runners :: Spark .................... SKIPPED
2017-06-18T12:37:27.862 [INFO] Apache Beam :: Runners :: Apex ..................... SKIPPED
2017-06-18T12:37:27.862 [INFO] Apache Beam :: Examples ............................ SKIPPED
2017-06-18T12:37:27.862 [INFO] Apache Beam :: Examples :: Java .................... SKIPPED
2017-06-18T12:37:27.862 [INFO] Apache Beam :: Examples :: Java 8 .................. SKIPPED
2017-06-18T12:37:27.862 [INFO] Apache Beam :: SDKs :: Java :: Aggregated Javadoc .. SKIPPED
2017-06-18T12:37:27.862 [INFO] ------------------------------------------------------------------------
2017-06-18T12:37:27.862 [INFO] BUILD FAILURE
2017-06-18T12:37:27.862 [INFO] ------------------------------------------------------------------------
2017-06-18T12:37:27.862 [INFO] Total time: 36:47 min
2017-06-18T12:37:27.863 [INFO] Finished at: 2017-06-18T12:37:27+00:00
2017-06-18T12:37:29.457 [INFO] Final Memory: 409M/2625M
2017-06-18T12:37:29.457 [INFO] ------------------------------------------------------------------------
Waiting for Jenkins to finish collecting data
2017-06-18T12:39:57.541 [ERROR] Failed to execute goal org.codehaus.gmaven:groovy-maven-plugin:2.0:execute
(find-supported-python-for-clean) on project beam-sdks-python: Unable to find Python 2.7 in
path -> [Help 1]
org.apache.maven.lifecycle.LifecycleExecutionException: Failed to execute goal org.codehaus.gmaven:groovy-maven-plugin:2.0:execute
(find-supported-python-for-clean) on project beam-sdks-python: Unable to find Python 2.7 in
path
	at org.apache.maven.lifecycle.internal.MojoExecutor.execute(MojoExecutor.java:212)
	at org.apache.maven.lifecycle.internal.MojoExecutor.execute(MojoExecutor.java:153)
	at org.apache.maven.lifecycle.internal.MojoExecutor.execute(MojoExecutor.java:145)
	at org.apache.maven.lifecycle.internal.LifecycleModuleBuilder.buildProject(LifecycleModuleBuilder.java:116)
	at org.apache.maven.lifecycle.internal.LifecycleModuleBuilder.buildProject(LifecycleModuleBuilder.java:80)
	at org.apache.maven.lifecycle.internal.builder.singlethreaded.SingleThreadedBuilder.build(SingleThreadedBuilder.java:51)
	at org.apache.maven.lifecycle.internal.LifecycleStarter.execute(LifecycleStarter.java:128)
	at org.apache.maven.DefaultMaven.doExecute(DefaultMaven.java:307)
	at org.apache.maven.DefaultMaven.doExecute(DefaultMaven.java:193)
	at org.apache.maven.DefaultMaven.execute(DefaultMaven.java:106)
	at org.jvnet.hudson.maven3.launcher.Maven33Launcher.main(Maven33Launcher.java:129)
	at sun.reflect.NativeMethodAccessorImpl.invoke0(Native Method)
	at sun.reflect.NativeMethodAccessorImpl.invoke(NativeMethodAccessorImpl.java:62)
	at sun.reflect.DelegatingMethodAccessorImpl.invoke(DelegatingMethodAccessorImpl.java:43)
	at java.lang.reflect.Method.invoke(Method.java:498)
	at org.codehaus.plexus.classworlds.launcher.Launcher.launchStandard(Launcher.java:330)
	at org.codehaus.plexus.classworlds.launcher.Launcher.launch(Launcher.java:238)
	at jenkins.maven3.agent.Maven33Main.launch(Maven33Main.java:176)
	at sun.reflect.NativeMethodAccessorImpl.invoke0(Native Method)
	at sun.reflect.NativeMethodAccessorImpl.invoke(NativeMethodAccessorImpl.java:62)
	at sun.reflect.DelegatingMethodAccessorImpl.invoke(DelegatingMethodAccessorImpl.java:43)
	at java.lang.reflect.Method.invoke(Method.java:498)
	at hudson.maven.Maven3Builder.call(Maven3Builder.java:139)
	at hudson.maven.Maven3Builder.call(Maven3Builder.java:70)
	at hudson.remoting.UserRequest.perform(UserRequest.java:120)
	at hudson.remoting.UserRequest.perform(UserRequest.java:48)
	at hudson.remoting.Request$2.run(Request.java:326)
	at hudson.remoting.InterceptingExecutorService$1.call(InterceptingExecutorService.java:68)
	at java.util.concurrent.FutureTask.run(FutureTask.java:266)
	at java.util.concurrent.ThreadPoolExecutor.runWorker(ThreadPoolExecutor.java:1142)
	at java.util.concurrent.ThreadPoolExecutor$Worker.run(ThreadPoolExecutor.java:617)
	at java.lang.Thread.run(Thread.java:745)
Caused by: org.apache.maven.plugin.MojoFailureException: Unable to find Python 2.7 in path
	at sun.reflect.NativeConstructorAccessorImpl.newInstance0(Native Method)
	at sun.reflect.NativeConstructorAccessorImpl.newInstance(NativeConstructorAccessorImpl.java:62)
	at sun.reflect.DelegatingConstructorAccessorImpl.newInstance(DelegatingConstructorAccessorImpl.java:45)
	at java.lang.reflect.Constructor.newInstance(Constructor.java:423)
	at org.codehaus.groovy.reflection.CachedConstructor.invoke(CachedConstructor.java:77)
	at org.codehaus.groovy.runtime.callsite.ConstructorSite$ConstructorSiteNoUnwrapNoCoerce.callConstructor(ConstructorSite.java:102)
	at org.codehaus.groovy.runtime.callsite.CallSiteArray.defaultCallConstructor(CallSiteArray.java:57)
	at org.codehaus.groovy.runtime.callsite.AbstractCallSite.callConstructor(AbstractCallSite.java:182)
	at org.codehaus.groovy.runtime.callsite.AbstractCallSite.callConstructor(AbstractCallSite.java:190)
	at findSupportedPython.run(findSupportedPython.groovy:70)
	at groovy.lang.GroovyShell.evaluate(GroovyShell.java:518)
	at org.codehaus.gmaven.adapter.impl.ScriptExecutorImpl.execute(ScriptExecutorImpl.java:80)
	at org.codehaus.gmaven.plugin.ExecuteMojo$1.run(ExecuteMojo.java:100)
	at org.codehaus.gmaven.plugin.util.SystemNoExitGuard.run(SystemNoExitGuard.java:45)
	at org.codehaus.gmaven.plugin.ExecuteMojo.run(ExecuteMojo.java:96)
	at org.codehaus.gmaven.plugin.MojoSupport.execute(MojoSupport.java:45)
	at org.apache.maven.plugin.DefaultBuildPluginManager.executeMojo(DefaultBuildPluginManager.java:134)
	at org.apache.maven.lifecycle.internal.MojoExecutor.execute(MojoExecutor.java:208)
	... 31 more
2017-06-18T12:39:57.546 [ERROR] 
2017-06-18T12:39:57.546 [ERROR] Re-run Maven using the -X switch to enable full debug logging.
2017-06-18T12:39:57.546 [ERROR] 
2017-06-18T12:39:57.546 [ERROR] For more information about the errors and possible solutions,
please read the following articles:
2017-06-18T12:39:57.547 [ERROR] [Help 1] http://cwiki.apache.org/confluence/display/MAVEN/MojoFailureException
2017-06-18T12:39:57.547 [ERROR] 
2017-06-18T12:39:57.547 [ERROR] After correcting the problems, you can resume the build with
the command
2017-06-18T12:39:57.548 [ERROR]   mvn <goals> -rf :beam-sdks-python
channel stopped
Not sending mail to unregistered user aljoscha.krettek@gmail.com
Not sending mail to unregistered user github@nakomis.com
Not sending mail to unregistered user hepei.hp@alibaba-inc.com
Not sending mail to unregistered user sourabhbajaj@google.com
Not sending mail to unregistered user klk@google.com
Not sending mail to unregistered user ccy@google.com
Not sending mail to unregistered user kirpichov@google.com
Not sending mail to unregistered user mingmxu@ebay.com

Mime
View raw message