beam-commits mailing list archives

Site index · List index
Message view « Date » · « Thread »
Top « Date » · « Thread »
From Apache Jenkins Server <jenk...@builds.apache.org>
Subject Build failed in Jenkins: beam_PostCommit_Java_MavenInstall_Windows #96
Date Mon, 05 Jun 2017 12:36:34 GMT
See <https://builds.apache.org/job/beam_PostCommit_Java_MavenInstall_Windows/96/display/redirect>

------------------------------------------
[...truncated 2.53 MB...]
2017-06-05T12:35:09.674 [INFO] 
2017-06-05T12:35:09.674 [INFO] --- groovy-maven-plugin:2.0:execute (find-supported-python-for-clean)
@ beam-sdks-python ---
2017-06-05T12:35:09.678 [INFO] Downloading: https://repo.maven.apache.org/maven2/org/sonatype/gossip/gossip-slf4j/1.8/gossip-slf4j-1.8.pom
2017-06-05T12:35:09.688 [INFO] Downloaded: https://repo.maven.apache.org/maven2/org/sonatype/gossip/gossip-slf4j/1.8/gossip-slf4j-1.8.pom
(2 KB at 144.7 KB/sec)
2017-06-05T12:35:09.691 [INFO] Downloading: https://repo.maven.apache.org/maven2/org/sonatype/gossip/gossip/1.8/gossip-1.8.pom
2017-06-05T12:35:09.701 [INFO] Downloaded: https://repo.maven.apache.org/maven2/org/sonatype/gossip/gossip/1.8/gossip-1.8.pom
(12 KB at 1125.6 KB/sec)
2017-06-05T12:35:09.705 [INFO] Downloading: https://repo.maven.apache.org/maven2/org/sonatype/forge/forge-parent/9/forge-parent-9.pom
2017-06-05T12:35:09.714 [INFO] Downloaded: https://repo.maven.apache.org/maven2/org/sonatype/forge/forge-parent/9/forge-parent-9.pom
(13 KB at 1426.0 KB/sec)
2017-06-05T12:35:09.719 [INFO] Downloading: https://repo.maven.apache.org/maven2/org/sonatype/gossip/gossip-core/1.8/gossip-core-1.8.pom
2017-06-05T12:35:09.729 [INFO] Downloaded: https://repo.maven.apache.org/maven2/org/sonatype/gossip/gossip-core/1.8/gossip-core-1.8.pom
(3 KB at 217.3 KB/sec)
2017-06-05T12:35:09.733 [INFO] Downloading: https://repo.maven.apache.org/maven2/org/sonatype/gossip/gossip-bootstrap/1.8/gossip-bootstrap-1.8.pom
2017-06-05T12:35:09.743 [INFO] Downloaded: https://repo.maven.apache.org/maven2/org/sonatype/gossip/gossip-bootstrap/1.8/gossip-bootstrap-1.8.pom
(2 KB at 157.3 KB/sec)
2017-06-05T12:35:09.748 [INFO] Downloading: https://repo.maven.apache.org/maven2/com/google/guava/guava/14.0.1/guava-14.0.1.pom
2017-06-05T12:35:09.764 [INFO] Downloaded: https://repo.maven.apache.org/maven2/com/google/guava/guava/14.0.1/guava-14.0.1.pom
(6 KB at 328.1 KB/sec)
2017-06-05T12:35:09.768 [INFO] Downloading: https://repo.maven.apache.org/maven2/com/google/guava/guava-parent/14.0.1/guava-parent-14.0.1.pom
2017-06-05T12:35:09.777 [INFO] Downloaded: https://repo.maven.apache.org/maven2/com/google/guava/guava-parent/14.0.1/guava-parent-14.0.1.pom
(3 KB at 277.2 KB/sec)
2017-06-05T12:35:09.781 [INFO] Downloading: https://repo.maven.apache.org/maven2/org/codehaus/plexus/plexus-classworlds/2.4.2/plexus-classworlds-2.4.2.pom
2017-06-05T12:35:09.790 [INFO] Downloaded: https://repo.maven.apache.org/maven2/org/codehaus/plexus/plexus-classworlds/2.4.2/plexus-classworlds-2.4.2.pom
(4 KB at 380.8 KB/sec)
2017-06-05T12:35:09.795 [INFO] Downloading: https://repo.maven.apache.org/maven2/org/codehaus/plexus/plexus-interpolation/1.16/plexus-interpolation-1.16.pom
2017-06-05T12:35:09.804 [INFO] Downloaded: https://repo.maven.apache.org/maven2/org/codehaus/plexus/plexus-interpolation/1.16/plexus-interpolation-1.16.pom
(2 KB at 111.4 KB/sec)
2017-06-05T12:35:09.809 [INFO] Downloading: https://repo.maven.apache.org/maven2/org/eclipse/aether/aether-api/0.9.0.M2/aether-api-0.9.0.M2.pom
2017-06-05T12:35:09.819 [INFO] Downloaded: https://repo.maven.apache.org/maven2/org/eclipse/aether/aether-api/0.9.0.M2/aether-api-0.9.0.M2.pom
(2 KB at 169.6 KB/sec)
2017-06-05T12:35:09.824 [INFO] Downloading: https://repo.maven.apache.org/maven2/org/codehaus/gmaven/gmaven-adapter-api/2.0/gmaven-adapter-api-2.0.pom
2017-06-05T12:35:09.836 [INFO] Downloaded: https://repo.maven.apache.org/maven2/org/codehaus/gmaven/gmaven-adapter-api/2.0/gmaven-adapter-api-2.0.pom
(2 KB at 147.0 KB/sec)
2017-06-05T12:35:09.840 [INFO] Downloading: https://repo.maven.apache.org/maven2/org/codehaus/gmaven/gmaven-adapter-impl/2.0/gmaven-adapter-impl-2.0.pom
2017-06-05T12:35:09.850 [INFO] Downloaded: https://repo.maven.apache.org/maven2/org/codehaus/gmaven/gmaven-adapter-impl/2.0/gmaven-adapter-impl-2.0.pom
(3 KB at 265.4 KB/sec)
2017-06-05T12:35:09.854 [INFO] Downloading: https://repo.maven.apache.org/maven2/org/codehaus/groovy/groovy-all/2.1.5/groovy-all-2.1.5.pom
2017-06-05T12:35:09.865 [INFO] Downloaded: https://repo.maven.apache.org/maven2/org/codehaus/groovy/groovy-all/2.1.5/groovy-all-2.1.5.pom
(18 KB at 1601.5 KB/sec)
2017-06-05T12:35:09.870 [INFO] Downloading: https://repo.maven.apache.org/maven2/org/apache/ant/ant/1.8.4/ant-1.8.4.pom
2017-06-05T12:35:09.880 [INFO] Downloaded: https://repo.maven.apache.org/maven2/org/apache/ant/ant/1.8.4/ant-1.8.4.pom
(10 KB at 942.8 KB/sec)
2017-06-05T12:35:09.883 [INFO] Downloading: https://repo.maven.apache.org/maven2/org/apache/ant/ant-parent/1.8.4/ant-parent-1.8.4.pom
2017-06-05T12:35:09.892 [INFO] Downloaded: https://repo.maven.apache.org/maven2/org/apache/ant/ant-parent/1.8.4/ant-parent-1.8.4.pom
(5 KB at 494.9 KB/sec)
2017-06-05T12:35:09.895 [INFO] Downloading: https://repo.maven.apache.org/maven2/org/apache/ant/ant-launcher/1.8.4/ant-launcher-1.8.4.pom
2017-06-05T12:35:09.905 [INFO] Downloaded: https://repo.maven.apache.org/maven2/org/apache/ant/ant-launcher/1.8.4/ant-launcher-1.8.4.pom
(3 KB at 230.6 KB/sec)
2017-06-05T12:35:09.910 [INFO] Downloading: https://repo.maven.apache.org/maven2/org/fusesource/jansi/jansi/1.11/jansi-1.11.pom
2017-06-05T12:35:09.919 [INFO] Downloaded: https://repo.maven.apache.org/maven2/org/fusesource/jansi/jansi/1.11/jansi-1.11.pom
(4 KB at 390.7 KB/sec)
2017-06-05T12:35:09.923 [INFO] Downloading: https://repo.maven.apache.org/maven2/org/fusesource/jansi/jansi-project/1.11/jansi-project-1.11.pom
2017-06-05T12:35:09.933 [INFO] Downloaded: https://repo.maven.apache.org/maven2/org/fusesource/jansi/jansi-project/1.11/jansi-project-1.11.pom
(12 KB at 1117.9 KB/sec)
2017-06-05T12:35:09.938 [INFO] Downloading: https://repo.maven.apache.org/maven2/org/fusesource/fusesource-pom/1.8/fusesource-pom-1.8.pom
2017-06-05T12:35:09.947 [INFO] Downloaded: https://repo.maven.apache.org/maven2/org/fusesource/fusesource-pom/1.8/fusesource-pom-1.8.pom
(15 KB at 1590.2 KB/sec)
2017-06-05T12:35:09.961 [INFO] Downloading: https://repo.maven.apache.org/maven2/org/sonatype/gossip/gossip-slf4j/1.8/gossip-slf4j-1.8.jar
2017-06-05T12:35:09.961 [INFO] Downloading: https://repo.maven.apache.org/maven2/org/sonatype/gossip/gossip-core/1.8/gossip-core-1.8.jar
2017-06-05T12:35:09.962 [INFO] Downloading: https://repo.maven.apache.org/maven2/com/google/guava/guava/14.0.1/guava-14.0.1.jar
2017-06-05T12:35:09.962 [INFO] Downloading: https://repo.maven.apache.org/maven2/org/sonatype/gossip/gossip-bootstrap/1.8/gossip-bootstrap-1.8.jar
2017-06-05T12:35:09.963 [INFO] Downloading: https://repo.maven.apache.org/maven2/org/codehaus/plexus/plexus-classworlds/2.4.2/plexus-classworlds-2.4.2.jar
2017-06-05T12:35:09.978 [INFO] Downloaded: https://repo.maven.apache.org/maven2/org/sonatype/gossip/gossip-slf4j/1.8/gossip-slf4j-1.8.jar
(5 KB at 242.8 KB/sec)
2017-06-05T12:35:09.978 [INFO] Downloading: https://repo.maven.apache.org/maven2/org/codehaus/plexus/plexus-interpolation/1.16/plexus-interpolation-1.16.jar
2017-06-05T12:35:09.978 [INFO] Downloaded: https://repo.maven.apache.org/maven2/org/sonatype/gossip/gossip-bootstrap/1.8/gossip-bootstrap-1.8.jar
(20 KB at 1135.0 KB/sec)
2017-06-05T12:35:09.978 [INFO] Downloading: https://repo.maven.apache.org/maven2/org/eclipse/aether/aether-api/0.9.0.M2/aether-api-0.9.0.M2.jar
2017-06-05T12:35:09.981 [INFO] Downloaded: https://repo.maven.apache.org/maven2/org/sonatype/gossip/gossip-core/1.8/gossip-core-1.8.jar
(57 KB at 2822.9 KB/sec)
2017-06-05T12:35:09.981 [INFO] Downloading: https://repo.maven.apache.org/maven2/org/codehaus/gmaven/gmaven-adapter-api/2.0/gmaven-adapter-api-2.0.jar
2017-06-05T12:35:09.989 [INFO] Downloaded: https://repo.maven.apache.org/maven2/org/codehaus/plexus/plexus-classworlds/2.4.2/plexus-classworlds-2.4.2.jar
(46 KB at 1698.8 KB/sec)
2017-06-05T12:35:09.989 [INFO] Downloading: https://repo.maven.apache.org/maven2/org/codehaus/gmaven/gmaven-adapter-impl/2.0/gmaven-adapter-impl-2.0.jar
2017-06-05T12:35:09.997 [INFO] Downloaded: https://repo.maven.apache.org/maven2/org/codehaus/plexus/plexus-interpolation/1.16/plexus-interpolation-1.16.jar
(60 KB at 1710.6 KB/sec)
2017-06-05T12:35:09.997 [INFO] Downloading: https://repo.maven.apache.org/maven2/org/codehaus/groovy/groovy-all/2.1.5/groovy-all-2.1.5.jar
2017-06-05T12:35:09.998 [INFO] Downloaded: https://repo.maven.apache.org/maven2/org/codehaus/gmaven/gmaven-adapter-api/2.0/gmaven-adapter-api-2.0.jar
(7 KB at 192.0 KB/sec)
2017-06-05T12:35:09.998 [INFO] Downloading: https://repo.maven.apache.org/maven2/org/apache/ant/ant/1.8.4/ant-1.8.4.jar
2017-06-05T12:35:10.001 [INFO] Downloaded: https://repo.maven.apache.org/maven2/org/eclipse/aether/aether-api/0.9.0.M2/aether-api-0.9.0.M2.jar
(131 KB at 3354.3 KB/sec)
2017-06-05T12:35:10.001 [INFO] Downloading: https://repo.maven.apache.org/maven2/org/apache/ant/ant-launcher/1.8.4/ant-launcher-1.8.4.jar
2017-06-05T12:35:10.002 [INFO] Downloaded: https://repo.maven.apache.org/maven2/org/codehaus/gmaven/gmaven-adapter-impl/2.0/gmaven-adapter-impl-2.0.jar
(16 KB at 394.8 KB/sec)
2017-06-05T12:35:10.002 [INFO] Downloading: https://repo.maven.apache.org/maven2/org/fusesource/jansi/jansi/1.11/jansi-1.11.jar
2017-06-05T12:35:10.036 [INFO] Downloaded: https://repo.maven.apache.org/maven2/org/apache/ant/ant-launcher/1.8.4/ant-launcher-1.8.4.jar
(18 KB at 243.2 KB/sec)
2017-06-05T12:35:10.042 [INFO] Downloaded: https://repo.maven.apache.org/maven2/org/fusesource/jansi/jansi/1.11/jansi-1.11.jar
(112 KB at 1396.7 KB/sec)
2017-06-05T12:35:10.174 [INFO] Downloaded: https://repo.maven.apache.org/maven2/org/apache/ant/ant/1.8.4/ant-1.8.4.jar
(1897 KB at 8944.4 KB/sec)
2017-06-05T12:35:10.183 [INFO] Downloaded: https://repo.maven.apache.org/maven2/com/google/guava/guava/14.0.1/guava-14.0.1.jar
(2138 KB at 9629.8 KB/sec)
2017-06-05T12:35:10.569 [INFO] Downloaded: https://repo.maven.apache.org/maven2/org/codehaus/groovy/groovy-all/2.1.5/groovy-all-2.1.5.jar
(6219 KB at 10244.3 KB/sec)
[JENKINS] Archiving disabled
2017-06-05T12:35:13.924 [INFO]                                                           
             
2017-06-05T12:35:13.924 [INFO] ------------------------------------------------------------------------
2017-06-05T12:35:13.924 [INFO] Skipping Apache Beam :: Parent
2017-06-05T12:35:13.924 [INFO] This project has been banned from the build due to previous
failures.
2017-06-05T12:35:13.924 [INFO] ------------------------------------------------------------------------
[JENKINS] Archiving disabled
[JENKINS] Archiving disabled
[JENKINS] Archiving disabled
[JENKINS] Archiving disabled
[JENKINS] Archiving disabled
[JENKINS] Archiving disabled
[JENKINS] Archiving disabled
[JENKINS] Archiving disabled
[JENKINS] Archiving disabled
[JENKINS] Archiving disabled
[JENKINS] Archiving disabled
[JENKINS] Archiving disabled
[JENKINS] Archiving disabled
[JENKINS] Archiving disabled
[JENKINS] Archiving disabled
[JENKINS] Archiving disabled
[JENKINS] Archiving disabled
[JENKINS] Archiving disabled
[JENKINS] Archiving disabled
[JENKINS] Archiving disabled
[JENKINS] Archiving disabled
[JENKINS] Archiving disabled
[JENKINS] Archiving disabled
[JENKINS] Archiving disabled
[JENKINS] Archiving disabled
[JENKINS] Archiving disabled
[JENKINS] Archiving disabled
[JENKINS] Archiving disabled
[JENKINS] Archiving disabled
[JENKINS] Archiving disabled
[JENKINS] Archiving disabled
[JENKINS] Archiving disabled
[JENKINS] Archiving disabled
[JENKINS] Archiving disabled
[JENKINS] Archiving disabled
[JENKINS] Archiving disabled
[JENKINS] Archiving disabled
[JENKINS] Archiving disabled
[JENKINS] Archiving disabled
[JENKINS] Archiving disabled
[JENKINS] Archiving disabled
[JENKINS] Archiving disabled
[JENKINS] Archiving disabled
[JENKINS] Archiving disabled
[JENKINS] Archiving disabled
[JENKINS] Archiving disabled
[JENKINS] Archiving disabled
[JENKINS] Archiving disabled
2017-06-05T12:36:13.085 [INFO] ------------------------------------------------------------------------
2017-06-05T12:36:13.085 [INFO] Reactor Summary:
2017-06-05T12:36:13.085 [INFO] 
2017-06-05T12:36:13.086 [INFO] Apache Beam :: Parent .............................. SUCCESS
[ 31.221 s]
2017-06-05T12:36:13.086 [INFO] Apache Beam :: SDKs :: Java :: Build Tools ......... SUCCESS
[ 17.530 s]
2017-06-05T12:36:13.086 [INFO] Apache Beam :: SDKs ................................ SUCCESS
[ 10.622 s]
2017-06-05T12:36:13.086 [INFO] Apache Beam :: SDKs :: Common ...................... SUCCESS
[ 10.877 s]
2017-06-05T12:36:13.086 [INFO] Apache Beam :: SDKs :: Common :: Runner API ........ SUCCESS
[ 26.408 s]
2017-06-05T12:36:13.086 [INFO] Apache Beam :: SDKs :: Common :: Fn API ............ SUCCESS
[ 24.595 s]
2017-06-05T12:36:13.086 [INFO] Apache Beam :: SDKs :: Java ........................ SUCCESS
[  6.325 s]
2017-06-05T12:36:13.086 [INFO] Apache Beam :: SDKs :: Java :: Core ................ SUCCESS
[04:16 min]
2017-06-05T12:36:13.086 [INFO] Apache Beam :: SDKs :: Java :: IO .................. SUCCESS
[  6.903 s]
2017-06-05T12:36:13.086 [INFO] Apache Beam :: SDKs :: Java :: IO :: Common ........ SUCCESS
[ 10.310 s]
2017-06-05T12:36:13.087 [INFO] Apache Beam :: Runners ............................. SUCCESS
[  5.505 s]
2017-06-05T12:36:13.087 [INFO] Apache Beam :: Runners :: Core Construction Java ... SUCCESS
[ 48.390 s]
2017-06-05T12:36:13.087 [INFO] Apache Beam :: Runners :: Core Java ................ SUCCESS
[01:16 min]
2017-06-05T12:36:13.087 [INFO] Apache Beam :: Runners :: Direct Java .............. SUCCESS
[03:32 min]
2017-06-05T12:36:13.087 [INFO] Apache Beam :: SDKs :: Java :: IO :: Elasticsearch . SUCCESS
[01:00 min]
2017-06-05T12:36:13.087 [INFO] Apache Beam :: SDKs :: Java :: Extensions .......... SUCCESS
[  9.750 s]
2017-06-05T12:36:13.087 [INFO] Apache Beam :: SDKs :: Java :: Extensions :: Google Cloud Platform
Core SUCCESS [01:01 min]
2017-06-05T12:36:13.087 [INFO] Apache Beam :: SDKs :: Java :: Extensions :: Protobuf SUCCESS
[ 43.088 s]
2017-06-05T12:36:13.087 [INFO] Apache Beam :: SDKs :: Java :: IO :: Google Cloud Platform
SUCCESS [01:37 min]
2017-06-05T12:36:13.087 [INFO] Apache Beam :: SDKs :: Java :: IO :: Hadoop Common . SUCCESS
[ 40.434 s]
2017-06-05T12:36:13.087 [INFO] Apache Beam :: SDKs :: Java :: IO :: Hadoop File System SUCCESS
[ 47.168 s]
2017-06-05T12:36:13.087 [INFO] Apache Beam :: SDKs :: Java :: IO :: Hadoop ........ SUCCESS
[ 10.547 s]
2017-06-05T12:36:13.087 [INFO] Apache Beam :: SDKs :: Java :: IO :: Hadoop :: input-format
SUCCESS [ 37.213 s]
2017-06-05T12:36:13.087 [INFO] Apache Beam :: SDKs :: Java :: IO :: Hadoop :: jdk1.8-tests
SUCCESS [01:52 min]
2017-06-05T12:36:13.087 [INFO] Apache Beam :: SDKs :: Java :: IO :: HBase ......... SUCCESS
[ 44.247 s]
2017-06-05T12:36:13.089 [INFO] Apache Beam :: SDKs :: Java :: IO :: JDBC .......... SUCCESS
[ 43.668 s]
2017-06-05T12:36:13.089 [INFO] Apache Beam :: SDKs :: Java :: IO :: JMS ........... SUCCESS
[ 35.179 s]
2017-06-05T12:36:13.089 [INFO] Apache Beam :: SDKs :: Java :: IO :: Kafka ......... SUCCESS
[ 46.299 s]
2017-06-05T12:36:13.089 [INFO] Apache Beam :: SDKs :: Java :: IO :: Kinesis ....... SUCCESS
[ 39.295 s]
2017-06-05T12:36:13.089 [INFO] Apache Beam :: SDKs :: Java :: IO :: MongoDB ....... SUCCESS
[ 45.611 s]
2017-06-05T12:36:13.089 [INFO] Apache Beam :: SDKs :: Java :: IO :: MQTT .......... SUCCESS
[ 32.428 s]
2017-06-05T12:36:13.089 [INFO] Apache Beam :: SDKs :: Java :: IO :: XML ........... SUCCESS
[ 30.611 s]
2017-06-05T12:36:13.089 [INFO] Apache Beam :: SDKs :: Java :: Maven Archetypes .... SUCCESS
[  5.412 s]
2017-06-05T12:36:13.089 [INFO] Apache Beam :: SDKs :: Java :: Maven Archetypes :: Starter
SUCCESS [ 27.193 s]
2017-06-05T12:36:13.089 [INFO] Apache Beam :: SDKs :: Java :: Extensions :: Jackson SUCCESS
[ 28.366 s]
2017-06-05T12:36:13.089 [INFO] Apache Beam :: SDKs :: Java :: Extensions :: Join library SUCCESS
[ 28.983 s]
2017-06-05T12:36:13.089 [INFO] Apache Beam :: SDKs :: Java :: Extensions :: Sorter  SUCCESS
[ 38.768 s]
2017-06-05T12:36:13.089 [INFO] Apache Beam :: Runners :: Google Cloud Dataflow .... SUCCESS
[ 58.372 s]
2017-06-05T12:36:13.089 [INFO] Apache Beam :: SDKs :: Java :: Harness ............. SUCCESS
[01:08 min]
2017-06-05T12:36:13.089 [INFO] Apache Beam :: SDKs :: Java :: Java 8 Tests ........ SUCCESS
[ 24.970 s]
2017-06-05T12:36:13.089 [INFO] Apache Beam :: SDKs :: Python ...................... FAILURE
[  3.708 s]
2017-06-05T12:36:13.089 [INFO] Apache Beam :: Runners :: Flink .................... SKIPPED
2017-06-05T12:36:13.089 [INFO] Apache Beam :: Runners :: Spark .................... SKIPPED
2017-06-05T12:36:13.089 [INFO] Apache Beam :: Runners :: Apex ..................... SKIPPED
2017-06-05T12:36:13.089 [INFO] Apache Beam :: Examples ............................ SKIPPED
2017-06-05T12:36:13.089 [INFO] Apache Beam :: Examples :: Java .................... SKIPPED
2017-06-05T12:36:13.089 [INFO] Apache Beam :: Examples :: Java 8 .................. SKIPPED
2017-06-05T12:36:13.089 [INFO] Apache Beam :: SDKs :: Java :: Aggregated Javadoc .. SKIPPED
2017-06-05T12:36:13.090 [INFO] ------------------------------------------------------------------------
2017-06-05T12:36:13.090 [INFO] BUILD FAILURE
2017-06-05T12:36:13.090 [INFO] ------------------------------------------------------------------------
2017-06-05T12:36:13.090 [INFO] Total time: 35:07 min
2017-06-05T12:36:13.092 [INFO] Finished at: 2017-06-05T12:36:13+00:00
2017-06-05T12:36:14.524 [INFO] Final Memory: 380M/2903M
2017-06-05T12:36:14.524 [INFO] ------------------------------------------------------------------------
Waiting for Jenkins to finish collecting data
2017-06-05T12:36:15.508 [ERROR] Failed to execute goal org.codehaus.gmaven:groovy-maven-plugin:2.0:execute
(find-supported-python-for-clean) on project beam-sdks-python: Unable to find Python 2.7 in
path -> [Help 1]
org.apache.maven.lifecycle.LifecycleExecutionException: Failed to execute goal org.codehaus.gmaven:groovy-maven-plugin:2.0:execute
(find-supported-python-for-clean) on project beam-sdks-python: Unable to find Python 2.7 in
path
	at org.apache.maven.lifecycle.internal.MojoExecutor.execute(MojoExecutor.java:212)
	at org.apache.maven.lifecycle.internal.MojoExecutor.execute(MojoExecutor.java:153)
	at org.apache.maven.lifecycle.internal.MojoExecutor.execute(MojoExecutor.java:145)
	at org.apache.maven.lifecycle.internal.LifecycleModuleBuilder.buildProject(LifecycleModuleBuilder.java:116)
	at org.apache.maven.lifecycle.internal.LifecycleModuleBuilder.buildProject(LifecycleModuleBuilder.java:80)
	at org.apache.maven.lifecycle.internal.builder.singlethreaded.SingleThreadedBuilder.build(SingleThreadedBuilder.java:51)
	at org.apache.maven.lifecycle.internal.LifecycleStarter.execute(LifecycleStarter.java:128)
	at org.apache.maven.DefaultMaven.doExecute(DefaultMaven.java:307)
	at org.apache.maven.DefaultMaven.doExecute(DefaultMaven.java:193)
	at org.apache.maven.DefaultMaven.execute(DefaultMaven.java:106)
	at org.jvnet.hudson.maven3.launcher.Maven33Launcher.main(Maven33Launcher.java:129)
	at sun.reflect.NativeMethodAccessorImpl.invoke0(Native Method)
	at sun.reflect.NativeMethodAccessorImpl.invoke(NativeMethodAccessorImpl.java:62)
	at sun.reflect.DelegatingMethodAccessorImpl.invoke(DelegatingMethodAccessorImpl.java:43)
	at java.lang.reflect.Method.invoke(Method.java:498)
	at org.codehaus.plexus.classworlds.launcher.Launcher.launchStandard(Launcher.java:330)
	at org.codehaus.plexus.classworlds.launcher.Launcher.launch(Launcher.java:238)
	at jenkins.maven3.agent.Maven33Main.launch(Maven33Main.java:176)
	at sun.reflect.NativeMethodAccessorImpl.invoke0(Native Method)
	at sun.reflect.NativeMethodAccessorImpl.invoke(NativeMethodAccessorImpl.java:62)
	at sun.reflect.DelegatingMethodAccessorImpl.invoke(DelegatingMethodAccessorImpl.java:43)
	at java.lang.reflect.Method.invoke(Method.java:498)
	at hudson.maven.Maven3Builder.call(Maven3Builder.java:139)
	at hudson.maven.Maven3Builder.call(Maven3Builder.java:70)
	at hudson.remoting.UserRequest.perform(UserRequest.java:120)
	at hudson.remoting.UserRequest.perform(UserRequest.java:48)
	at hudson.remoting.Request$2.run(Request.java:326)
	at hudson.remoting.InterceptingExecutorService$1.call(InterceptingExecutorService.java:68)
	at java.util.concurrent.FutureTask.run(FutureTask.java:266)
	at java.util.concurrent.ThreadPoolExecutor.runWorker(ThreadPoolExecutor.java:1142)
	at java.util.concurrent.ThreadPoolExecutor$Worker.run(ThreadPoolExecutor.java:617)
	at java.lang.Thread.run(Thread.java:745)
Caused by: org.apache.maven.plugin.MojoFailureException: Unable to find Python 2.7 in path
	at sun.reflect.NativeConstructorAccessorImpl.newInstance0(Native Method)
	at sun.reflect.NativeConstructorAccessorImpl.newInstance(NativeConstructorAccessorImpl.java:62)
	at sun.reflect.DelegatingConstructorAccessorImpl.newInstance(DelegatingConstructorAccessorImpl.java:45)
	at java.lang.reflect.Constructor.newInstance(Constructor.java:423)
	at org.codehaus.groovy.reflection.CachedConstructor.invoke(CachedConstructor.java:77)
	at org.codehaus.groovy.runtime.callsite.ConstructorSite$ConstructorSiteNoUnwrapNoCoerce.callConstructor(ConstructorSite.java:102)
	at org.codehaus.groovy.runtime.callsite.CallSiteArray.defaultCallConstructor(CallSiteArray.java:57)
	at org.codehaus.groovy.runtime.callsite.AbstractCallSite.callConstructor(AbstractCallSite.java:182)
	at org.codehaus.groovy.runtime.callsite.AbstractCallSite.callConstructor(AbstractCallSite.java:190)
	at findSupportedPython.run(findSupportedPython.groovy:70)
	at groovy.lang.GroovyShell.evaluate(GroovyShell.java:518)
	at org.codehaus.gmaven.adapter.impl.ScriptExecutorImpl.execute(ScriptExecutorImpl.java:80)
	at org.codehaus.gmaven.plugin.ExecuteMojo$1.run(ExecuteMojo.java:100)
	at org.codehaus.gmaven.plugin.util.SystemNoExitGuard.run(SystemNoExitGuard.java:45)
	at org.codehaus.gmaven.plugin.ExecuteMojo.run(ExecuteMojo.java:96)
	at org.codehaus.gmaven.plugin.MojoSupport.execute(MojoSupport.java:45)
	at org.apache.maven.plugin.DefaultBuildPluginManager.executeMojo(DefaultBuildPluginManager.java:134)
	at org.apache.maven.lifecycle.internal.MojoExecutor.execute(MojoExecutor.java:208)
	... 31 more
2017-06-05T12:36:15.512 [ERROR] 
2017-06-05T12:36:15.512 [ERROR] Re-run Maven using the -X switch to enable full debug logging.
2017-06-05T12:36:15.512 [ERROR] 
2017-06-05T12:36:15.512 [ERROR] For more information about the errors and possible solutions,
please read the following articles:
2017-06-05T12:36:15.512 [ERROR] [Help 1] http://cwiki.apache.org/confluence/display/MAVEN/MojoFailureException
2017-06-05T12:36:15.513 [ERROR] 
2017-06-05T12:36:15.513 [ERROR] After correcting the problems, you can resume the build with
the command
2017-06-05T12:36:15.513 [ERROR]   mvn <goals> -rf :beam-sdks-python
channel stopped
Not sending mail to unregistered user github@nakomis.com
Not sending mail to unregistered user mingmxu@ebay.com
Not sending mail to unregistered user kirpichov@google.com
Not sending mail to unregistered user aljoscha.krettek@gmail.com
Not sending mail to unregistered user klk@google.com
Not sending mail to unregistered user sourabhbajaj@google.com
Not sending mail to unregistered user hepei.hp@alibaba-inc.com

Mime
View raw message