beam-commits mailing list archives

Site index · List index
Message view « Date » · « Thread »
Top « Date » · « Thread »
From Apache Jenkins Server <jenk...@builds.apache.org>
Subject Build failed in Jenkins: beam_PostCommit_Java_ValidatesRunner_Spark #2360
Date Tue, 13 Jun 2017 23:34:50 GMT
See <https://builds.apache.org/job/beam_PostCommit_Java_ValidatesRunner_Spark/2360/display/redirect?page=changes>

Changes:

[ccy] Move Runner API protos to portability/api

------------------------------------------
[...truncated 492.56 KB...]
2017-06-13T23:34:01.001 [INFO] Running org.apache.beam.sdk.transforms.RegexTest
2017-06-13T23:34:02.522 [INFO] Tests run: 27, Failures: 0, Errors: 0, Skipped: 0, Time elapsed:
1.52 s - in org.apache.beam.sdk.transforms.RegexTest
2017-06-13T23:34:02.522 [INFO] Running org.apache.beam.sdk.transforms.ParDoTest
2017-06-13T23:34:06.784 [INFO] Tests run: 63, Failures: 0, Errors: 0, Skipped: 0, Time elapsed:
4.259 s - in org.apache.beam.sdk.transforms.ParDoTest
2017-06-13T23:34:06.784 [INFO] Running org.apache.beam.sdk.testing.TestStreamTest
2017-06-13T23:34:07.531 [INFO] Tests run: 6, Failures: 0, Errors: 0, Skipped: 0, Time elapsed:
0.743 s - in org.apache.beam.sdk.testing.TestStreamTest
2017-06-13T23:34:07.532 [INFO] Running org.apache.beam.sdk.testing.GatherAllPanesTest
2017-06-13T23:34:10.020 [INFO] Tests run: 2, Failures: 0, Errors: 0, Skipped: 0, Time elapsed:
2.486 s - in org.apache.beam.sdk.testing.GatherAllPanesTest
2017-06-13T23:34:10.020 [INFO] Running org.apache.beam.sdk.transforms.ApproximateUniqueTest$ApproximateUniqueWithDuplicatesTest
2017-06-13T23:34:10.694 [INFO] Tests run: 4, Failures: 0, Errors: 0, Skipped: 0, Time elapsed:
0.672 s - in org.apache.beam.sdk.transforms.ApproximateUniqueTest$ApproximateUniqueWithDuplicatesTest
2017-06-13T23:34:10.694 [INFO] Running org.apache.beam.sdk.transforms.ApproximateUniqueTest$ApproximateUniqueVariationsTest
2017-06-13T23:34:12.772 [INFO] Tests run: 8, Failures: 0, Errors: 0, Skipped: 0, Time elapsed:
2.074 s - in org.apache.beam.sdk.transforms.ApproximateUniqueTest$ApproximateUniqueVariationsTest
2017-06-13T23:34:12.772 [INFO] Running org.apache.beam.sdk.transforms.ApproximateUniqueTest$ApproximateUniqueMiscTest
2017-06-13T23:34:13.380 [INFO] Tests run: 3, Failures: 0, Errors: 0, Skipped: 0, Time elapsed:
0.607 s - in org.apache.beam.sdk.transforms.ApproximateUniqueTest$ApproximateUniqueMiscTest
2017-06-13T23:34:13.380 [INFO] Running org.apache.beam.sdk.transforms.GroupByKeyTest
2017-06-13T23:34:33.612 [INFO] Tests run: 13, Failures: 0, Errors: 0, Skipped: 0, Time elapsed:
20.23 s - in org.apache.beam.sdk.transforms.GroupByKeyTest
2017-06-13T23:34:33.612 [INFO] Running org.apache.beam.sdk.transforms.ParDoLifecycleTest
2017-06-13T23:34:33.833 [INFO] Tests run: 12, Failures: 0, Errors: 0, Skipped: 0, Time elapsed:
0.22 s - in org.apache.beam.sdk.transforms.ParDoLifecycleTest
2017-06-13T23:34:33.833 [INFO] Running org.apache.beam.sdk.transforms.join.CoGroupByKeyTest
2017-06-13T23:34:34.228 [INFO] Tests run: 4, Failures: 0, Errors: 0, Skipped: 0, Time elapsed:
0.394 s - in org.apache.beam.sdk.transforms.join.CoGroupByKeyTest
2017-06-13T23:34:34.228 [INFO] Running org.apache.beam.sdk.transforms.ValuesTest
2017-06-13T23:34:34.339 [INFO] Tests run: 2, Failures: 0, Errors: 0, Skipped: 0, Time elapsed:
0.11 s - in org.apache.beam.sdk.transforms.ValuesTest
2017-06-13T23:34:34.339 [INFO] Running org.apache.beam.sdk.transforms.CreateTest
2017-06-13T23:34:34.849 [INFO] Tests run: 10, Failures: 0, Errors: 0, Skipped: 0, Time elapsed:
0.508 s - in org.apache.beam.sdk.transforms.CreateTest
2017-06-13T23:34:34.849 [INFO] Running org.apache.beam.sdk.transforms.DistinctTest
2017-06-13T23:34:35.234 [INFO] Tests run: 6, Failures: 0, Errors: 0, Skipped: 0, Time elapsed:
0.384 s - in org.apache.beam.sdk.transforms.DistinctTest
2017-06-13T23:34:35.706 [INFO] 
2017-06-13T23:34:35.706 [INFO] Results:
2017-06-13T23:34:35.706 [INFO] 
2017-06-13T23:34:35.706 [WARNING] Tests run: 483, Failures: 0, Errors: 0, Skipped: 1
2017-06-13T23:34:35.706 [INFO] 
[JENKINS] Recording test results
2017-06-13T23:34:39.147 [INFO] 
2017-06-13T23:34:39.147 [INFO] --- maven-dependency-plugin:3.0.1:analyze-only (default) @
beam-runners-direct-java ---
2017-06-13T23:34:39.237 [INFO] No dependency problems found
[JENKINS] Archiving disabled
2017-06-13T23:34:40.074 [INFO]                                                           
             
2017-06-13T23:34:40.074 [INFO] ------------------------------------------------------------------------
2017-06-13T23:34:40.074 [INFO] Building Apache Beam :: SDKs :: Java :: IO 2.1.0-SNAPSHOT
2017-06-13T23:34:40.074 [INFO] ------------------------------------------------------------------------
2017-06-13T23:34:40.077 [INFO] 
2017-06-13T23:34:40.077 [INFO] --- maven-clean-plugin:3.0.0:clean (default-clean) @ beam-sdks-java-io-parent
---
2017-06-13T23:34:40.078 [INFO] Deleting <https://builds.apache.org/job/beam_PostCommit_Java_ValidatesRunner_Spark/ws/sdks/java/io>
(includes = [**/*.pyc, **/*.egg-info/, **/sdks/python/LICENSE, **/sdks/python/NOTICE, **/sdks/python/README.md],
excludes = [])
2017-06-13T23:34:40.140 [INFO] 
2017-06-13T23:34:40.140 [INFO] --- maven-enforcer-plugin:1.4.1:enforce (enforce) @ beam-sdks-java-io-parent
---
2017-06-13T23:34:40.190 [INFO] 
2017-06-13T23:34:40.190 [INFO] --- maven-enforcer-plugin:1.4.1:enforce (enforce-banned-dependencies)
@ beam-sdks-java-io-parent ---
2017-06-13T23:34:40.240 [INFO] 
2017-06-13T23:34:40.240 [INFO] --- maven-remote-resources-plugin:1.5:process (process-resource-bundles)
@ beam-sdks-java-io-parent ---
2017-06-13T23:34:40.298 [INFO] 
2017-06-13T23:34:40.298 [INFO] --- maven-checkstyle-plugin:2.17:check (default) @ beam-sdks-java-io-parent
---
2017-06-13T23:34:40.644 [INFO] Starting audit...
Audit done.
2017-06-13T23:34:40.693 [INFO] 
2017-06-13T23:34:40.693 [INFO] --- build-helper-maven-plugin:3.0.0:regex-properties (render-artifact-id)
@ beam-sdks-java-io-parent ---
2017-06-13T23:34:40.742 [INFO] 
2017-06-13T23:34:40.742 [INFO] --- maven-site-plugin:3.5.1:attach-descriptor (attach-descriptor)
@ beam-sdks-java-io-parent ---
2017-06-13T23:34:40.840 [INFO] 
2017-06-13T23:34:40.840 [INFO] --- maven-jar-plugin:3.0.2:jar (default-jar) @ beam-sdks-java-io-parent
---
2017-06-13T23:34:40.840 [INFO] Skipping packaging of the jar
2017-06-13T23:34:41.056 [INFO] 
2017-06-13T23:34:41.056 [INFO] --- maven-jar-plugin:3.0.2:test-jar (default-test-jar) @ beam-sdks-java-io-parent
---
2017-06-13T23:34:41.057 [INFO] Skipping packaging of the test-jar
2017-06-13T23:34:41.143 [INFO] 
2017-06-13T23:34:41.144 [INFO] --- maven-shade-plugin:3.0.0:shade (bundle-and-repackage) @
beam-sdks-java-io-parent ---
2017-06-13T23:34:41.146 [INFO] Replacing original artifact with shaded artifact.
2017-06-13T23:34:41.197 [INFO] 
2017-06-13T23:34:41.197 [INFO] --- maven-dependency-plugin:3.0.1:analyze-only (default) @
beam-sdks-java-io-parent ---
2017-06-13T23:34:41.197 [INFO] Skipping pom project
[JENKINS] Archiving disabled
2017-06-13T23:34:41.741 [INFO]                                                           
             
2017-06-13T23:34:41.741 [INFO] ------------------------------------------------------------------------
2017-06-13T23:34:41.742 [INFO] Building Apache Beam :: SDKs :: Java :: IO :: Kafka 2.1.0-SNAPSHOT
2017-06-13T23:34:41.742 [INFO] ------------------------------------------------------------------------
2017-06-13T23:34:41.745 [INFO] Downloading: https://repo.maven.apache.org/maven2/org/apache/kafka/kafka-clients/0.10.1.0/kafka-clients-0.10.1.0.pom
[INFO] I/O exception (java.net.SocketException) caught when processing request to {s}->https://repo.maven.apache.org:443:
Connection reset
[INFO] Retrying request to {s}->https://repo.maven.apache.org:443
[INFO] I/O exception (java.net.SocketException) caught when processing request to {s}->https://repo.maven.apache.org:443:
Connection reset
[INFO] Retrying request to {s}->https://repo.maven.apache.org:443
[INFO] I/O exception (java.net.SocketException) caught when processing request to {s}->https://repo.maven.apache.org:443:
Connection reset
[INFO] Retrying request to {s}->https://repo.maven.apache.org:443
2017-06-13T23:34:41.802 [INFO] Downloading: https://repo.maven.apache.org/maven2/org/springframework/spring-expression/4.3.5.RELEASE/spring-expression-4.3.5.RELEASE.pom
2017-06-13T23:34:41.830 [INFO] Downloaded: https://repo.maven.apache.org/maven2/org/springframework/spring-expression/4.3.5.RELEASE/spring-expression-4.3.5.RELEASE.pom
(2 KB at 60.1 KB/sec)
2017-06-13T23:34:41.832 [INFO] Downloading: https://repo.maven.apache.org/maven2/org/springframework/spring-core/4.3.5.RELEASE/spring-core-4.3.5.RELEASE.pom
2017-06-13T23:34:41.858 [INFO] Downloaded: https://repo.maven.apache.org/maven2/org/springframework/spring-core/4.3.5.RELEASE/spring-core-4.3.5.RELEASE.pom
(3 KB at 93.6 KB/sec)
2017-06-13T23:34:41.859 [INFO] Downloading: https://repo.maven.apache.org/maven2/commons-logging/commons-logging/1.2/commons-logging-1.2.pom
2017-06-13T23:34:41.887 [INFO] Downloaded: https://repo.maven.apache.org/maven2/commons-logging/commons-logging/1.2/commons-logging-1.2.pom
(19 KB at 669.9 KB/sec)
[JENKINS] Archiving disabled
[JENKINS] Archiving disabled
[JENKINS] Archiving disabled
[JENKINS] Archiving disabled
[JENKINS] Archiving disabled
[JENKINS] Archiving disabled
[JENKINS] Archiving disabled
[JENKINS] Archiving disabled
[JENKINS] Archiving disabled
[JENKINS] Archiving disabled
[JENKINS] Archiving disabled
[JENKINS] Archiving disabled
[JENKINS] Archiving disabled
[JENKINS] Archiving disabled
[JENKINS] Archiving disabled
[JENKINS] Archiving disabled
2017-06-13T23:34:46.779 [INFO] ------------------------------------------------------------------------
2017-06-13T23:34:46.779 [INFO] Reactor Summary:
2017-06-13T23:34:46.779 [INFO] 
2017-06-13T23:34:46.779 [INFO] Apache Beam :: Parent .............................. SUCCESS
[ 22.423 s]
2017-06-13T23:34:46.779 [INFO] Apache Beam :: SDKs :: Java :: Build Tools ......... SUCCESS
[  7.619 s]
2017-06-13T23:34:46.779 [INFO] Apache Beam :: SDKs ................................ SUCCESS
[  1.283 s]
2017-06-13T23:34:46.779 [INFO] Apache Beam :: SDKs :: Common ...................... SUCCESS
[  1.240 s]
2017-06-13T23:34:46.779 [INFO] Apache Beam :: SDKs :: Common :: Runner API ........ SUCCESS
[  9.567 s]
2017-06-13T23:34:46.779 [INFO] Apache Beam :: SDKs :: Common :: Fn API ............ SUCCESS
[  6.044 s]
2017-06-13T23:34:46.779 [INFO] Apache Beam :: SDKs :: Java ........................ SUCCESS
[  1.275 s]
2017-06-13T23:34:46.779 [INFO] Apache Beam :: SDKs :: Java :: Core ................ SUCCESS
[01:52 min]
2017-06-13T23:34:46.779 [INFO] Apache Beam :: Runners ............................. SUCCESS
[  1.278 s]
2017-06-13T23:34:46.779 [INFO] Apache Beam :: Runners :: Core Construction Java ... SUCCESS
[ 17.508 s]
2017-06-13T23:34:46.779 [INFO] Apache Beam :: Runners :: Core Java ................ SUCCESS
[ 29.017 s]
2017-06-13T23:34:46.779 [INFO] Apache Beam :: Runners :: Direct Java .............. SUCCESS
[03:02 min]
2017-06-13T23:34:46.779 [INFO] Apache Beam :: SDKs :: Java :: IO .................. SUCCESS
[  1.286 s]
2017-06-13T23:34:46.779 [INFO] Apache Beam :: SDKs :: Java :: IO :: Kafka ......... FAILURE
[  0.275 s]
2017-06-13T23:34:46.779 [INFO] Apache Beam :: Runners :: Spark .................... SKIPPED
2017-06-13T23:34:46.779 [INFO] ------------------------------------------------------------------------
2017-06-13T23:34:46.779 [INFO] BUILD FAILURE
2017-06-13T23:34:46.779 [INFO] ------------------------------------------------------------------------
2017-06-13T23:34:46.779 [INFO] Total time: 07:04 min
2017-06-13T23:34:46.779 [INFO] Finished at: 2017-06-13T23:34:46+00:00
2017-06-13T23:34:47.269 [INFO] Final Memory: 119M/1457M
2017-06-13T23:34:47.270 [INFO] ------------------------------------------------------------------------
2017-06-13T23:34:47.270 [WARNING] The requested profile "validates-runner-tests" could not
be activated because it does not exist.
2017-06-13T23:34:47.274 [ERROR] Failed to execute goal on project beam-sdks-java-io-kafka:
Could not resolve dependencies for project org.apache.beam:beam-sdks-java-io-kafka:jar:2.1.0-SNAPSHOT:
Failed to collect dependencies at org.apache.kafka:kafka-clients:jar:0.10.1.0: Failed to read
artifact descriptor for org.apache.kafka:kafka-clients:jar:0.10.1.0: Could not transfer artifact
org.apache.kafka:kafka-clients:pom:0.10.1.0 from/to central (https://repo.maven.apache.org/maven2):
Connection reset -> [Help 1]
org.apache.maven.lifecycle.LifecycleExecutionException: Failed to execute goal on project
beam-sdks-java-io-kafka: Could not resolve dependencies for project org.apache.beam:beam-sdks-java-io-kafka:jar:2.1.0-SNAPSHOT:
Failed to collect dependencies at org.apache.kafka:kafka-clients:jar:0.10.1.0
	at org.apache.maven.lifecycle.internal.LifecycleDependencyResolver.getDependencies(LifecycleDependencyResolver.java:221)
	at org.apache.maven.lifecycle.internal.LifecycleDependencyResolver.resolveProjectDependencies(LifecycleDependencyResolver.java:127)
	at org.apache.maven.lifecycle.internal.MojoExecutor.ensureDependenciesAreResolved(MojoExecutor.java:257)
	at org.apache.maven.lifecycle.internal.MojoExecutor.execute(MojoExecutor.java:200)
	at org.apache.maven.lifecycle.internal.MojoExecutor.execute(MojoExecutor.java:153)
	at org.apache.maven.lifecycle.internal.MojoExecutor.execute(MojoExecutor.java:145)
	at org.apache.maven.lifecycle.internal.LifecycleModuleBuilder.buildProject(LifecycleModuleBuilder.java:116)
	at org.apache.maven.lifecycle.internal.LifecycleModuleBuilder.buildProject(LifecycleModuleBuilder.java:80)
	at org.apache.maven.lifecycle.internal.builder.singlethreaded.SingleThreadedBuilder.build(SingleThreadedBuilder.java:51)
	at org.apache.maven.lifecycle.internal.LifecycleStarter.execute(LifecycleStarter.java:128)
	at org.apache.maven.DefaultMaven.doExecute(DefaultMaven.java:307)
	at org.apache.maven.DefaultMaven.doExecute(DefaultMaven.java:193)
	at org.apache.maven.DefaultMaven.execute(DefaultMaven.java:106)
	at org.jvnet.hudson.maven3.launcher.Maven33Launcher.main(Maven33Launcher.java:129)
	at sun.reflect.NativeMethodAccessorImpl.invoke0(Native Method)
	at sun.reflect.NativeMethodAccessorImpl.invoke(NativeMethodAccessorImpl.java:62)
	at sun.reflect.DelegatingMethodAccessorImpl.invoke(DelegatingMethodAccessorImpl.java:43)
	at java.lang.reflect.Method.invoke(Method.java:498)
	at org.codehaus.plexus.classworlds.launcher.Launcher.launchStandard(Launcher.java:330)
	at org.codehaus.plexus.classworlds.launcher.Launcher.launch(Launcher.java:238)
	at jenkins.maven3.agent.Maven33Main.launch(Maven33Main.java:176)
	at sun.reflect.NativeMethodAccessorImpl.invoke0(Native Method)
	at sun.reflect.NativeMethodAccessorImpl.invoke(NativeMethodAccessorImpl.java:62)
	at sun.reflect.DelegatingMethodAccessorImpl.invoke(DelegatingMethodAccessorImpl.java:43)
	at java.lang.reflect.Method.invoke(Method.java:498)
	at hudson.maven.Maven3Builder.call(Maven3Builder.java:139)
	at hudson.maven.Maven3Builder.call(Maven3Builder.java:70)
	at hudson.remoting.UserRequest.perform(UserRequest.java:153)
	at hudson.remoting.UserRequest.perform(UserRequest.java:50)
	at hudson.remoting.Request$2.run(Request.java:336)
	at hudson.remoting.InterceptingExecutorService$1.call(InterceptingExecutorService.java:68)
	at java.util.concurrent.FutureTask.run(FutureTask.java:266)
	at java.util.concurrent.ThreadPoolExecutor.runWorker(ThreadPoolExecutor.java:1142)
	at java.util.concurrent.ThreadPoolExecutor$Worker.run(ThreadPoolExecutor.java:617)
	at java.lang.Thread.run(Thread.java:748)
Caused by: org.apache.maven.project.DependencyResolutionException: Could not resolve dependencies
for project org.apache.beam:beam-sdks-java-io-kafka:jar:2.1.0-SNAPSHOT: Failed to collect
dependencies at org.apache.kafka:kafka-clients:jar:0.10.1.0
	at org.apache.maven.project.DefaultProjectDependenciesResolver.resolve(DefaultProjectDependenciesResolver.java:180)
	at org.apache.maven.lifecycle.internal.LifecycleDependencyResolver.getDependencies(LifecycleDependencyResolver.java:195)
	... 34 more
Caused by: org.eclipse.aether.collection.DependencyCollectionException: Failed to collect
dependencies at org.apache.kafka:kafka-clients:jar:0.10.1.0
	at org.eclipse.aether.internal.impl.DefaultDependencyCollector.collectDependencies(DefaultDependencyCollector.java:291)
	at org.eclipse.aether.internal.impl.DefaultRepositorySystem.collectDependencies(DefaultRepositorySystem.java:316)
	at org.apache.maven.project.DefaultProjectDependenciesResolver.resolve(DefaultProjectDependenciesResolver.java:172)
	... 35 more
Caused by: org.eclipse.aether.resolution.ArtifactDescriptorException: Failed to read artifact
descriptor for org.apache.kafka:kafka-clients:jar:0.10.1.0
	at org.apache.maven.repository.internal.DefaultArtifactDescriptorReader.loadPom(DefaultArtifactDescriptorReader.java:302)
	at org.apache.maven.repository.internal.DefaultArtifactDescriptorReader.readArtifactDescriptor(DefaultArtifactDescriptorReader.java:218)
	at org.eclipse.aether.internal.impl.DefaultDependencyCollector.resolveCachedArtifactDescriptor(DefaultDependencyCollector.java:535)
	at org.eclipse.aether.internal.impl.DefaultDependencyCollector.getArtifactDescriptorResult(DefaultDependencyCollector.java:519)
	at org.eclipse.aether.internal.impl.DefaultDependencyCollector.processDependency(DefaultDependencyCollector.java:409)
	at org.eclipse.aether.internal.impl.DefaultDependencyCollector.processDependency(DefaultDependencyCollector.java:363)
	at org.eclipse.aether.internal.impl.DefaultDependencyCollector.process(DefaultDependencyCollector.java:351)
	at org.eclipse.aether.internal.impl.DefaultDependencyCollector.collectDependencies(DefaultDependencyCollector.java:254)
	... 37 more
Caused by: org.eclipse.aether.resolution.ArtifactResolutionException: Could not transfer artifact
org.apache.kafka:kafka-clients:pom:0.10.1.0 from/to central (https://repo.maven.apache.org/maven2):
Connection reset
	at org.eclipse.aether.internal.impl.DefaultArtifactResolver.resolve(DefaultArtifactResolver.java:444)
	at org.eclipse.aether.internal.impl.DefaultArtifactResolver.resolveArtifacts(DefaultArtifactResolver.java:246)
	at org.eclipse.aether.internal.impl.DefaultArtifactResolver.resolveArtifact(DefaultArtifactResolver.java:223)
	at org.apache.maven.repository.internal.DefaultArtifactDescriptorReader.loadPom(DefaultArtifactDescriptorReader.java:287)
	... 44 more
Caused by: org.eclipse.aether.transfer.ArtifactTransferException: Could not transfer artifact
org.apache.kafka:kafka-clients:pom:0.10.1.0 from/to central (https://repo.maven.apache.org/maven2):
Connection reset
	at org.eclipse.aether.connector.basic.ArtifactTransportListener.transferFailed(ArtifactTransportListener.java:43)
	at org.eclipse.aether.connector.basic.BasicRepositoryConnector$TaskRunner.run(BasicRepositoryConnector.java:355)
	at org.eclipse.aether.util.concurrency.RunnableErrorForwarder$1.run(RunnableErrorForwarder.java:67)
	at org.eclipse.aether.connector.basic.BasicRepositoryConnector$DirectExecutor.execute(BasicRepositoryConnector.java:581)
	at org.eclipse.aether.connector.basic.BasicRepositoryConnector.get(BasicRepositoryConnector.java:249)
	at org.eclipse.aether.internal.impl.DefaultArtifactResolver.performDownloads(DefaultArtifactResolver.java:520)
	at org.eclipse.aether.internal.impl.DefaultArtifactResolver.resolve(DefaultArtifactResolver.java:421)
	... 47 more
Caused by: org.apache.maven.wagon.TransferFailedException: Connection reset
	at org.apache.maven.wagon.providers.http.AbstractHttpClientWagon.fillInputData(AbstractHttpClientWagon.java:1066)
	at org.apache.maven.wagon.providers.http.AbstractHttpClientWagon.fillInputData(AbstractHttpClientWagon.java:960)
	at org.apache.maven.wagon.StreamWagon.getInputStream(StreamWagon.java:116)
	at org.apache.maven.wagon.StreamWagon.getIfNewer(StreamWagon.java:88)
	at org.apache.maven.wagon.StreamWagon.get(StreamWagon.java:61)
	at org.eclipse.aether.transport.wagon.WagonTransporter$GetTaskRunner.run(WagonTransporter.java:560)
	at org.eclipse.aether.transport.wagon.WagonTransporter.execute(WagonTransporter.java:427)
	at org.eclipse.aether.transport.wagon.WagonTransporter.get(WagonTransporter.java:404)
	at org.eclipse.aether.connector.basic.BasicRepositoryConnector$GetTaskRunner.runTask(BasicRepositoryConnector.java:447)
	at org.eclipse.aether.connector.basic.BasicRepositoryConnector$TaskRunner.run(BasicRepositoryConnector.java:350)
	... 52 more
Caused by: java.net.SocketException: Connection reset
	at java.net.SocketInputStream.read(SocketInputStream.java:210)
	at java.net.SocketInputStream.read(SocketInputStream.java:141)
	at sun.security.ssl.InputRecord.readFully(InputRecord.java:465)
	at sun.security.ssl.InputRecord.read(InputRecord.java:503)
	at sun.security.ssl.SSLSocketImpl.readRecord(SSLSocketImpl.java:973)
	at sun.security.ssl.SSLSocketImpl.readDataRecord(SSLSocketImpl.java:930)
	at sun.security.ssl.AppInputStream.read(AppInputStream.java:105)
	at org.apache.maven.wagon.providers.http.httpclient.impl.io.SessionInputBufferImpl.streamRead(SessionInputBufferImpl.java:136)
	at org.apache.maven.wagon.providers.http.httpclient.impl.io.SessionInputBufferImpl.fillBuffer(SessionInputBufferImpl.java:152)
	at org.apache.maven.wagon.providers.http.httpclient.impl.io.SessionInputBufferImpl.readLine(SessionInputBufferImpl.java:270)
	at org.apache.maven.wagon.providers.http.httpclient.impl.conn.DefaultHttpResponseParser.parseHead(DefaultHttpResponseParser.java:140)
	at org.apache.maven.wagon.providers.http.httpclient.impl.conn.DefaultHttpResponseParser.parseHead(DefaultHttpResponseParser.java:57)
	at org.apache.maven.wagon.providers.http.httpclient.impl.io.AbstractMessageParser.parse(AbstractMessageParser.java:260)
	at org.apache.maven.wagon.providers.http.httpclient.impl.DefaultBHttpClientConnection.receiveResponseHeader(DefaultBHttpClientConnection.java:161)
	at org.apache.maven.wagon.providers.http.httpclient.impl.conn.CPoolProxy.receiveResponseHeader(CPoolProxy.java:153)
	at org.apache.maven.wagon.providers.http.httpclient.protocol.HttpRequestExecutor.doReceiveResponse(HttpRequestExecutor.java:271)
	at org.apache.maven.wagon.providers.http.httpclient.protocol.HttpRequestExecutor.execute(HttpRequestExecutor.java:123)
	at org.apache.maven.wagon.providers.http.httpclient.impl.execchain.MainClientExec.execute(MainClientExec.java:254)
	at org.apache.maven.wagon.providers.http.httpclient.impl.execchain.ProtocolExec.execute(ProtocolExec.java:195)
	at org.apache.maven.wagon.providers.http.httpclient.impl.execchain.RetryExec.execute(RetryExec.java:86)
	at org.apache.maven.wagon.providers.http.httpclient.impl.execchain.RedirectExec.execute(RedirectExec.java:108)
	at org.apache.maven.wagon.providers.http.httpclient.impl.client.InternalHttpClient.doExecute(InternalHttpClient.java:184)
	at org.apache.maven.wagon.providers.http.httpclient.impl.client.CloseableHttpClient.execute(CloseableHttpClient.java:82)
	at org.apache.maven.wagon.providers.http.AbstractHttpClientWagon.execute(AbstractHttpClientWagon.java:832)
	at org.apache.maven.wagon.providers.http.AbstractHttpClientWagon.fillInputData(AbstractHttpClientWagon.java:983)
	... 61 more
2017-06-13T23:34:47.277 [ERROR] 
2017-06-13T23:34:47.277 [ERROR] Re-run Maven using the -X switch to enable full debug logging.
2017-06-13T23:34:47.277 [ERROR] 
2017-06-13T23:34:47.277 [ERROR] For more information about the errors and possible solutions,
please read the following articles:
2017-06-13T23:34:47.277 [ERROR] [Help 1] http://cwiki.apache.org/confluence/display/MAVEN/DependencyResolutionException
2017-06-13T23:34:47.277 [ERROR] 
2017-06-13T23:34:47.277 [ERROR] After correcting the problems, you can resume the build with
the command
2017-06-13T23:34:47.277 [ERROR]   mvn <goals> -rf :beam-sdks-java-io-kafka
channel stopped
Not sending mail to unregistered user ccy@google.com

Mime
View raw message