beam-commits mailing list archives

Site index · List index
Message view « Date » · « Thread »
Top « Date » · « Thread »
From Apache Jenkins Server <jenk...@builds.apache.org>
Subject Build failed in Jenkins: beam_PostCommit_Java_JDK_Versions_Test » JDK 1.7 (latest),beam #106
Date Tue, 20 Jun 2017 00:17:53 GMT
See <https://builds.apache.org/job/beam_PostCommit_Java_JDK_Versions_Test/jdk=JDK%201.7%20(latest),label=beam/106/display/redirect?page=changes>

Changes:

[robertwb] Add dry run option to DataflowRunner

[jbonofre] [BEAM-975] Improve default connection options, javadoc and style in

[iemejia] Make HBaseIO tests faster by only using the core daemons needed by HBase

[lcwik] [BEAM-1348] Fix type error introduced into Python SDK because of PR/3268

------------------------------------------
[...truncated 852.20 KB...]
2017-06-20\T\00:17:21.630 [INFO] Downloaded: https://repo.maven.apache.org/maven2/org/apache/hadoop/hadoop-mapreduce-client-shuffle/2.5.1/hadoop-mapreduce-client-shuffle-2.5.1.jar
(43 KB at 29.0 KB/sec)
2017-06-20\T\00:17:21.630 [INFO] Downloading: https://repo.maven.apache.org/maven2/org/apache/hadoop/hadoop-yarn-api/2.5.1/hadoop-yarn-api-2.5.1.jar
2017-06-20\T\00:17:21.654 [INFO] Downloaded: https://repo.maven.apache.org/maven2/org/apache/hadoop/hadoop-yarn-server-web-proxy/2.5.1/hadoop-yarn-server-web-proxy-2.5.1.jar
(28 KB at 18.6 KB/sec)
2017-06-20\T\00:17:21.654 [INFO] Downloading: https://repo.maven.apache.org/maven2/org/apache/hadoop/hadoop-mapreduce-client-jobclient/2.5.1/hadoop-mapreduce-client-jobclient-2.5.1.jar
2017-06-20\T\00:17:21.684 [INFO] Downloaded: https://repo.maven.apache.org/maven2/org/apache/hadoop/hadoop-mapreduce-client-app/2.5.1/hadoop-mapreduce-client-app-2.5.1.jar
(480 KB at 315.1 KB/sec)
2017-06-20\T\00:17:21.684 [INFO] Downloading: https://repo.maven.apache.org/maven2/org/apache/hadoop/hadoop-mapreduce-client-hs/2.5.1/hadoop-mapreduce-client-hs-2.5.1.jar
2017-06-20\T\00:17:21.694 [INFO] Downloaded: https://repo.maven.apache.org/maven2/org/apache/hadoop/hadoop-mapreduce-client-jobclient/2.5.1/hadoop-mapreduce-client-jobclient-2.5.1.jar
(35 KB at 22.8 KB/sec)
2017-06-20\T\00:17:21.694 [INFO] Downloading: https://repo.maven.apache.org/maven2/org/apache/hadoop/hadoop-common/2.5.1/hadoop-common-2.5.1.jar
2017-06-20\T\00:17:21.737 [INFO] Downloaded: https://repo.maven.apache.org/maven2/org/apache/hadoop/hadoop-mapreduce-client-hs/2.5.1/hadoop-mapreduce-client-hs-2.5.1.jar
(228 KB at 144.4 KB/sec)
2017-06-20\T\00:17:21.737 [INFO] Downloading: https://repo.maven.apache.org/maven2/org/apache/hadoop/hadoop-annotations/2.5.1/hadoop-annotations-2.5.1.jar
2017-06-20\T\00:17:21.764 [INFO] Downloaded: https://repo.maven.apache.org/maven2/org/apache/hadoop/hadoop-annotations/2.5.1/hadoop-annotations-2.5.1.jar
(17 KB at 10.4 KB/sec)
2017-06-20\T\00:17:21.764 [INFO] Downloading: https://repo.maven.apache.org/maven2/commons-el/commons-el/1.0/commons-el-1.0.jar
2017-06-20\T\00:17:21.785 [INFO] Downloaded: https://repo.maven.apache.org/maven2/org/apache/hadoop/hadoop-yarn-api/2.5.1/hadoop-yarn-api-2.5.1.jar
(1612 KB at 992.1 KB/sec)
2017-06-20\T\00:17:21.785 [INFO] Downloading: https://repo.maven.apache.org/maven2/org/apache/hbase/hbase-hadoop-compat/1.2.6/hbase-hadoop-compat-1.2.6-tests.jar
2017-06-20\T\00:17:21.808 [INFO] Downloaded: https://repo.maven.apache.org/maven2/commons-el/commons-el/1.0/commons-el-1.0.jar
(110 KB at 66.6 KB/sec)
2017-06-20\T\00:17:21.808 [INFO] Downloading: https://repo.maven.apache.org/maven2/org/apache/hbase/hbase-hadoop2-compat/1.2.6/hbase-hadoop2-compat-1.2.6-tests.jar
2017-06-20\T\00:17:21.816 [INFO] Downloaded: https://repo.maven.apache.org/maven2/org/apache/hbase/hbase-hadoop-compat/1.2.6/hbase-hadoop-compat-1.2.6-tests.jar
(20 KB at 11.5 KB/sec)
2017-06-20\T\00:17:21.816 [INFO] Downloading: https://repo.maven.apache.org/maven2/org/apache/hbase/hbase-annotations/1.2.6/hbase-annotations-1.2.6.jar
2017-06-20\T\00:17:21.836 [INFO] Downloaded: https://repo.maven.apache.org/maven2/org/apache/hbase/hbase-hadoop2-compat/1.2.6/hbase-hadoop2-compat-1.2.6-tests.jar
(30 KB at 17.5 KB/sec)
2017-06-20\T\00:17:21.847 [INFO] Downloaded: https://repo.maven.apache.org/maven2/org/apache/hbase/hbase-annotations/1.2.6/hbase-annotations-1.2.6.jar
(21 KB at 12.1 KB/sec)
2017-06-20\T\00:17:21.946 [INFO] Downloaded: https://repo.maven.apache.org/maven2/org/apache/hadoop/hadoop-common/2.5.1/hadoop-common-2.5.1.jar
(2894 KB at 1620.9 KB/sec)
2017-06-20\T\00:17:22.378 [INFO] Downloaded: https://repo.maven.apache.org/maven2/org/apache/hbase/hbase-shaded-client/1.2.6/hbase-shaded-client-1.2.6.jar
(29957 KB at 13469.8 KB/sec)
2017-06-20\T\00:17:23.640 [INFO] Downloaded: https://repo.maven.apache.org/maven2/org/apache/hbase/hbase-shaded-server/1.2.6/hbase-shaded-server-1.2.6.jar
(50961 KB at 14635.5 KB/sec)
2017-06-20\T\00:17:23.670 [INFO] 
2017-06-20\T\00:17:23.674 [INFO] --- maven-clean-plugin:3.0.0:clean (default-clean) @ beam-sdks-java-io-hbase
---
2017-06-20\T\00:17:23.678 [INFO] Deleting <https://builds.apache.org/job/beam_PostCommit_Java_JDK_Versions_Test/jdk=JDK%201.7%20(latest),label=beam/ws/sdks/java/io/hbase>
(includes = [**/*.pyc, **/*.egg-info/, **/sdks/python/LICENSE, **/sdks/python/NOTICE, **/sdks/python/README.md],
excludes = [])
2017-06-20\T\00:17:23.680 [INFO] 
2017-06-20\T\00:17:23.680 [INFO] --- maven-enforcer-plugin:1.4.1:enforce (enforce) @ beam-sdks-java-io-hbase
---
2017-06-20\T\00:17:28.325 [INFO] 
2017-06-20\T\00:17:28.326 [INFO] --- maven-enforcer-plugin:1.4.1:enforce (enforce-banned-dependencies)
@ beam-sdks-java-io-hbase ---
2017-06-20\T\00:17:28.392 [INFO] 
2017-06-20\T\00:17:28.392 [INFO] --- maven-remote-resources-plugin:1.5:process (process-resource-bundles)
@ beam-sdks-java-io-hbase ---
2017-06-20\T\00:17:28.835 [INFO] 
2017-06-20\T\00:17:28.836 [INFO] --- maven-resources-plugin:3.0.2:resources (default-resources)
@ beam-sdks-java-io-hbase ---
2017-06-20\T\00:17:28.837 [INFO] Using 'UTF-8' encoding to copy filtered resources.
2017-06-20\T\00:17:28.837 [INFO] skip non existing resourceDirectory <https://builds.apache.org/job/beam_PostCommit_Java_JDK_Versions_Test/jdk=JDK%201.7%20(latest),label=beam/ws/sdks/java/io/hbase/src/main/resources>
2017-06-20\T\00:17:28.838 [INFO] Copying 3 resources
2017-06-20\T\00:17:28.839 [INFO] 
2017-06-20\T\00:17:28.839 [INFO] --- maven-compiler-plugin:3.6.1:compile (default-compile)
@ beam-sdks-java-io-hbase ---
2017-06-20\T\00:17:28.843 [INFO] Changes detected - recompiling the module!
2017-06-20\T\00:17:28.844 [INFO] Compiling 4 source files to <https://builds.apache.org/job/beam_PostCommit_Java_JDK_Versions_Test/jdk=JDK%201.7%20(latest),label=beam/ws/sdks/java/io/hbase/target/classes>
2017-06-20\T\00:17:29.039 [INFO] 
2017-06-20\T\00:17:29.040 [INFO] --- maven-compiler-plugin:3.6.1:compile (compile-package-info)
@ beam-sdks-java-io-hbase ---
2017-06-20\T\00:17:29.044 [INFO] Changes detected - recompiling the module!
2017-06-20\T\00:17:29.045 [INFO] Compiling 1 source file to <https://builds.apache.org/job/beam_PostCommit_Java_JDK_Versions_Test/jdk=JDK%201.7%20(latest),label=beam/ws/sdks/java/io/hbase/target/classes>
2017-06-20\T\00:17:29.073 [INFO] 
2017-06-20\T\00:17:29.074 [INFO] --- maven-resources-plugin:3.0.2:testResources (default-testResources)
@ beam-sdks-java-io-hbase ---
2017-06-20\T\00:17:29.075 [INFO] Using 'UTF-8' encoding to copy filtered resources.
2017-06-20\T\00:17:29.076 [INFO] Copying 1 resource
2017-06-20\T\00:17:29.076 [INFO] Copying 3 resources
2017-06-20\T\00:17:29.080 [INFO] 
2017-06-20\T\00:17:29.080 [INFO] --- maven-compiler-plugin:3.6.1:testCompile (default-testCompile)
@ beam-sdks-java-io-hbase ---
2017-06-20\T\00:17:29.090 [INFO] Changes detected - recompiling the module!
2017-06-20\T\00:17:29.091 [INFO] Compiling 4 source files to <https://builds.apache.org/job/beam_PostCommit_Java_JDK_Versions_Test/jdk=JDK%201.7%20(latest),label=beam/ws/sdks/java/io/hbase/target/test-classes>
2017-06-20\T\00:17:34.254 [INFO] 
2017-06-20\T\00:17:34.255 [INFO] --- maven-checkstyle-plugin:2.17:check (default) @ beam-sdks-java-io-hbase
---
2017-06-20\T\00:17:35.097 [INFO] Starting audit...
Audit done.
2017-06-20\T\00:17:35.098 [INFO] 
2017-06-20\T\00:17:35.098 [INFO] --- maven-surefire-plugin:2.20:test (default-test) @ beam-sdks-java-io-hbase
---
2017-06-20\T\00:17:35.103 [INFO] Surefire report directory: <https://builds.apache.org/job/beam_PostCommit_Java_JDK_Versions_Test/jdk=JDK%201.7%20(latest),label=beam/ws/sdks/java/io/hbase/target/surefire-reports>
2017-06-20\T\00:17:35.103 [INFO] Using configured provider org.apache.maven.surefire.junitcore.JUnitCoreProvider
2017-06-20\T\00:17:35.104 [INFO] parallel='all', perCoreThreadCount=true, threadCount=4, useUnlimitedThreads=false,
threadCountSuites=0, threadCountClasses=0, threadCountMethods=0, parallelOptimized=true
2017-06-20\T\00:17:35.105 [INFO] 
2017-06-20\T\00:17:35.105 [INFO] -------------------------------------------------------
2017-06-20\T\00:17:35.105 [INFO]  T E S T S
2017-06-20\T\00:17:35.105 [INFO] -------------------------------------------------------
2017-06-20\T\00:17:39.299 [INFO] Running org.apache.beam.sdk.io.hbase.HBaseResultCoderTest
2017-06-20\T\00:17:39.301 [INFO] Tests run: 1, Failures: 0, Errors: 0, Skipped: 0, Time elapsed:
2.004 s - in org.apache.beam.sdk.io.hbase.HBaseResultCoderTest
2017-06-20\T\00:17:39.301 [INFO] Running org.apache.beam.sdk.io.hbase.HBaseMutationCoderTest
2017-06-20\T\00:17:39.302 [INFO] Tests run: 1, Failures: 0, Errors: 0, Skipped: 0, Time elapsed:
2.028 s - in org.apache.beam.sdk.io.hbase.HBaseMutationCoderTest
2017-06-20\T\00:17:39.302 [INFO] Running org.apache.beam.sdk.io.hbase.SerializableScanTest
2017-06-20\T\00:17:39.304 [INFO] Tests run: 2, Failures: 0, Errors: 0, Skipped: 0, Time elapsed:
1.505 s - in org.apache.beam.sdk.io.hbase.SerializableScanTest
2017-06-20\T\00:17:39.304 [INFO] Running org.apache.beam.sdk.io.hbase.HBaseIOTest
2017-06-20\T\00:17:39.311 [ERROR] Tests run: 1, Failures: 0, Errors: 1, Skipped: 0, Time elapsed:
0 s <<< FAILURE! - in org.apache.beam.sdk.io.hbase.HBaseIOTest
2017-06-20\T\00:17:39.311 [ERROR] org.apache.beam.sdk.io.hbase.HBaseIOTest  Time elapsed:
0 s  <<< ERROR!
java.io.IOException: Shutting down
	at org.apache.hadoop.hbase.MiniHBaseCluster.init(MiniHBaseCluster.java:235)
	at org.apache.hadoop.hbase.MiniHBaseCluster.<init>(MiniHBaseCluster.java:97)
	at org.apache.hadoop.hbase.HBaseTestingUtility.startMiniHBaseCluster(HBaseTestingUtility.java:1036)
	at org.apache.hadoop.hbase.HBaseTestingUtility.startMiniHBaseCluster(HBaseTestingUtility.java:1002)
	at org.apache.beam.sdk.io.hbase.HBaseIOTest.beforeClass(HBaseIOTest.java:103)
	at sun.reflect.NativeMethodAccessorImpl.invoke0(Native Method)
	at sun.reflect.NativeMethodAccessorImpl.invoke(NativeMethodAccessorImpl.java:57)
	at sun.reflect.DelegatingMethodAccessorImpl.invoke(DelegatingMethodAccessorImpl.java:43)
	at java.lang.reflect.Method.invoke(Method.java:606)
	at org.junit.runners.model.FrameworkMethod$1.runReflectiveCall(FrameworkMethod.java:50)
	at org.junit.internal.runners.model.ReflectiveCallable.run(ReflectiveCallable.java:12)
	at org.junit.runners.model.FrameworkMethod.invokeExplosively(FrameworkMethod.java:47)
	at org.junit.internal.runners.statements.RunBefores.evaluate(RunBefores.java:24)
	at org.junit.internal.runners.statements.RunAfters.evaluate(RunAfters.java:27)
	at org.junit.runners.ParentRunner.run(ParentRunner.java:363)
	at org.junit.runners.Suite.runChild(Suite.java:128)
	at org.junit.runners.Suite.runChild(Suite.java:27)
	at org.junit.runners.ParentRunner$3.run(ParentRunner.java:290)
	at org.apache.maven.surefire.junitcore.pc.Scheduler$1.run(Scheduler.java:393)
	at java.util.concurrent.Executors$RunnableAdapter.call(Executors.java:471)
	at java.util.concurrent.FutureTask.run(FutureTask.java:262)
	at java.util.concurrent.ThreadPoolExecutor.runWorker(ThreadPoolExecutor.java:1145)
	at java.util.concurrent.ThreadPoolExecutor$Worker.run(ThreadPoolExecutor.java:615)
	at java.lang.Thread.run(Thread.java:745)
Caused by: java.lang.RuntimeException: Failed construction of Master: class org.apache.hadoop.hbase.master.HMasterIllegal
character in path at index 89: file:<https://builds.apache.org/job/beam_PostCommit_Java_JDK_Versions_Test/jdk=JDK%201.7%20(latest),label=beam/ws/sdks/java/io/hbase/target/test-data/cf40248a-ec37-4ffe-978e-c80f82e51826>
	at org.apache.hadoop.hbase.util.JVMClusterUtil.createMasterThread(JVMClusterUtil.java:143)
	at org.apache.hadoop.hbase.LocalHBaseCluster.addMaster(LocalHBaseCluster.java:220)
	at org.apache.hadoop.hbase.LocalHBaseCluster.<init>(LocalHBaseCluster.java:155)
	at org.apache.hadoop.hbase.MiniHBaseCluster.init(MiniHBaseCluster.java:217)
	... 23 more
Caused by: java.lang.IllegalArgumentException: Illegal character in path at index 89: file:<https://builds.apache.org/job/beam_PostCommit_Java_JDK_Versions_Test/jdk=JDK%201.7%20(latest),label=beam/ws/sdks/java/io/hbase/target/test-data/cf40248a-ec37-4ffe-978e-c80f82e51826>
	at java.net.URI.create(URI.java:859)
	at org.apache.hadoop.fs.FileSystem.getDefaultUri(FileSystem.java:175)
	at org.apache.hadoop.fs.FileSystem.get(FileSystem.java:167)
	at org.apache.hadoop.hbase.fs.HFileSystem.<init>(HFileSystem.java:80)
	at org.apache.hadoop.hbase.regionserver.HRegionServer.initializeFileSystem(HRegionServer.java:613)
	at org.apache.hadoop.hbase.regionserver.HRegionServer.<init>(HRegionServer.java:564)
	at org.apache.hadoop.hbase.master.HMaster.<init>(HMaster.java:412)
	at sun.reflect.NativeConstructorAccessorImpl.newInstance0(Native Method)
	at sun.reflect.NativeConstructorAccessorImpl.newInstance(NativeConstructorAccessorImpl.java:57)
	at sun.reflect.DelegatingConstructorAccessorImpl.newInstance(DelegatingConstructorAccessorImpl.java:45)
	at java.lang.reflect.Constructor.newInstance(Constructor.java:526)
	at org.apache.hadoop.hbase.util.JVMClusterUtil.createMasterThread(JVMClusterUtil.java:139)
	... 26 more
Caused by: java.net.URISyntaxException: Illegal character in path at index 89: file:<https://builds.apache.org/job/beam_PostCommit_Java_JDK_Versions_Test/jdk=JDK%201.7%20(latest),label=beam/ws/sdks/java/io/hbase/target/test-data/cf40248a-ec37-4ffe-978e-c80f82e51826>
	at java.net.URI$Parser.fail(URI.java:2829)
	at java.net.URI$Parser.checkChars(URI.java:3002)
	at java.net.URI$Parser.parseHierarchical(URI.java:3086)
	at java.net.URI$Parser.parse(URI.java:3034)
	at java.net.URI.<init>(URI.java:595)
	at java.net.URI.create(URI.java:857)
	... 37 more

2017-06-20\T\00:17:39.645 [INFO] 
2017-06-20\T\00:17:39.645 [INFO] Results:
2017-06-20\T\00:17:39.645 [INFO] 
2017-06-20\T\00:17:39.645 [ERROR] Errors: 
2017-06-20\T\00:17:39.645 [ERROR]   HBaseIOTest.beforeClass:103 » IO Shutting down
2017-06-20\T\00:17:39.645 [INFO] 
2017-06-20\T\00:17:39.645 [ERROR] Tests run: 5, Failures: 0, Errors: 1, Skipped: 0
2017-06-20\T\00:17:39.645 [INFO] 
2017-06-20\T\00:17:39.647 [INFO] ------------------------------------------------------------------------
2017-06-20\T\00:17:39.647 [INFO] Reactor Summary:
2017-06-20\T\00:17:39.647 [INFO] 
2017-06-20\T\00:17:39.647 [INFO] Apache Beam :: Parent .............................. SUCCESS
[ 21.767 s]
2017-06-20\T\00:17:39.647 [INFO] Apache Beam :: SDKs :: Java :: Build Tools ......... SUCCESS
[  7.035 s]
2017-06-20\T\00:17:39.647 [INFO] Apache Beam :: SDKs ................................ SUCCESS
[  0.565 s]
2017-06-20\T\00:17:39.647 [INFO] Apache Beam :: SDKs :: Common ...................... SUCCESS
[  0.465 s]
2017-06-20\T\00:17:39.647 [INFO] Apache Beam :: SDKs :: Common :: Runner API ........ SUCCESS
[  6.396 s]
2017-06-20\T\00:17:39.647 [INFO] Apache Beam :: SDKs :: Common :: Fn API ............ SUCCESS
[  5.373 s]
2017-06-20\T\00:17:39.647 [INFO] Apache Beam :: SDKs :: Java ........................ SUCCESS
[  0.923 s]
2017-06-20\T\00:17:39.647 [INFO] Apache Beam :: SDKs :: Java :: Core ................ SUCCESS
[02:06 min]
2017-06-20\T\00:17:39.647 [INFO] Apache Beam :: Runners ............................. SUCCESS
[  0.669 s]
2017-06-20\T\00:17:39.647 [INFO] Apache Beam :: Runners :: Core Construction Java ... SUCCESS
[ 16.872 s]
2017-06-20\T\00:17:39.647 [INFO] Apache Beam :: Runners :: Core Java ................ SUCCESS
[ 32.998 s]
2017-06-20\T\00:17:39.647 [INFO] Apache Beam :: Runners :: Direct Java .............. SUCCESS
[04:02 min]
2017-06-20\T\00:17:39.647 [INFO] Apache Beam :: SDKs :: Java :: IO .................. SUCCESS
[  0.620 s]
2017-06-20\T\00:17:39.647 [INFO] Apache Beam :: SDKs :: Java :: IO :: Common ........ SUCCESS
[  2.839 s]
2017-06-20\T\00:17:39.647 [INFO] Apache Beam :: SDKs :: Java :: IO :: Cassandra ..... SUCCESS
[ 17.466 s]
2017-06-20\T\00:17:39.647 [INFO] Apache Beam :: SDKs :: Java :: IO :: Elasticsearch . SUCCESS
[ 32.960 s]
2017-06-20\T\00:17:39.647 [INFO] Apache Beam :: SDKs :: Java :: Extensions .......... SUCCESS
[  0.703 s]
2017-06-20\T\00:17:39.647 [INFO] Apache Beam :: SDKs :: Java :: Extensions :: Google Cloud
Platform Core SUCCESS [ 28.926 s]
2017-06-20\T\00:17:39.647 [INFO] Apache Beam :: SDKs :: Java :: Extensions :: Protobuf SUCCESS
[ 14.115 s]
2017-06-20\T\00:17:39.647 [INFO] Apache Beam :: SDKs :: Java :: IO :: Google Cloud Platform
SUCCESS [01:10 min]
2017-06-20\T\00:17:39.647 [INFO] Apache Beam :: SDKs :: Java :: IO :: Hadoop Common . SUCCESS
[ 13.974 s]
2017-06-20\T\00:17:39.647 [INFO] Apache Beam :: SDKs :: Java :: IO :: Hadoop File System SUCCESS
[ 38.603 s]
2017-06-20\T\00:17:39.647 [INFO] Apache Beam :: SDKs :: Java :: IO :: Hadoop ........ SUCCESS
[  4.700 s]
2017-06-20\T\00:17:39.647 [INFO] Apache Beam :: SDKs :: Java :: IO :: Hadoop :: input-format
SUCCESS [ 16.513 s]
2017-06-20\T\00:17:39.647 [INFO] Apache Beam :: SDKs :: Java :: IO :: HBase ......... FAILURE
[ 21.843 s]
2017-06-20\T\00:17:39.647 [INFO] Apache Beam :: SDKs :: Java :: IO :: HCatalog ...... SKIPPED
2017-06-20\T\00:17:39.647 [INFO] Apache Beam :: Runners :: Google Cloud Dataflow .... SKIPPED
2017-06-20\T\00:17:39.647 [INFO] Apache Beam :: SDKs :: Java :: IO :: JDBC .......... SKIPPED
2017-06-20\T\00:17:39.647 [INFO] Apache Beam :: SDKs :: Java :: IO :: JMS ........... SKIPPED
2017-06-20\T\00:17:39.647 [INFO] Apache Beam :: SDKs :: Java :: IO :: Kafka ......... SKIPPED
2017-06-20\T\00:17:39.647 [INFO] Apache Beam :: SDKs :: Java :: IO :: Kinesis ....... SKIPPED
2017-06-20\T\00:17:39.647 [INFO] Apache Beam :: SDKs :: Java :: IO :: MongoDB ....... SKIPPED
2017-06-20\T\00:17:39.647 [INFO] Apache Beam :: SDKs :: Java :: IO :: MQTT .......... SKIPPED
2017-06-20\T\00:17:39.647 [INFO] Apache Beam :: SDKs :: Java :: IO :: XML ........... SKIPPED
2017-06-20\T\00:17:39.647 [INFO] Apache Beam :: SDKs :: Java :: Maven Archetypes .... SKIPPED
2017-06-20\T\00:17:39.647 [INFO] Apache Beam :: SDKs :: Java :: Maven Archetypes :: Starter
SKIPPED
2017-06-20\T\00:17:39.647 [INFO] Apache Beam :: Examples ............................ SKIPPED
2017-06-20\T\00:17:39.647 [INFO] Apache Beam :: Examples :: Java .................... SKIPPED
2017-06-20\T\00:17:39.647 [INFO] Apache Beam :: SDKs :: Java :: Maven Archetypes :: Examples
SKIPPED
2017-06-20\T\00:17:39.647 [INFO] Apache Beam :: SDKs :: Java :: Extensions :: Jackson SKIPPED
2017-06-20\T\00:17:39.647 [INFO] Apache Beam :: SDKs :: Java :: Extensions :: Join library
SKIPPED
2017-06-20\T\00:17:39.647 [INFO] Apache Beam :: SDKs :: Java :: Extensions :: Sorter  SKIPPED
2017-06-20\T\00:17:39.647 [INFO] Apache Beam :: Runners :: Flink .................... SKIPPED
2017-06-20\T\00:17:39.647 [INFO] Apache Beam :: Runners :: Spark .................... SKIPPED
2017-06-20\T\00:17:39.647 [INFO] Apache Beam :: SDKs :: Java :: Aggregated Javadoc .. SKIPPED
2017-06-20\T\00:17:39.647 [INFO] ------------------------------------------------------------------------
2017-06-20\T\00:17:39.647 [INFO] BUILD FAILURE
2017-06-20\T\00:17:39.647 [INFO] ------------------------------------------------------------------------
2017-06-20\T\00:17:39.647 [INFO] Total time: 12:10 min
2017-06-20\T\00:17:39.647 [INFO] Finished at: 2017-06-20T00:17:39+00:00
2017-06-20\T\00:17:40.694 [INFO] Final Memory: 167M/1833M
2017-06-20\T\00:17:40.694 [INFO] ------------------------------------------------------------------------
2017-06-20\T\00:17:40.695 [ERROR] Failed to execute goal org.apache.maven.plugins:maven-surefire-plugin:2.20:test
(default-test) on project beam-sdks-java-io-hbase: There are test failures.
2017-06-20\T\00:17:40.695 [ERROR] 
2017-06-20\T\00:17:40.695 [ERROR] Please refer to <https://builds.apache.org/job/beam_PostCommit_Java_JDK_Versions_Test/jdk=JDK%201.7%20(latest),label=beam/ws/sdks/java/io/hbase/target/surefire-reports>
for the individual test results.
2017-06-20\T\00:17:40.695 [ERROR] Please refer to dump files (if any exist) [date]-jvmRun[N].dump,
[date].dumpstream and [date]-jvmRun[N].dumpstream.
2017-06-20\T\00:17:40.695 [ERROR] -> [Help 1]
org.apache.maven.lifecycle.LifecycleExecutionException: Failed to execute goal org.apache.maven.plugins:maven-surefire-plugin:2.20:test
(default-test) on project beam-sdks-java-io-hbase: There are test failures.

Please refer to <https://builds.apache.org/job/beam_PostCommit_Java_JDK_Versions_Test/jdk=JDK%201.7%20(latest),label=beam/ws/sdks/java/io/hbase/target/surefire-reports>
for the individual test results.
Please refer to dump files (if any exist) [date]-jvmRun[N].dump, [date].dumpstream and [date]-jvmRun[N].dumpstream.
	at org.apache.maven.lifecycle.internal.MojoExecutor.execute(MojoExecutor.java:212)
	at org.apache.maven.lifecycle.internal.MojoExecutor.execute(MojoExecutor.java:153)
	at org.apache.maven.lifecycle.internal.MojoExecutor.execute(MojoExecutor.java:145)
	at org.apache.maven.lifecycle.internal.LifecycleModuleBuilder.buildProject(LifecycleModuleBuilder.java:116)
	at org.apache.maven.lifecycle.internal.LifecycleModuleBuilder.buildProject(LifecycleModuleBuilder.java:80)
	at org.apache.maven.lifecycle.internal.builder.singlethreaded.SingleThreadedBuilder.build(SingleThreadedBuilder.java:51)
	at org.apache.maven.lifecycle.internal.LifecycleStarter.execute(LifecycleStarter.java:128)
	at org.apache.maven.DefaultMaven.doExecute(DefaultMaven.java:307)
	at org.apache.maven.DefaultMaven.doExecute(DefaultMaven.java:193)
	at org.apache.maven.DefaultMaven.execute(DefaultMaven.java:106)
	at org.apache.maven.cli.MavenCli.execute(MavenCli.java:862)
	at org.apache.maven.cli.MavenCli.doMain(MavenCli.java:286)
	at org.apache.maven.cli.MavenCli.main(MavenCli.java:197)
	at sun.reflect.NativeMethodAccessorImpl.invoke0(Native Method)
	at sun.reflect.NativeMethodAccessorImpl.invoke(NativeMethodAccessorImpl.java:57)
	at sun.reflect.DelegatingMethodAccessorImpl.invoke(DelegatingMethodAccessorImpl.java:43)
	at java.lang.reflect.Method.invoke(Method.java:606)
	at org.codehaus.plexus.classworlds.launcher.Launcher.launchEnhanced(Launcher.java:289)
	at org.codehaus.plexus.classworlds.launcher.Launcher.launch(Launcher.java:229)
	at org.codehaus.plexus.classworlds.launcher.Launcher.mainWithExitCode(Launcher.java:415)
	at org.codehaus.plexus.classworlds.launcher.Launcher.main(Launcher.java:356)
Caused by: org.apache.maven.plugin.MojoFailureException: There are test failures.

Please refer to <https://builds.apache.org/job/beam_PostCommit_Java_JDK_Versions_Test/jdk=JDK%201.7%20(latest),label=beam/ws/sdks/java/io/hbase/target/surefire-reports>
for the individual test results.
Please refer to dump files (if any exist) [date]-jvmRun[N].dump, [date].dumpstream and [date]-jvmRun[N].dumpstream.
	at org.apache.maven.plugin.surefire.SurefireHelper.throwException(SurefireHelper.java:204)
	at org.apache.maven.plugin.surefire.SurefireHelper.reportExecution(SurefireHelper.java:98)
	at org.apache.maven.plugin.surefire.SurefirePlugin.handleSummary(SurefirePlugin.java:334)
	at org.apache.maven.plugin.surefire.AbstractSurefireMojo.executeAfterPreconditionsChecked(AbstractSurefireMojo.java:937)
	at org.apache.maven.plugin.surefire.AbstractSurefireMojo.execute(AbstractSurefireMojo.java:785)
	at org.apache.maven.plugin.DefaultBuildPluginManager.executeMojo(DefaultBuildPluginManager.java:134)
	at org.apache.maven.lifecycle.internal.MojoExecutor.execute(MojoExecutor.java:208)
	... 20 more
2017-06-20\T\00:17:40.696 [ERROR] 
2017-06-20\T\00:17:40.696 [ERROR] Re-run Maven using the -X switch to enable full debug logging.
2017-06-20\T\00:17:40.696 [ERROR] 
2017-06-20\T\00:17:40.696 [ERROR] For more information about the errors and possible solutions,
please read the following articles:
2017-06-20\T\00:17:40.696 [ERROR] [Help 1] http://cwiki.apache.org/confluence/display/MAVEN/MojoFailureException
2017-06-20\T\00:17:40.696 [ERROR] 
2017-06-20\T\00:17:40.696 [ERROR] After correcting the problems, you can resume the build
with the command
2017-06-20\T\00:17:40.696 [ERROR]   mvn <goals> -rf :beam-sdks-java-io-hbase
Build step 'Invoke top-level Maven targets' marked build as failure
Not sending mail to unregistered user aljoscha.krettek@gmail.com
Not sending mail to unregistered user hepei.hp@alibaba-inc.com
Not sending mail to unregistered user klk@google.com
Not sending mail to unregistered user ccy@google.com
Not sending mail to unregistered user kirpichov@google.com

Mime
View raw message