beam-commits mailing list archives

Site index · List index
Message view « Date » · « Thread »
Top « Date » · « Thread »
From Apache Jenkins Server <jenk...@builds.apache.org>
Subject Build failed in Jenkins: beam_PostCommit_Java_MavenInstall #4177
Date Wed, 21 Jun 2017 22:31:06 GMT
See <https://builds.apache.org/job/beam_PostCommit_Java_MavenInstall/4177/display/redirect?page=changes>

Changes:

[pei] ReduceFnRunner.onTrigger: skip storeCurrentPaneInfo() if trigger

------------------------------------------
[...truncated 1.28 MB...]
2017-06-21T22:23:42.046 [INFO] Downloading: https://repo.maven.apache.org/maven2/org/apache/activemq/activemq-jaas/5.13.1/activemq-jaas-5.13.1.pom
2017-06-21T22:23:42.072 [INFO] Downloaded: https://repo.maven.apache.org/maven2/org/apache/activemq/activemq-jaas/5.13.1/activemq-jaas-5.13.1.pom
(6 KB at 207.6 KB/sec)
2017-06-21T22:23:42.076 [INFO] Downloading: https://repo.maven.apache.org/maven2/org/apache/activemq/activemq-kahadb-store/5.13.1/activemq-kahadb-store-5.13.1.pom
2017-06-21T22:23:42.104 [INFO] Downloaded: https://repo.maven.apache.org/maven2/org/apache/activemq/activemq-kahadb-store/5.13.1/activemq-kahadb-store-5.13.1.pom
(10 KB at 352.2 KB/sec)
2017-06-21T22:23:42.108 [INFO] Downloading: https://repo.maven.apache.org/maven2/org/apache/activemq/protobuf/activemq-protobuf/1.1/activemq-protobuf-1.1.pom
2017-06-21T22:23:42.135 [INFO] Downloaded: https://repo.maven.apache.org/maven2/org/apache/activemq/protobuf/activemq-protobuf/1.1/activemq-protobuf-1.1.pom
(3 KB at 107.5 KB/sec)
2017-06-21T22:23:42.136 [INFO] Downloading: https://repo.maven.apache.org/maven2/org/apache/activemq/protobuf/activemq-protobuf-pom/1.1/activemq-protobuf-pom-1.1.pom
2017-06-21T22:23:42.164 [INFO] Downloaded: https://repo.maven.apache.org/maven2/org/apache/activemq/protobuf/activemq-protobuf-pom/1.1/activemq-protobuf-pom-1.1.pom
(12 KB at 411.9 KB/sec)
2017-06-21T22:23:42.166 [INFO] Downloading: https://repo.maven.apache.org/maven2/commons-net/commons-net/3.3/commons-net-3.3.pom
2017-06-21T22:23:42.193 [INFO] Downloaded: https://repo.maven.apache.org/maven2/commons-net/commons-net/3.3/commons-net-3.3.pom
(19 KB at 693.0 KB/sec)
2017-06-21T22:23:42.195 [INFO] Downloading: https://repo.maven.apache.org/maven2/org/apache/commons/commons-parent/30/commons-parent-30.pom
2017-06-21T22:23:42.226 [INFO] Downloaded: https://repo.maven.apache.org/maven2/org/apache/commons/commons-parent/30/commons-parent-30.pom
(55 KB at 1759.5 KB/sec)
[JENKINS] Archiving disabled
2017-06-21T22:23:43.475 [INFO]                                                           
             
2017-06-21T22:23:43.475 [INFO] ------------------------------------------------------------------------
2017-06-21T22:23:43.475 [INFO] Skipping Apache Beam :: Parent
2017-06-21T22:23:43.475 [INFO] This project has been banned from the build due to previous
failures.
2017-06-21T22:23:43.475 [INFO] ------------------------------------------------------------------------
[JENKINS] Archiving disabled
[JENKINS] Archiving disabled
[JENKINS] Archiving disabled
[JENKINS] Archiving disabled
[JENKINS] Archiving disabled
[JENKINS] Archiving disabled
[JENKINS] Archiving disabled
[JENKINS] Archiving disabled
[JENKINS] Archiving disabled
[JENKINS] Archiving disabled
[JENKINS] Archiving disabled
[JENKINS] Archiving disabled
[JENKINS] Archiving disabled
[JENKINS] Archiving disabled
[JENKINS] Archiving disabled
[JENKINS] Archiving disabled
[JENKINS] Archiving disabled
[JENKINS] Archiving disabled
[JENKINS] Archiving disabled
[JENKINS] Archiving disabled
[JENKINS] Archiving disabled
[JENKINS] Archiving disabled
[JENKINS] Archiving disabled
[JENKINS] Archiving disabled
[JENKINS] Archiving disabled
[JENKINS] Archiving disabled
[JENKINS] Archiving disabled
[JENKINS] Archiving disabled
[JENKINS] Archiving disabled
[JENKINS] Archiving disabled
[JENKINS] Archiving disabled
[JENKINS] Archiving disabled
[JENKINS] Archiving disabled
[JENKINS] Archiving disabled
[JENKINS] Archiving disabled
[JENKINS] Archiving disabled
[JENKINS] Archiving disabled
[JENKINS] Archiving disabled
[JENKINS] Archiving disabled
[JENKINS] Archiving disabled
[JENKINS] Archiving disabled
[JENKINS] Archiving disabled
[JENKINS] Archiving disabled
[JENKINS] Archiving disabled
[JENKINS] Archiving disabled
[JENKINS] Archiving disabled
[JENKINS] Archiving disabled
[JENKINS] Archiving disabled
2017-06-21T22:24:00.924 [INFO] ------------------------------------------------------------------------
2017-06-21T22:24:00.924 [INFO] Reactor Summary:
2017-06-21T22:24:00.924 [INFO] 
2017-06-21T22:24:00.924 [INFO] Apache Beam :: Parent .............................. SUCCESS
[ 25.308 s]
2017-06-21T22:24:00.924 [INFO] Apache Beam :: SDKs :: Java :: Build Tools ......... SUCCESS
[ 16.610 s]
2017-06-21T22:24:00.924 [INFO] Apache Beam :: SDKs ................................ SUCCESS
[  4.103 s]
2017-06-21T22:24:00.924 [INFO] Apache Beam :: SDKs :: Common ...................... SUCCESS
[  1.706 s]
2017-06-21T22:24:00.924 [INFO] Apache Beam :: SDKs :: Common :: Runner API ........ SUCCESS
[ 22.352 s]
2017-06-21T22:24:00.924 [INFO] Apache Beam :: SDKs :: Common :: Fn API ............ SUCCESS
[ 17.377 s]
2017-06-21T22:24:00.924 [INFO] Apache Beam :: SDKs :: Java ........................ SUCCESS
[  2.200 s]
2017-06-21T22:24:00.924 [INFO] Apache Beam :: SDKs :: Java :: Core ................ SUCCESS
[02:41 min]
2017-06-21T22:24:00.924 [INFO] Apache Beam :: Runners ............................. SUCCESS
[  1.783 s]
2017-06-21T22:24:00.924 [INFO] Apache Beam :: Runners :: Core Construction Java ... SUCCESS
[ 33.115 s]
2017-06-21T22:24:00.924 [INFO] Apache Beam :: Runners :: Core Java ................ SUCCESS
[ 49.472 s]
2017-06-21T22:24:00.924 [INFO] Apache Beam :: Runners :: Direct Java .............. SUCCESS
[03:43 min]
2017-06-21T22:24:00.924 [INFO] Apache Beam :: SDKs :: Java :: IO .................. SUCCESS
[  1.931 s]
2017-06-21T22:24:00.924 [INFO] Apache Beam :: SDKs :: Java :: IO :: Common ........ SUCCESS
[  4.195 s]
2017-06-21T22:24:00.924 [INFO] Apache Beam :: SDKs :: Java :: IO :: Cassandra ..... SUCCESS
[ 23.895 s]
2017-06-21T22:24:00.924 [INFO] Apache Beam :: SDKs :: Java :: IO :: Elasticsearch . SUCCESS
[ 34.589 s]
2017-06-21T22:24:00.925 [INFO] Apache Beam :: SDKs :: Java :: Extensions .......... SUCCESS
[  1.787 s]
2017-06-21T22:24:00.925 [INFO] Apache Beam :: SDKs :: Java :: Extensions :: Google Cloud Platform
Core SUCCESS [ 31.740 s]
2017-06-21T22:24:00.925 [INFO] Apache Beam :: SDKs :: Java :: Extensions :: Protobuf SUCCESS
[ 19.084 s]
2017-06-21T22:24:00.925 [INFO] Apache Beam :: SDKs :: Java :: IO :: Google Cloud Platform
SUCCESS [01:20 min]
2017-06-21T22:24:00.925 [INFO] Apache Beam :: SDKs :: Java :: IO :: Hadoop Common . SUCCESS
[ 29.663 s]
2017-06-21T22:24:00.925 [INFO] Apache Beam :: SDKs :: Java :: IO :: Hadoop File System SUCCESS
[ 40.854 s]
2017-06-21T22:24:00.925 [INFO] Apache Beam :: SDKs :: Java :: IO :: Hadoop ........ SUCCESS
[  5.366 s]
2017-06-21T22:24:00.925 [INFO] Apache Beam :: SDKs :: Java :: IO :: Hadoop :: input-format
SUCCESS [ 25.928 s]
2017-06-21T22:24:00.925 [INFO] Apache Beam :: Runners :: Google Cloud Dataflow .... SUCCESS
[05:11 min]
2017-06-21T22:24:00.925 [INFO] Apache Beam :: SDKs :: Java :: IO :: Hadoop :: jdk1.8-tests
SUCCESS [01:17 min]
2017-06-21T22:24:00.925 [INFO] Apache Beam :: SDKs :: Java :: IO :: HBase ......... SUCCESS
[01:00 min]
2017-06-21T22:24:00.925 [INFO] Apache Beam :: SDKs :: Java :: IO :: HCatalog ...... SUCCESS
[01:09 min]
2017-06-21T22:24:00.925 [INFO] Apache Beam :: SDKs :: Java :: IO :: JDBC .......... SUCCESS
[ 31.647 s]
2017-06-21T22:24:00.925 [INFO] Apache Beam :: SDKs :: Java :: IO :: JMS ........... FAILURE
[  1.570 s]
2017-06-21T22:24:00.925 [INFO] Apache Beam :: SDKs :: Java :: IO :: Kafka ......... SKIPPED
2017-06-21T22:24:00.925 [INFO] Apache Beam :: SDKs :: Java :: IO :: Kinesis ....... SKIPPED
2017-06-21T22:24:00.925 [INFO] Apache Beam :: SDKs :: Java :: IO :: MongoDB ....... SKIPPED
2017-06-21T22:24:00.925 [INFO] Apache Beam :: SDKs :: Java :: IO :: MQTT .......... SKIPPED
2017-06-21T22:24:00.925 [INFO] Apache Beam :: SDKs :: Java :: IO :: XML ........... SKIPPED
2017-06-21T22:24:00.925 [INFO] Apache Beam :: SDKs :: Java :: Maven Archetypes .... SKIPPED
2017-06-21T22:24:00.925 [INFO] Apache Beam :: SDKs :: Java :: Maven Archetypes :: Starter
SKIPPED
2017-06-21T22:24:00.925 [INFO] Apache Beam :: Examples ............................ SKIPPED
2017-06-21T22:24:00.925 [INFO] Apache Beam :: Examples :: Java .................... SKIPPED
2017-06-21T22:24:00.925 [INFO] Apache Beam :: SDKs :: Java :: Maven Archetypes :: Examples
SKIPPED
2017-06-21T22:24:00.925 [INFO] Apache Beam :: Examples :: Java 8 .................. SKIPPED
2017-06-21T22:24:00.925 [INFO] Apache Beam :: SDKs :: Java :: Maven Archetypes :: Examples
- Java 8 SKIPPED
2017-06-21T22:24:00.925 [INFO] Apache Beam :: SDKs :: Java :: Extensions :: Jackson SKIPPED
2017-06-21T22:24:00.925 [INFO] Apache Beam :: SDKs :: Java :: Extensions :: Join library SKIPPED
2017-06-21T22:24:00.925 [INFO] Apache Beam :: SDKs :: Java :: Extensions :: Sorter  SKIPPED
2017-06-21T22:24:00.925 [INFO] Apache Beam :: SDKs :: Java :: Harness ............. SKIPPED
2017-06-21T22:24:00.925 [INFO] Apache Beam :: SDKs :: Java :: Java 8 Tests ........ SKIPPED
2017-06-21T22:24:00.925 [INFO] Apache Beam :: SDKs :: Python ...................... SKIPPED
2017-06-21T22:24:00.925 [INFO] Apache Beam :: Runners :: Flink .................... SKIPPED
2017-06-21T22:24:00.925 [INFO] Apache Beam :: Runners :: Spark .................... SKIPPED
2017-06-21T22:24:00.925 [INFO] Apache Beam :: Runners :: Apex ..................... SKIPPED
2017-06-21T22:24:00.925 [INFO] Apache Beam :: SDKs :: Java :: Aggregated Javadoc .. SKIPPED
2017-06-21T22:24:00.925 [INFO] ------------------------------------------------------------------------
2017-06-21T22:24:00.925 [INFO] BUILD FAILURE
2017-06-21T22:24:00.925 [INFO] ------------------------------------------------------------------------
2017-06-21T22:24:00.925 [INFO] Total time: 24:28 min
2017-06-21T22:24:00.925 [INFO] Finished at: 2017-06-21T22:24:00+00:00
2017-06-21T22:24:01.688 [INFO] Final Memory: 262M/2073M
2017-06-21T22:24:01.688 [INFO] ------------------------------------------------------------------------
Waiting for Jenkins to finish collecting data
2017-06-21T22:30:23.006 [ERROR] Failed to execute goal on project beam-sdks-java-io-jms: Could
not resolve dependencies for project org.apache.beam:beam-sdks-java-io-jms:jar:2.1.0-SNAPSHOT:
Failed to collect dependencies at org.apache.geronimo.specs:geronimo-jms_1.1_spec:jar:1.1.1:
Failed to read artifact descriptor for org.apache.geronimo.specs:geronimo-jms_1.1_spec:jar:1.1.1:
Could not transfer artifact org.apache.geronimo.specs:geronimo-jms_1.1_spec:pom:1.1.1 from/to
central (https://repo.maven.apache.org/maven2): Connection reset -> [Help 1]
org.apache.maven.lifecycle.LifecycleExecutionException: Failed to execute goal on project
beam-sdks-java-io-jms: Could not resolve dependencies for project org.apache.beam:beam-sdks-java-io-jms:jar:2.1.0-SNAPSHOT:
Failed to collect dependencies at org.apache.geronimo.specs:geronimo-jms_1.1_spec:jar:1.1.1
	at org.apache.maven.lifecycle.internal.LifecycleDependencyResolver.getDependencies(LifecycleDependencyResolver.java:221)
	at org.apache.maven.lifecycle.internal.LifecycleDependencyResolver.resolveProjectDependencies(LifecycleDependencyResolver.java:127)
	at org.apache.maven.lifecycle.internal.MojoExecutor.ensureDependenciesAreResolved(MojoExecutor.java:257)
	at org.apache.maven.lifecycle.internal.MojoExecutor.execute(MojoExecutor.java:200)
	at org.apache.maven.lifecycle.internal.MojoExecutor.execute(MojoExecutor.java:153)
	at org.apache.maven.lifecycle.internal.MojoExecutor.execute(MojoExecutor.java:145)
	at org.apache.maven.lifecycle.internal.LifecycleModuleBuilder.buildProject(LifecycleModuleBuilder.java:116)
	at org.apache.maven.lifecycle.internal.LifecycleModuleBuilder.buildProject(LifecycleModuleBuilder.java:80)
	at org.apache.maven.lifecycle.internal.builder.singlethreaded.SingleThreadedBuilder.build(SingleThreadedBuilder.java:51)
	at org.apache.maven.lifecycle.internal.LifecycleStarter.execute(LifecycleStarter.java:128)
	at org.apache.maven.DefaultMaven.doExecute(DefaultMaven.java:307)
	at org.apache.maven.DefaultMaven.doExecute(DefaultMaven.java:193)
	at org.apache.maven.DefaultMaven.execute(DefaultMaven.java:106)
	at org.jvnet.hudson.maven3.launcher.Maven33Launcher.main(Maven33Launcher.java:129)
	at sun.reflect.NativeMethodAccessorImpl.invoke0(Native Method)
	at sun.reflect.NativeMethodAccessorImpl.invoke(NativeMethodAccessorImpl.java:62)
	at sun.reflect.DelegatingMethodAccessorImpl.invoke(DelegatingMethodAccessorImpl.java:43)
	at java.lang.reflect.Method.invoke(Method.java:498)
	at org.codehaus.plexus.classworlds.launcher.Launcher.launchStandard(Launcher.java:330)
	at org.codehaus.plexus.classworlds.launcher.Launcher.launch(Launcher.java:238)
	at jenkins.maven3.agent.Maven33Main.launch(Maven33Main.java:176)
	at sun.reflect.NativeMethodAccessorImpl.invoke0(Native Method)
	at sun.reflect.NativeMethodAccessorImpl.invoke(NativeMethodAccessorImpl.java:62)
	at sun.reflect.DelegatingMethodAccessorImpl.invoke(DelegatingMethodAccessorImpl.java:43)
	at java.lang.reflect.Method.invoke(Method.java:498)
	at hudson.maven.Maven3Builder.call(Maven3Builder.java:139)
	at hudson.maven.Maven3Builder.call(Maven3Builder.java:70)
	at hudson.remoting.UserRequest.perform(UserRequest.java:153)
	at hudson.remoting.UserRequest.perform(UserRequest.java:50)
	at hudson.remoting.Request$2.run(Request.java:336)
	at hudson.remoting.InterceptingExecutorService$1.call(InterceptingExecutorService.java:68)
	at java.util.concurrent.FutureTask.run(FutureTask.java:266)
	at java.util.concurrent.ThreadPoolExecutor.runWorker(ThreadPoolExecutor.java:1142)
	at java.util.concurrent.ThreadPoolExecutor$Worker.run(ThreadPoolExecutor.java:617)
	at java.lang.Thread.run(Thread.java:748)
Caused by: org.apache.maven.project.DependencyResolutionException: Could not resolve dependencies
for project org.apache.beam:beam-sdks-java-io-jms:jar:2.1.0-SNAPSHOT: Failed to collect dependencies
at org.apache.geronimo.specs:geronimo-jms_1.1_spec:jar:1.1.1
	at org.apache.maven.project.DefaultProjectDependenciesResolver.resolve(DefaultProjectDependenciesResolver.java:180)
	at org.apache.maven.lifecycle.internal.LifecycleDependencyResolver.getDependencies(LifecycleDependencyResolver.java:195)
	... 34 more
Caused by: org.eclipse.aether.collection.DependencyCollectionException: Failed to collect
dependencies at org.apache.geronimo.specs:geronimo-jms_1.1_spec:jar:1.1.1
	at org.eclipse.aether.internal.impl.DefaultDependencyCollector.collectDependencies(DefaultDependencyCollector.java:291)
	at org.eclipse.aether.internal.impl.DefaultRepositorySystem.collectDependencies(DefaultRepositorySystem.java:316)
	at org.apache.maven.project.DefaultProjectDependenciesResolver.resolve(DefaultProjectDependenciesResolver.java:172)
	... 35 more
Caused by: org.eclipse.aether.resolution.ArtifactDescriptorException: Failed to read artifact
descriptor for org.apache.geronimo.specs:geronimo-jms_1.1_spec:jar:1.1.1
	at org.apache.maven.repository.internal.DefaultArtifactDescriptorReader.loadPom(DefaultArtifactDescriptorReader.java:302)
	at org.apache.maven.repository.internal.DefaultArtifactDescriptorReader.readArtifactDescriptor(DefaultArtifactDescriptorReader.java:218)
	at org.eclipse.aether.internal.impl.DefaultDependencyCollector.resolveCachedArtifactDescriptor(DefaultDependencyCollector.java:535)
	at org.eclipse.aether.internal.impl.DefaultDependencyCollector.getArtifactDescriptorResult(DefaultDependencyCollector.java:519)
	at org.eclipse.aether.internal.impl.DefaultDependencyCollector.processDependency(DefaultDependencyCollector.java:409)
	at org.eclipse.aether.internal.impl.DefaultDependencyCollector.processDependency(DefaultDependencyCollector.java:363)
	at org.eclipse.aether.internal.impl.DefaultDependencyCollector.process(DefaultDependencyCollector.java:351)
	at org.eclipse.aether.internal.impl.DefaultDependencyCollector.collectDependencies(DefaultDependencyCollector.java:254)
	... 37 more
Caused by: org.eclipse.aether.resolution.ArtifactResolutionException: Could not transfer artifact
org.apache.geronimo.specs:geronimo-jms_1.1_spec:pom:1.1.1 from/to central (https://repo.maven.apache.org/maven2):
Connection reset
	at org.eclipse.aether.internal.impl.DefaultArtifactResolver.resolve(DefaultArtifactResolver.java:444)
	at org.eclipse.aether.internal.impl.DefaultArtifactResolver.resolveArtifacts(DefaultArtifactResolver.java:246)
	at org.eclipse.aether.internal.impl.DefaultArtifactResolver.resolveArtifact(DefaultArtifactResolver.java:223)
	at org.apache.maven.repository.internal.DefaultArtifactDescriptorReader.loadPom(DefaultArtifactDescriptorReader.java:287)
	... 44 more
Caused by: org.eclipse.aether.transfer.ArtifactTransferException: Could not transfer artifact
org.apache.geronimo.specs:geronimo-jms_1.1_spec:pom:1.1.1 from/to central (https://repo.maven.apache.org/maven2):
Connection reset
	at org.eclipse.aether.connector.basic.ArtifactTransportListener.transferFailed(ArtifactTransportListener.java:43)
	at org.eclipse.aether.connector.basic.BasicRepositoryConnector$TaskRunner.run(BasicRepositoryConnector.java:355)
	at org.eclipse.aether.util.concurrency.RunnableErrorForwarder$1.run(RunnableErrorForwarder.java:67)
	at org.eclipse.aether.connector.basic.BasicRepositoryConnector$DirectExecutor.execute(BasicRepositoryConnector.java:581)
	at org.eclipse.aether.connector.basic.BasicRepositoryConnector.get(BasicRepositoryConnector.java:249)
	at org.eclipse.aether.internal.impl.DefaultArtifactResolver.performDownloads(DefaultArtifactResolver.java:520)
	at org.eclipse.aether.internal.impl.DefaultArtifactResolver.resolve(DefaultArtifactResolver.java:421)
	... 47 more
Caused by: org.apache.maven.wagon.TransferFailedException: Connection reset
	at org.apache.maven.wagon.providers.http.AbstractHttpClientWagon.fillInputData(AbstractHttpClientWagon.java:1066)
	at org.apache.maven.wagon.providers.http.AbstractHttpClientWagon.fillInputData(AbstractHttpClientWagon.java:960)
	at org.apache.maven.wagon.StreamWagon.getInputStream(StreamWagon.java:116)
	at org.apache.maven.wagon.StreamWagon.getIfNewer(StreamWagon.java:88)
	at org.apache.maven.wagon.StreamWagon.get(StreamWagon.java:61)
	at org.eclipse.aether.transport.wagon.WagonTransporter$GetTaskRunner.run(WagonTransporter.java:560)
	at org.eclipse.aether.transport.wagon.WagonTransporter.execute(WagonTransporter.java:427)
	at org.eclipse.aether.transport.wagon.WagonTransporter.get(WagonTransporter.java:404)
	at org.eclipse.aether.connector.basic.BasicRepositoryConnector$GetTaskRunner.runTask(BasicRepositoryConnector.java:447)
	at org.eclipse.aether.connector.basic.BasicRepositoryConnector$TaskRunner.run(BasicRepositoryConnector.java:350)
	... 52 more
Caused by: java.net.SocketException: Connection reset
	at java.net.SocketInputStream.read(SocketInputStream.java:210)
	at java.net.SocketInputStream.read(SocketInputStream.java:141)
	at sun.security.ssl.InputRecord.readFully(InputRecord.java:465)
	at sun.security.ssl.InputRecord.read(InputRecord.java:503)
	at sun.security.ssl.SSLSocketImpl.readRecord(SSLSocketImpl.java:973)
	at sun.security.ssl.SSLSocketImpl.readDataRecord(SSLSocketImpl.java:930)
	at sun.security.ssl.AppInputStream.read(AppInputStream.java:105)
	at org.apache.maven.wagon.providers.http.httpclient.impl.io.SessionInputBufferImpl.streamRead(SessionInputBufferImpl.java:136)
	at org.apache.maven.wagon.providers.http.httpclient.impl.io.SessionInputBufferImpl.fillBuffer(SessionInputBufferImpl.java:152)
	at org.apache.maven.wagon.providers.http.httpclient.impl.io.SessionInputBufferImpl.readLine(SessionInputBufferImpl.java:270)
	at org.apache.maven.wagon.providers.http.httpclient.impl.conn.DefaultHttpResponseParser.parseHead(DefaultHttpResponseParser.java:140)
	at org.apache.maven.wagon.providers.http.httpclient.impl.conn.DefaultHttpResponseParser.parseHead(DefaultHttpResponseParser.java:57)
	at org.apache.maven.wagon.providers.http.httpclient.impl.io.AbstractMessageParser.parse(AbstractMessageParser.java:260)
	at org.apache.maven.wagon.providers.http.httpclient.impl.DefaultBHttpClientConnection.receiveResponseHeader(DefaultBHttpClientConnection.java:161)
	at org.apache.maven.wagon.providers.http.httpclient.impl.conn.CPoolProxy.receiveResponseHeader(CPoolProxy.java:153)
	at org.apache.maven.wagon.providers.http.httpclient.protocol.HttpRequestExecutor.doReceiveResponse(HttpRequestExecutor.java:271)
	at org.apache.maven.wagon.providers.http.httpclient.protocol.HttpRequestExecutor.execute(HttpRequestExecutor.java:123)
	at org.apache.maven.wagon.providers.http.httpclient.impl.execchain.MainClientExec.execute(MainClientExec.java:254)
	at org.apache.maven.wagon.providers.http.httpclient.impl.execchain.ProtocolExec.execute(ProtocolExec.java:195)
	at org.apache.maven.wagon.providers.http.httpclient.impl.execchain.RetryExec.execute(RetryExec.java:86)
	at org.apache.maven.wagon.providers.http.httpclient.impl.execchain.RedirectExec.execute(RedirectExec.java:108)
	at org.apache.maven.wagon.providers.http.httpclient.impl.client.InternalHttpClient.doExecute(InternalHttpClient.java:184)
	at org.apache.maven.wagon.providers.http.httpclient.impl.client.CloseableHttpClient.execute(CloseableHttpClient.java:82)
	at org.apache.maven.wagon.providers.http.AbstractHttpClientWagon.execute(AbstractHttpClientWagon.java:832)
	at org.apache.maven.wagon.providers.http.AbstractHttpClientWagon.fillInputData(AbstractHttpClientWagon.java:983)
	... 61 more
2017-06-21T22:30:23.008 [ERROR] 
2017-06-21T22:30:23.008 [ERROR] Re-run Maven using the -X switch to enable full debug logging.
2017-06-21T22:30:23.008 [ERROR] 
2017-06-21T22:30:23.008 [ERROR] For more information about the errors and possible solutions,
please read the following articles:
2017-06-21T22:30:23.008 [ERROR] [Help 1] http://cwiki.apache.org/confluence/display/MAVEN/DependencyResolutionException
2017-06-21T22:30:23.008 [ERROR] 
2017-06-21T22:30:23.008 [ERROR] After correcting the problems, you can resume the build with
the command
2017-06-21T22:30:23.008 [ERROR]   mvn <goals> -rf :beam-sdks-java-io-jms
channel stopped
Not sending mail to unregistered user github@nakomis.com

Mime
View raw message