beam-commits mailing list archives

Site index · List index
Message view « Date » · « Thread »
Top « Date » · « Thread »
From Apache Jenkins Server <jenk...@builds.apache.org>
Subject Build failed in Jenkins: beam_PostCommit_Java_ValidatesRunner_Apex #1678
Date Wed, 07 Jun 2017 12:54:22 GMT
See <https://builds.apache.org/job/beam_PostCommit_Java_ValidatesRunner_Apex/1678/display/redirect?page=changes>

Changes:

[jbonofre] Sort IO by alphanumeric order

------------------------------------------
[...truncated 467.09 KB...]
2017-06-07T12:54:10.187 [INFO] Downloaded: https://repo.maven.apache.org/maven2/org/codehaus/jackson/jackson-core-asl/1.8.8/jackson-core-asl-1.8.8.pom
(1016 B at 35.4 KB/sec)
2017-06-07T12:54:10.190 [INFO] Downloading: https://repo.maven.apache.org/maven2/org/codehaus/jackson/jackson-mapper-asl/1.8.8/jackson-mapper-asl-1.8.8.pom
2017-06-07T12:54:10.219 [INFO] Downloaded: https://repo.maven.apache.org/maven2/org/codehaus/jackson/jackson-mapper-asl/1.8.8/jackson-mapper-asl-1.8.8.pom
(2 KB at 41.8 KB/sec)
2017-06-07T12:54:10.221 [INFO] Downloading: https://repo.maven.apache.org/maven2/org/apache/hadoop/hadoop-auth/2.2.0/hadoop-auth-2.2.0.pom
2017-06-07T12:54:10.249 [INFO] Downloaded: https://repo.maven.apache.org/maven2/org/apache/hadoop/hadoop-auth/2.2.0/hadoop-auth-2.2.0.pom
(7 KB at 245.1 KB/sec)
2017-06-07T12:54:10.253 [INFO] Downloading: https://repo.maven.apache.org/maven2/com/jcraft/jsch/0.1.42/jsch-0.1.42.pom
2017-06-07T12:54:10.279 [INFO] Downloaded: https://repo.maven.apache.org/maven2/com/jcraft/jsch/0.1.42/jsch-0.1.42.pom
(967 B at 36.3 KB/sec)
2017-06-07T12:54:10.281 [INFO] Downloading: https://repo.maven.apache.org/maven2/org/apache/zookeeper/zookeeper/3.4.5/zookeeper-3.4.5.pom
2017-06-07T12:54:10.309 [INFO] Downloaded: https://repo.maven.apache.org/maven2/org/apache/zookeeper/zookeeper/3.4.5/zookeeper-3.4.5.pom
(3 KB at 104.7 KB/sec)
2017-06-07T12:54:10.311 [INFO] Downloading: https://repo.maven.apache.org/maven2/org/slf4j/slf4j-log4j12/1.6.1/slf4j-log4j12-1.6.1.pom
2017-06-07T12:54:10.338 [INFO] Downloaded: https://repo.maven.apache.org/maven2/org/slf4j/slf4j-log4j12/1.6.1/slf4j-log4j12-1.6.1.pom
(2 KB at 59.8 KB/sec)
2017-06-07T12:54:10.339 [INFO] Downloading: https://repo.maven.apache.org/maven2/org/slf4j/slf4j-parent/1.6.1/slf4j-parent-1.6.1.pom
2017-06-07T12:54:10.367 [INFO] Downloaded: https://repo.maven.apache.org/maven2/org/slf4j/slf4j-parent/1.6.1/slf4j-parent-1.6.1.pom
(10 KB at 325.2 KB/sec)
2017-06-07T12:54:10.370 [INFO] Downloading: https://repo.maven.apache.org/maven2/log4j/log4j/1.2.16/log4j-1.2.16.pom
2017-06-07T12:54:10.398 [INFO] Downloaded: https://repo.maven.apache.org/maven2/log4j/log4j/1.2.16/log4j-1.2.16.pom
(20 KB at 709.4 KB/sec)
2017-06-07T12:54:10.401 [INFO] Downloading: https://repo.maven.apache.org/maven2/log4j/log4j/1.2.15/log4j-1.2.15.pom
2017-06-07T12:54:10.428 [INFO] Downloaded: https://repo.maven.apache.org/maven2/log4j/log4j/1.2.15/log4j-1.2.15.pom
(18 KB at 643.1 KB/sec)
2017-06-07T12:54:10.431 [INFO] Downloading: https://repo.maven.apache.org/maven2/javax/mail/mail/1.4/mail-1.4.pom
2017-06-07T12:54:10.459 [INFO] Downloaded: https://repo.maven.apache.org/maven2/javax/mail/mail/1.4/mail-1.4.pom
(993 B at 34.6 KB/sec)
2017-06-07T12:54:10.460 [INFO] Downloading: https://repo.maven.apache.org/maven2/javax/jms/jms/1.1/jms-1.1.pom
2017-06-07T12:54:10.488 [INFO] Downloaded: https://repo.maven.apache.org/maven2/javax/jms/jms/1.1/jms-1.1.pom
(677 B at 23.6 KB/sec)
2017-06-07T12:54:10.490 [INFO] Downloading: https://repo.maven.apache.org/maven2/com/datatorrent/netlet/1.2.1/netlet-1.2.1.pom
2017-06-07T12:54:10.520 [INFO] Downloaded: https://repo.maven.apache.org/maven2/com/datatorrent/netlet/1.2.1/netlet-1.2.1.pom
(19 KB at 608.8 KB/sec)
2017-06-07T12:54:10.523 [INFO] Downloading: https://repo.maven.apache.org/maven2/com/esotericsoftware/kryo/kryo/2.24.0/kryo-2.24.0.pom
2017-06-07T12:54:10.552 [INFO] Downloaded: https://repo.maven.apache.org/maven2/com/esotericsoftware/kryo/kryo/2.24.0/kryo-2.24.0.pom
(7 KB at 209.5 KB/sec)
2017-06-07T12:54:10.555 [INFO] Downloading: https://repo.maven.apache.org/maven2/org/objenesis/objenesis/2.1/objenesis-2.1.pom
2017-06-07T12:54:10.584 [INFO] Downloaded: https://repo.maven.apache.org/maven2/org/objenesis/objenesis/2.1/objenesis-2.1.pom
(3 KB at 85.4 KB/sec)
2017-06-07T12:54:10.586 [INFO] Downloading: https://repo.maven.apache.org/maven2/org/objenesis/objenesis-parent/2.1/objenesis-parent-2.1.pom
2017-06-07T12:54:10.615 [INFO] Downloaded: https://repo.maven.apache.org/maven2/org/objenesis/objenesis-parent/2.1/objenesis-parent-2.1.pom
(17 KB at 562.6 KB/sec)
2017-06-07T12:54:10.619 [INFO] Downloading: https://repo.maven.apache.org/maven2/org/codehaus/jackson/jackson-core-asl/1.9.2/jackson-core-asl-1.9.2.pom
2017-06-07T12:54:10.648 [INFO] Downloaded: https://repo.maven.apache.org/maven2/org/codehaus/jackson/jackson-core-asl/1.9.2/jackson-core-asl-1.9.2.pom
(1016 B at 35.4 KB/sec)
2017-06-07T12:54:10.650 [INFO] Downloading: https://repo.maven.apache.org/maven2/org/codehaus/jackson/jackson-mapper-asl/1.9.2/jackson-mapper-asl-1.9.2.pom
2017-06-07T12:54:10.678 [INFO] Downloaded: https://repo.maven.apache.org/maven2/org/codehaus/jackson/jackson-mapper-asl/1.9.2/jackson-mapper-asl-1.9.2.pom
(2 KB at 43.3 KB/sec)
2017-06-07T12:54:10.681 [INFO] Downloading: https://repo.maven.apache.org/maven2/javax/validation/validation-api/1.1.0.Final/validation-api-1.1.0.Final.pom
2017-06-07T12:54:10.708 [INFO] Downloaded: https://repo.maven.apache.org/maven2/javax/validation/validation-api/1.1.0.Final/validation-api-1.1.0.Final.pom
(8 KB at 284.3 KB/sec)
2017-06-07T12:54:10.711 [INFO] Downloading: https://repo.maven.apache.org/maven2/org/eclipse/jetty/jetty-servlet/8.1.10.v20130312/jetty-servlet-8.1.10.v20130312.pom
2017-06-07T12:54:10.738 [INFO] Downloaded: https://repo.maven.apache.org/maven2/org/eclipse/jetty/jetty-servlet/8.1.10.v20130312/jetty-servlet-8.1.10.v20130312.pom
(3 KB at 97.1 KB/sec)
2017-06-07T12:54:10.740 [INFO] Downloading: https://repo.maven.apache.org/maven2/org/eclipse/jetty/jetty-project/8.1.10.v20130312/jetty-project-8.1.10.v20130312.pom
2017-06-07T12:54:10.771 [INFO] Downloaded: https://repo.maven.apache.org/maven2/org/eclipse/jetty/jetty-project/8.1.10.v20130312/jetty-project-8.1.10.v20130312.pom
(28 KB at 879.5 KB/sec)
2017-06-07T12:54:10.773 [INFO] Downloading: https://repo.maven.apache.org/maven2/org/eclipse/jetty/jetty-parent/20/jetty-parent-20.pom
2017-06-07T12:54:10.803 [INFO] Downloaded: https://repo.maven.apache.org/maven2/org/eclipse/jetty/jetty-parent/20/jetty-parent-20.pom
(21 KB at 713.8 KB/sec)
2017-06-07T12:54:10.806 [INFO] Downloading: https://repo.maven.apache.org/maven2/org/eclipse/jetty/jetty-security/8.1.10.v20130312/jetty-security-8.1.10.v20130312.pom
2017-06-07T12:54:10.835 [INFO] Downloaded: https://repo.maven.apache.org/maven2/org/eclipse/jetty/jetty-security/8.1.10.v20130312/jetty-security-8.1.10.v20130312.pom
(3 KB at 90.8 KB/sec)
2017-06-07T12:54:10.839 [INFO] Downloading: https://repo.maven.apache.org/maven2/org/eclipse/jetty/jetty-server/8.1.10.v20130312/jetty-server-8.1.10.v20130312.pom
2017-06-07T12:54:10.867 [INFO] Downloaded: https://repo.maven.apache.org/maven2/org/eclipse/jetty/jetty-server/8.1.10.v20130312/jetty-server-8.1.10.v20130312.pom
(4 KB at 130.4 KB/sec)
2017-06-07T12:54:10.871 [INFO] Downloading: https://repo.maven.apache.org/maven2/org/eclipse/jetty/jetty-continuation/8.1.10.v20130312/jetty-continuation-8.1.10.v20130312.pom
2017-06-07T12:54:10.898 [INFO] Downloaded: https://repo.maven.apache.org/maven2/org/eclipse/jetty/jetty-continuation/8.1.10.v20130312/jetty-continuation-8.1.10.v20130312.pom
(3 KB at 97.4 KB/sec)
2017-06-07T12:54:10.902 [INFO] Downloading: https://repo.maven.apache.org/maven2/org/eclipse/jetty/jetty-http/8.1.10.v20130312/jetty-http-8.1.10.v20130312.pom
2017-06-07T12:54:10.931 [INFO] Downloaded: https://repo.maven.apache.org/maven2/org/eclipse/jetty/jetty-http/8.1.10.v20130312/jetty-http-8.1.10.v20130312.pom
(3 KB at 87.5 KB/sec)
2017-06-07T12:54:10.936 [INFO] Downloading: https://repo.maven.apache.org/maven2/org/eclipse/jetty/jetty-io/8.1.10.v20130312/jetty-io-8.1.10.v20130312.pom
2017-06-07T12:54:10.963 [INFO] Downloaded: https://repo.maven.apache.org/maven2/org/eclipse/jetty/jetty-io/8.1.10.v20130312/jetty-io-8.1.10.v20130312.pom
(3 KB at 76.1 KB/sec)
2017-06-07T12:54:10.967 [INFO] Downloading: https://repo.maven.apache.org/maven2/org/eclipse/jetty/jetty-util/8.1.10.v20130312/jetty-util-8.1.10.v20130312.pom
2017-06-07T12:54:10.995 [INFO] Downloaded: https://repo.maven.apache.org/maven2/org/eclipse/jetty/jetty-util/8.1.10.v20130312/jetty-util-8.1.10.v20130312.pom
(4 KB at 118.3 KB/sec)
2017-06-07T12:54:10.999 [INFO] Downloading: https://repo.maven.apache.org/maven2/com/sun/mail/javax.mail/1.5.0/javax.mail-1.5.0.pom
2017-06-07T12:54:11.027 [INFO] Downloaded: https://repo.maven.apache.org/maven2/com/sun/mail/javax.mail/1.5.0/javax.mail-1.5.0.pom
(5 KB at 149.9 KB/sec)
2017-06-07T12:54:11.028 [INFO] Downloading: https://repo.maven.apache.org/maven2/com/sun/mail/all/1.5.0/all-1.5.0.pom
2017-06-07T12:54:11.057 [INFO] Downloaded: https://repo.maven.apache.org/maven2/com/sun/mail/all/1.5.0/all-1.5.0.pom
(19 KB at 654.4 KB/sec)
2017-06-07T12:54:11.060 [INFO] Downloading: https://repo.maven.apache.org/maven2/com/sun/jersey/jersey-client/1.9/jersey-client-1.9.pom
2017-06-07T12:54:11.087 [INFO] Downloaded: https://repo.maven.apache.org/maven2/com/sun/jersey/jersey-client/1.9/jersey-client-1.9.pom
(7 KB at 233.0 KB/sec)
2017-06-07T12:54:11.090 [INFO] Downloading: https://repo.maven.apache.org/maven2/javax/jms/jms-api/1.1-rev-1/jms-api-1.1-rev-1.pom
2017-06-07T12:54:11.117 [INFO] Downloaded: https://repo.maven.apache.org/maven2/javax/jms/jms-api/1.1-rev-1/jms-api-1.1-rev-1.pom
(3 KB at 111.0 KB/sec)
2017-06-07T12:54:11.118 [INFO] Downloading: https://repo.maven.apache.org/maven2/org/glassfish/api/api/1/api-1.pom
2017-06-07T12:54:11.146 [INFO] Downloaded: https://repo.maven.apache.org/maven2/org/glassfish/api/api/1/api-1.pom
(6 KB at 180.4 KB/sec)
2017-06-07T12:54:11.147 [INFO] Downloading: https://repo.maven.apache.org/maven2/org/glassfish/pom/2/pom-2.pom
2017-06-07T12:54:11.176 [INFO] Downloaded: https://repo.maven.apache.org/maven2/org/glassfish/pom/2/pom-2.pom
(9 KB at 304.4 KB/sec)
2017-06-07T12:54:11.178 [INFO] Downloading: https://repo.maven.apache.org/maven2/org/apache/activemq/activemq-client/5.8.0/activemq-client-5.8.0.pom
2017-06-07T12:54:11.206 [INFO] Downloaded: https://repo.maven.apache.org/maven2/org/apache/activemq/activemq-client/5.8.0/activemq-client-5.8.0.pom
(11 KB at 364.2 KB/sec)
2017-06-07T12:54:11.207 [INFO] Downloading: https://repo.maven.apache.org/maven2/org/apache/activemq/activemq-parent/5.8.0/activemq-parent-5.8.0.pom
2017-06-07T12:54:11.243 [INFO] Downloaded: https://repo.maven.apache.org/maven2/org/apache/activemq/activemq-parent/5.8.0/activemq-parent-5.8.0.pom
(54 KB at 1493.2 KB/sec)
2017-06-07T12:54:11.249 [INFO] Downloading: https://repo.maven.apache.org/maven2/org/apache/geronimo/specs/geronimo-jms_1.1_spec/1.1.1/geronimo-jms_1.1_spec-1.1.1.pom
2017-06-07T12:54:11.277 [INFO] Downloaded: https://repo.maven.apache.org/maven2/org/apache/geronimo/specs/geronimo-jms_1.1_spec/1.1.1/geronimo-jms_1.1_spec-1.1.1.pom
(3 KB at 90.0 KB/sec)
2017-06-07T12:54:11.278 [INFO] Downloading: https://repo.maven.apache.org/maven2/org/apache/geronimo/specs/specs/1.4/specs-1.4.pom
2017-06-07T12:54:11.306 [INFO] Downloaded: https://repo.maven.apache.org/maven2/org/apache/geronimo/specs/specs/1.4/specs-1.4.pom
(12 KB at 418.5 KB/sec)
2017-06-07T12:54:11.308 [INFO] Downloading: https://repo.maven.apache.org/maven2/org/apache/geronimo/genesis/config/project-config/1.2/project-config-1.2.pom
2017-06-07T12:54:11.336 [INFO] Downloaded: https://repo.maven.apache.org/maven2/org/apache/geronimo/genesis/config/project-config/1.2/project-config-1.2.pom
(22 KB at 760.1 KB/sec)
2017-06-07T12:54:11.338 [INFO] Downloading: https://repo.maven.apache.org/maven2/org/apache/geronimo/genesis/config/config/1.2/config-1.2.pom
2017-06-07T12:54:11.364 [INFO] Downloaded: https://repo.maven.apache.org/maven2/org/apache/geronimo/genesis/config/config/1.2/config-1.2.pom
(2 KB at 66.7 KB/sec)
2017-06-07T12:54:11.366 [INFO] Downloading: https://repo.maven.apache.org/maven2/org/apache/geronimo/genesis/genesis/1.2/genesis-1.2.pom
2017-06-07T12:54:11.394 [INFO] Downloaded: https://repo.maven.apache.org/maven2/org/apache/geronimo/genesis/genesis/1.2/genesis-1.2.pom
(11 KB at 387.0 KB/sec)
2017-06-07T12:54:11.397 [INFO] Downloading: https://repo.maven.apache.org/maven2/org/fusesource/hawtbuf/hawtbuf/1.9/hawtbuf-1.9.pom
2017-06-07T12:54:11.424 [INFO] Downloaded: https://repo.maven.apache.org/maven2/org/fusesource/hawtbuf/hawtbuf/1.9/hawtbuf-1.9.pom
(3 KB at 93.9 KB/sec)
2017-06-07T12:54:11.426 [INFO] Downloading: https://repo.maven.apache.org/maven2/org/fusesource/hawtbuf/hawtbuf-project/1.9/hawtbuf-project-1.9.pom
2017-06-07T12:54:11.455 [INFO] Downloaded: https://repo.maven.apache.org/maven2/org/fusesource/hawtbuf/hawtbuf-project/1.9/hawtbuf-project-1.9.pom
(11 KB at 360.4 KB/sec)
2017-06-07T12:54:11.457 [INFO] Downloading: https://repo.maven.apache.org/maven2/org/fusesource/fusesource-pom/1.9/fusesource-pom-1.9.pom
2017-06-07T12:54:11.486 [INFO] Downloaded: https://repo.maven.apache.org/maven2/org/fusesource/fusesource-pom/1.9/fusesource-pom-1.9.pom
(15 KB at 498.1 KB/sec)
2017-06-07T12:54:11.490 [INFO] Downloading: https://repo.maven.apache.org/maven2/org/apache/geronimo/specs/geronimo-j2ee-management_1.1_spec/1.0.1/geronimo-j2ee-management_1.1_spec-1.0.1.pom
2017-06-07T12:54:11.518 [INFO] Downloaded: https://repo.maven.apache.org/maven2/org/apache/geronimo/specs/geronimo-j2ee-management_1.1_spec/1.0.1/geronimo-j2ee-management_1.1_spec-1.0.1.pom
(3 KB at 88.9 KB/sec)
2017-06-07T12:54:11.522 [INFO] Downloading: https://repo.maven.apache.org/maven2/com/github/tony19/named-regexp/0.2.3/named-regexp-0.2.3.pom
2017-06-07T12:54:11.551 [INFO] Downloaded: https://repo.maven.apache.org/maven2/com/github/tony19/named-regexp/0.2.3/named-regexp-0.2.3.pom
(7 KB at 229.4 KB/sec)
2017-06-07T12:54:11.554 [INFO] Downloading: https://repo.maven.apache.org/maven2/org/codehaus/janino/commons-compiler/2.7.8/commons-compiler-2.7.8.pom
2017-06-07T12:54:11.583 [INFO] Downloaded: https://repo.maven.apache.org/maven2/org/codehaus/janino/commons-compiler/2.7.8/commons-compiler-2.7.8.pom
(666 B at 22.4 KB/sec)
2017-06-07T12:54:11.585 [INFO] Downloading: https://repo.maven.apache.org/maven2/org/codehaus/janino/janino-parent/2.7.8/janino-parent-2.7.8.pom
2017-06-07T12:54:11.613 [INFO] Downloaded: https://repo.maven.apache.org/maven2/org/codehaus/janino/janino-parent/2.7.8/janino-parent-2.7.8.pom
(9 KB at 291.1 KB/sec)
2017-06-07T12:54:11.616 [INFO] Downloading: https://repo.maven.apache.org/maven2/org/eclipse/jetty/jetty-websocket/8.1.10.v20130312/jetty-websocket-8.1.10.v20130312.pom
2017-06-07T12:54:11.645 [INFO] Downloaded: https://repo.maven.apache.org/maven2/org/eclipse/jetty/jetty-websocket/8.1.10.v20130312/jetty-websocket-8.1.10.v20130312.pom
(4 KB at 136.6 KB/sec)
2017-06-07T12:54:11.652 [INFO] Downloading: https://repo.maven.apache.org/maven2/it/unimi/dsi/fastutil/7.0.6/fastutil-7.0.6.pom
2017-06-07T12:54:11.680 [INFO] Downloaded: https://repo.maven.apache.org/maven2/it/unimi/dsi/fastutil/7.0.6/fastutil-7.0.6.pom
(2 KB at 38.4 KB/sec)
2017-06-07T12:54:11.682 [INFO] Downloading: https://repo.maven.apache.org/maven2/org/apache/apex/apex-shaded-ning19/1.0.0/apex-shaded-ning19-1.0.0.pom
2017-06-07T12:54:11.710 [INFO] Downloaded: https://repo.maven.apache.org/maven2/org/apache/apex/apex-shaded-ning19/1.0.0/apex-shaded-ning19-1.0.0.pom
(651 B at 22.7 KB/sec)
2017-06-07T12:54:11.712 [INFO] Downloading: https://repo.maven.apache.org/maven2/org/apache/apex/apex-engine/3.6.0/apex-engine-3.6.0.pom
2017-06-07T12:54:11.742 [INFO] Downloaded: https://repo.maven.apache.org/maven2/org/apache/apex/apex-engine/3.6.0/apex-engine-3.6.0.pom
(14 KB at 436.1 KB/sec)
2017-06-07T12:54:11.744 [INFO] Downloading: https://repo.maven.apache.org/maven2/org/apache/apex/apex/3.6.0/apex-3.6.0.pom
2017-06-07T12:54:11.772 [INFO] Downloaded: https://repo.maven.apache.org/maven2/org/apache/apex/apex/3.6.0/apex-3.6.0.pom
(17 KB at 593.8 KB/sec)
2017-06-07T12:54:11.776 [INFO] Downloading: https://repo.maven.apache.org/maven2/org/apache/bval/bval-jsr303/0.5/bval-jsr303-0.5.pom
2017-06-07T12:54:11.804 [INFO] Downloaded: https://repo.maven.apache.org/maven2/org/apache/bval/bval-jsr303/0.5/bval-jsr303-0.5.pom
(9 KB at 290.9 KB/sec)
2017-06-07T12:54:11.806 [INFO] Downloading: https://repo.maven.apache.org/maven2/org/apache/bval/bval-parent/0.5/bval-parent-0.5.pom
2017-06-07T12:54:11.834 [INFO] Downloaded: https://repo.maven.apache.org/maven2/org/apache/bval/bval-parent/0.5/bval-parent-0.5.pom
(25 KB at 864.1 KB/sec)
2017-06-07T12:54:11.837 [INFO] Downloading: https://repo.maven.apache.org/maven2/org/apache/bval/bval-core/0.5/bval-core-0.5.pom
2017-06-07T12:54:11.883 [INFO] Downloaded: https://repo.maven.apache.org/maven2/org/apache/bval/bval-core/0.5/bval-core-0.5.pom
(6 KB at 128.7 KB/sec)
2017-06-07T12:54:11.886 [INFO] Downloading: https://repo.maven.apache.org/maven2/org/apache/apex/apex-bufferserver/3.6.0/apex-bufferserver-3.6.0.pom
2017-06-07T12:54:11.914 [INFO] Downloaded: https://repo.maven.apache.org/maven2/org/apache/apex/apex-bufferserver/3.6.0/apex-bufferserver-3.6.0.pom
(3 KB at 81.1 KB/sec)
2017-06-07T12:54:11.917 [INFO] Downloading: https://repo.maven.apache.org/maven2/org/apache/httpcomponents/httpclient/4.3.6/httpclient-4.3.6.pom
2017-06-07T12:54:11.945 [INFO] Downloaded: https://repo.maven.apache.org/maven2/org/apache/httpcomponents/httpclient/4.3.6/httpclient-4.3.6.pom
(6 KB at 181.7 KB/sec)
2017-06-07T12:54:11.946 [INFO] Downloading: https://repo.maven.apache.org/maven2/org/apache/httpcomponents/httpcomponents-client/4.3.6/httpcomponents-client-4.3.6.pom
2017-06-07T12:54:11.974 [INFO] Downloaded: https://repo.maven.apache.org/maven2/org/apache/httpcomponents/httpcomponents-client/4.3.6/httpcomponents-client-4.3.6.pom
(16 KB at 556.2 KB/sec)
2017-06-07T12:54:11.976 [INFO] Downloading: https://repo.maven.apache.org/maven2/org/apache/httpcomponents/project/7/project-7.pom
2017-06-07T12:54:12.004 [INFO] Downloaded: https://repo.maven.apache.org/maven2/org/apache/httpcomponents/project/7/project-7.pom
(27 KB at 950.2 KB/sec)
2017-06-07T12:54:12.008 [INFO] Downloading: https://repo.maven.apache.org/maven2/org/apache/httpcomponents/httpcore/4.3.3/httpcore-4.3.3.pom
2017-06-07T12:54:12.036 [INFO] Downloaded: https://repo.maven.apache.org/maven2/org/apache/httpcomponents/httpcore/4.3.3/httpcore-4.3.3.pom
(5 KB at 160.3 KB/sec)
2017-06-07T12:54:12.038 [INFO] Downloading: https://repo.maven.apache.org/maven2/org/apache/httpcomponents/httpcomponents-core/4.3.3/httpcomponents-core-4.3.3.pom
2017-06-07T12:54:12.066 [INFO] Downloaded: https://repo.maven.apache.org/maven2/org/apache/httpcomponents/httpcomponents-core/4.3.3/httpcomponents-core-4.3.3.pom
(13 KB at 460.0 KB/sec)
2017-06-07T12:54:12.069 [INFO] Downloading: https://repo.maven.apache.org/maven2/commons-logging/commons-logging/1.1.3/commons-logging-1.1.3.pom
2017-06-07T12:54:12.096 [INFO] Downloaded: https://repo.maven.apache.org/maven2/commons-logging/commons-logging/1.1.3/commons-logging-1.1.3.pom
(18 KB at 663.8 KB/sec)
2017-06-07T12:54:12.098 [INFO] Downloading: https://repo.maven.apache.org/maven2/org/apache/commons/commons-parent/28/commons-parent-28.pom
2017-06-07T12:54:12.130 [INFO] Downloaded: https://repo.maven.apache.org/maven2/org/apache/commons/commons-parent/28/commons-parent-28.pom
(49 KB at 1530.4 KB/sec)
2017-06-07T12:54:12.135 [INFO] Downloading: https://repo.maven.apache.org/maven2/com/sun/jersey/contribs/jersey-apache-client4/1.9/jersey-apache-client4-1.9.pom
2017-06-07T12:54:12.162 [INFO] Downloaded: https://repo.maven.apache.org/maven2/com/sun/jersey/contribs/jersey-apache-client4/1.9/jersey-apache-client4-1.9.pom
(7 KB at 224.6 KB/sec)
2017-06-07T12:54:12.164 [INFO] Downloading: https://repo.maven.apache.org/maven2/com/sun/jersey/contribs/jersey-contribs/1.9/jersey-contribs-1.9.pom
2017-06-07T12:54:12.190 [INFO] Downloaded: https://repo.maven.apache.org/maven2/com/sun/jersey/contribs/jersey-contribs/1.9/jersey-contribs-1.9.pom
(5 KB at 156.1 KB/sec)
2017-06-07T12:54:12.193 [INFO] Downloading: https://repo.maven.apache.org/maven2/org/apache/httpcomponents/httpclient/4.1.1/httpclient-4.1.1.pom
2017-06-07T12:54:12.220 [INFO] Downloaded: https://repo.maven.apache.org/maven2/org/apache/httpcomponents/httpclient/4.1.1/httpclient-4.1.1.pom
(6 KB at 216.7 KB/sec)
2017-06-07T12:54:12.222 [INFO] Downloading: https://repo.maven.apache.org/maven2/org/apache/httpcomponents/httpcomponents-client/4.1.1/httpcomponents-client-4.1.1.pom
2017-06-07T12:54:12.251 [INFO] Downloaded: https://repo.maven.apache.org/maven2/org/apache/httpcomponents/httpcomponents-client/4.1.1/httpcomponents-client-4.1.1.pom
(12 KB at 381.8 KB/sec)
2017-06-07T12:54:12.254 [INFO] Downloading: https://repo.maven.apache.org/maven2/org/apache/httpcomponents/project/4.1.1/project-4.1.1.pom
2017-06-07T12:54:12.281 [INFO] Downloaded: https://repo.maven.apache.org/maven2/org/apache/httpcomponents/project/4.1.1/project-4.1.1.pom
(17 KB at 606.5 KB/sec)
2017-06-07T12:54:12.284 [INFO] Downloading: https://repo.maven.apache.org/maven2/org/apache/httpcomponents/httpcore/4.1/httpcore-4.1.pom
2017-06-07T12:54:12.310 [INFO] Downloaded: https://repo.maven.apache.org/maven2/org/apache/httpcomponents/httpcore/4.1/httpcore-4.1.pom
(9 KB at 313.9 KB/sec)
2017-06-07T12:54:12.312 [INFO] Downloading: https://repo.maven.apache.org/maven2/org/apache/httpcomponents/httpcomponents-core/4.1/httpcomponents-core-4.1.pom
2017-06-07T12:54:12.342 [INFO] Downloaded: https://repo.maven.apache.org/maven2/org/apache/httpcomponents/httpcomponents-core/4.1/httpcomponents-core-4.1.pom
(9 KB at 294.3 KB/sec)
2017-06-07T12:54:12.346 [INFO] Downloading: https://repo.maven.apache.org/maven2/org/apache/hadoop/hadoop-yarn-client/2.6.0/hadoop-yarn-client-2.6.0.pom
2017-06-07T12:54:12.373 [INFO] Downloaded: https://repo.maven.apache.org/maven2/org/apache/hadoop/hadoop-yarn-client/2.6.0/hadoop-yarn-client-2.6.0.pom
(7 KB at 228.7 KB/sec)
2017-06-07T12:54:12.375 [INFO] Downloading: https://repo.maven.apache.org/maven2/org/apache/hadoop/hadoop-yarn/2.6.0/hadoop-yarn-2.6.0.pom
2017-06-07T12:54:12.404 [INFO] Downloaded: https://repo.maven.apache.org/maven2/org/apache/hadoop/hadoop-yarn/2.6.0/hadoop-yarn-2.6.0.pom
(4 KB at 120.5 KB/sec)
2017-06-07T12:54:12.406 [INFO] Downloading: https://repo.maven.apache.org/maven2/org/apache/hadoop/hadoop-project/2.6.0/hadoop-project-2.6.0.pom
2017-06-07T12:54:12.439 [INFO] Downloaded: https://repo.maven.apache.org/maven2/org/apache/hadoop/hadoop-project/2.6.0/hadoop-project-2.6.0.pom
(43 KB at 1283.3 KB/sec)
2017-06-07T12:54:12.443 [INFO] Downloading: https://repo.maven.apache.org/maven2/org/apache/hadoop/hadoop-main/2.6.0/hadoop-main-2.6.0.pom
2017-06-07T12:54:12.626 [INFO] Downloaded: https://repo.maven.apache.org/maven2/org/apache/hadoop/hadoop-main/2.6.0/hadoop-main-2.6.0.pom
(18 KB at 96.5 KB/sec)
2017-06-07T12:54:12.632 [INFO] Downloading: https://repo.maven.apache.org/maven2/org/apache/hadoop/hadoop-annotations/2.6.0/hadoop-annotations-2.6.0.pom
2017-06-07T12:54:12.661 [INFO] Downloaded: https://repo.maven.apache.org/maven2/org/apache/hadoop/hadoop-annotations/2.6.0/hadoop-annotations-2.6.0.pom
(3 KB at 80.4 KB/sec)
2017-06-07T12:54:12.666 [INFO] Downloading: https://repo.maven.apache.org/maven2/org/apache/hadoop/hadoop-yarn-api/2.6.0/hadoop-yarn-api-2.6.0.pom
2017-06-07T12:54:12.699 [INFO] Downloaded: https://repo.maven.apache.org/maven2/org/apache/hadoop/hadoop-yarn-api/2.6.0/hadoop-yarn-api-2.6.0.pom
(5 KB at 136.5 KB/sec)
2017-06-07T12:54:12.705 [INFO] Downloading: https://repo.maven.apache.org/maven2/org/apache/hadoop/hadoop-yarn-common/2.6.0/hadoop-yarn-common-2.6.0.pom
2017-06-07T12:54:12.734 [INFO] Downloaded: https://repo.maven.apache.org/maven2/org/apache/hadoop/hadoop-yarn-common/2.6.0/hadoop-yarn-common-2.6.0.pom
(11 KB at 353.5 KB/sec)
2017-06-07T12:54:12.741 [INFO] Downloading: https://repo.maven.apache.org/maven2/javax/xml/stream/stax-api/1.0-2/stax-api-1.0-2.pom
2017-06-07T12:54:12.768 [INFO] Downloaded: https://repo.maven.apache.org/maven2/javax/xml/stream/stax-api/1.0-2/stax-api-1.0-2.pom
(962 B at 34.8 KB/sec)
2017-06-07T12:54:12.771 [INFO] Downloading: https://repo.maven.apache.org/maven2/com/google/inject/extensions/guice-servlet/3.0/guice-servlet-3.0.pom
2017-06-07T12:54:12.805 [INFO] Downloaded: https://repo.maven.apache.org/maven2/com/google/inject/extensions/guice-servlet/3.0/guice-servlet-3.0.pom
(915 B at 26.3 KB/sec)
2017-06-07T12:54:12.807 [INFO] Downloading: https://repo.maven.apache.org/maven2/com/google/inject/extensions/extensions-parent/3.0/extensions-parent-3.0.pom
2017-06-07T12:54:12.835 [INFO] Downloaded: https://repo.maven.apache.org/maven2/com/google/inject/extensions/extensions-parent/3.0/extensions-parent-3.0.pom
(4 KB at 125.7 KB/sec)
2017-06-07T12:54:12.837 [INFO] Downloading: https://repo.maven.apache.org/maven2/com/google/inject/guice-parent/3.0/guice-parent-3.0.pom
2017-06-07T12:54:12.864 [INFO] Downloaded: https://repo.maven.apache.org/maven2/com/google/inject/guice-parent/3.0/guice-parent-3.0.pom
(13 KB at 469.3 KB/sec)
2017-06-07T12:54:12.866 [INFO] Downloading: https://repo.maven.apache.org/maven2/com/google/google/5/google-5.pom
2017-06-07T12:54:12.892 [INFO] Downloaded: https://repo.maven.apache.org/maven2/com/google/google/5/google-5.pom
(3 KB at 92.3 KB/sec)
2017-06-07T12:54:12.894 [INFO] Downloading: https://repo.maven.apache.org/maven2/com/google/inject/guice/3.0/guice-3.0.pom
2017-06-07T12:54:12.924 [INFO] Downloaded: https://repo.maven.apache.org/maven2/com/google/inject/guice/3.0/guice-3.0.pom
(8 KB at 237.0 KB/sec)
2017-06-07T12:54:12.926 [INFO] Downloading: https://repo.maven.apache.org/maven2/com/sun/jersey/jersey-server/1.9/jersey-server-1.9.pom
2017-06-07T12:54:12.954 [INFO] Downloaded: https://repo.maven.apache.org/maven2/com/sun/jersey/jersey-server/1.9/jersey-server-1.9.pom
(12 KB at 403.2 KB/sec)
2017-06-07T12:54:12.957 [INFO] Downloading: https://repo.maven.apache.org/maven2/asm/asm/3.1/asm-3.1.pom
2017-06-07T12:54:12.984 [INFO] Downloaded: https://repo.maven.apache.org/maven2/asm/asm/3.1/asm-3.1.pom
(278 B at 10.1 KB/sec)
2017-06-07T12:54:12.985 [INFO] Downloading: https://repo.maven.apache.org/maven2/asm/asm-parent/3.1/asm-parent-3.1.pom
2017-06-07T12:54:13.013 [INFO] Downloaded: https://repo.maven.apache.org/maven2/asm/asm-parent/3.1/asm-parent-3.1.pom
(5 KB at 150.2 KB/sec)
2017-06-07T12:54:13.015 [INFO] Downloading: https://repo.maven.apache.org/maven2/com/sun/jersey/contribs/jersey-guice/1.9/jersey-guice-1.9.pom
2017-06-07T12:54:13.042 [INFO] Downloaded: https://repo.maven.apache.org/maven2/com/sun/jersey/contribs/jersey-guice/1.9/jersey-guice-1.9.pom
(8 KB at 270.4 KB/sec)
2017-06-07T12:54:13.045 [INFO] Downloading: https://repo.maven.apache.org/maven2/jline/jline/2.11/jline-2.11.pom
2017-06-07T12:54:13.076 [INFO] Downloaded: https://repo.maven.apache.org/maven2/jline/jline/2.11/jline-2.11.pom
(17 KB at 531.3 KB/sec)
2017-06-07T12:54:13.079 [INFO] Downloading: https://repo.maven.apache.org/maven2/org/apache/ant/ant/1.9.2/ant-1.9.2.pom
2017-06-07T12:54:13.108 [INFO] Downloaded: https://repo.maven.apache.org/maven2/org/apache/ant/ant/1.9.2/ant-1.9.2.pom
(10 KB at 318.8 KB/sec)
2017-06-07T12:54:13.110 [INFO] Downloading: https://repo.maven.apache.org/maven2/org/apache/ant/ant-parent/1.9.2/ant-parent-1.9.2.pom
2017-06-07T12:54:13.138 [INFO] Downloaded: https://repo.maven.apache.org/maven2/org/apache/ant/ant-parent/1.9.2/ant-parent-1.9.2.pom
(6 KB at 195.4 KB/sec)
2017-06-07T12:54:13.141 [INFO] Downloading: https://repo.maven.apache.org/maven2/org/apache/ant/ant-launcher/1.9.2/ant-launcher-1.9.2.pom
2017-06-07T12:54:13.169 [INFO] Downloaded: https://repo.maven.apache.org/maven2/org/apache/ant/ant-launcher/1.9.2/ant-launcher-1.9.2.pom
(3 KB at 81.4 KB/sec)
2017-06-07T12:54:13.171 [INFO] Downloading: https://repo.maven.apache.org/maven2/net/engio/mbassador/1.1.9/mbassador-1.1.9.pom
2017-06-07T12:54:13.200 [INFO] Downloaded: https://repo.maven.apache.org/maven2/net/engio/mbassador/1.1.9/mbassador-1.1.9.pom
(9 KB at 281.5 KB/sec)
2017-06-07T12:54:13.202 [INFO] Downloading: https://repo.maven.apache.org/maven2/net/lingala/zip4j/zip4j/1.3.2/zip4j-1.3.2.pom
2017-06-07T12:54:13.231 [INFO] Downloaded: https://repo.maven.apache.org/maven2/net/lingala/zip4j/zip4j/1.3.2/zip4j-1.3.2.pom
(922 B at 31.0 KB/sec)
2017-06-07T12:54:13.233 [INFO] Downloading: https://repo.maven.apache.org/maven2/commons-codec/commons-codec/1.10/commons-codec-1.10.pom
2017-06-07T12:54:13.262 [INFO] Downloaded: https://repo.maven.apache.org/maven2/commons-codec/commons-codec/1.10/commons-codec-1.10.pom
(12 KB at 390.9 KB/sec)
2017-06-07T12:54:13.264 [INFO] Downloading: https://repo.maven.apache.org/maven2/org/apache/commons/commons-parent/35/commons-parent-35.pom
2017-06-07T12:54:13.299 [INFO] Downloaded: https://repo.maven.apache.org/maven2/org/apache/commons/commons-parent/35/commons-parent-35.pom
(57 KB at 1611.9 KB/sec)
2017-06-07T12:54:13.305 [INFO] Downloading: https://repo.maven.apache.org/maven2/org/apache/xbean/xbean-asm5-shaded/4.3/xbean-asm5-shaded-4.3.pom
2017-06-07T12:54:13.333 [INFO] Downloaded: https://repo.maven.apache.org/maven2/org/apache/xbean/xbean-asm5-shaded/4.3/xbean-asm5-shaded-4.3.pom
(4 KB at 116.8 KB/sec)
2017-06-07T12:54:13.334 [INFO] Downloading: https://repo.maven.apache.org/maven2/org/apache/xbean/xbean/4.3/xbean-4.3.pom
2017-06-07T12:54:13.364 [INFO] Downloaded: https://repo.maven.apache.org/maven2/org/apache/xbean/xbean/4.3/xbean-4.3.pom
(18 KB at 575.8 KB/sec)
2017-06-07T12:54:13.366 [INFO] Downloading: https://repo.maven.apache.org/maven2/org/apache/geronimo/genesis/genesis-java5-flava/2.1/genesis-java5-flava-2.1.pom
2017-06-07T12:54:13.394 [INFO] Downloaded: https://repo.maven.apache.org/maven2/org/apache/geronimo/genesis/genesis-java5-flava/2.1/genesis-java5-flava-2.1.pom
(6 KB at 191.3 KB/sec)
2017-06-07T12:54:13.396 [INFO] Downloading: https://repo.maven.apache.org/maven2/org/apache/geronimo/genesis/genesis-default-flava/2.1/genesis-default-flava-2.1.pom
2017-06-07T12:54:13.426 [INFO] Downloaded: https://repo.maven.apache.org/maven2/org/apache/geronimo/genesis/genesis-default-flava/2.1/genesis-default-flava-2.1.pom
(16 KB at 522.9 KB/sec)
2017-06-07T12:54:13.429 [INFO] Downloading: https://repo.maven.apache.org/maven2/org/apache/geronimo/genesis/genesis/2.1/genesis-2.1.pom
2017-06-07T12:54:13.459 [INFO] Downloaded: https://repo.maven.apache.org/maven2/org/apache/geronimo/genesis/genesis/2.1/genesis-2.1.pom
(14 KB at 464.1 KB/sec)
2017-06-07T12:54:13.464 [INFO] Downloading: https://repo.maven.apache.org/maven2/org/jctools/jctools-core/1.1/jctools-core-1.1.pom
2017-06-07T12:54:13.492 [INFO] Downloaded: https://repo.maven.apache.org/maven2/org/jctools/jctools-core/1.1/jctools-core-1.1.pom
(3 KB at 100.5 KB/sec)
[JENKINS] Archiving disabled
[JENKINS] Archiving disabled
[JENKINS] Archiving disabled
[JENKINS] Archiving disabled
[JENKINS] Archiving disabled
[JENKINS] Archiving disabled
[JENKINS] Archiving disabled
[JENKINS] Archiving disabled
[JENKINS] Archiving disabled
[JENKINS] Archiving disabled
[JENKINS] Archiving disabled
[JENKINS] Archiving disabled
[JENKINS] Archiving disabled
2017-06-07T12:54:17.424 [INFO] ------------------------------------------------------------------------
2017-06-07T12:54:17.424 [INFO] Reactor Summary:
2017-06-07T12:54:17.425 [INFO] 
2017-06-07T12:54:17.425 [INFO] Apache Beam :: Parent .............................. SUCCESS
[ 23.356 s]
2017-06-07T12:54:17.425 [INFO] Apache Beam :: SDKs :: Java :: Build Tools ......... SUCCESS
[  9.440 s]
2017-06-07T12:54:17.425 [INFO] Apache Beam :: SDKs ................................ SUCCESS
[  2.077 s]
2017-06-07T12:54:17.425 [INFO] Apache Beam :: SDKs :: Common ...................... SUCCESS
[  4.968 s]
2017-06-07T12:54:17.425 [INFO] Apache Beam :: SDKs :: Common :: Runner API ........ SUCCESS
[ 12.729 s]
2017-06-07T12:54:17.425 [INFO] Apache Beam :: SDKs :: Common :: Fn API ............ SUCCESS
[ 14.552 s]
2017-06-07T12:54:17.425 [INFO] Apache Beam :: SDKs :: Java ........................ SUCCESS
[  4.068 s]
2017-06-07T12:54:17.425 [INFO] Apache Beam :: SDKs :: Java :: Core ................ SUCCESS
[02:09 min]
2017-06-07T12:54:17.425 [INFO] Apache Beam :: Runners ............................. SUCCESS
[  2.938 s]
2017-06-07T12:54:17.425 [INFO] Apache Beam :: Runners :: Core Construction Java ... SUCCESS
[ 18.991 s]
2017-06-07T12:54:17.425 [INFO] Apache Beam :: Runners :: Core Java ................ SUCCESS
[ 32.328 s]
2017-06-07T12:54:17.425 [INFO] Apache Beam :: Runners :: Apex ..................... FAILURE
[  4.878 s]
2017-06-07T12:54:17.425 [INFO] ------------------------------------------------------------------------
2017-06-07T12:54:17.425 [INFO] BUILD FAILURE
2017-06-07T12:54:17.425 [INFO] ------------------------------------------------------------------------
2017-06-07T12:54:17.426 [INFO] Total time: 06:46 min
2017-06-07T12:54:17.426 [INFO] Finished at: 2017-06-07T12:54:17+00:00
2017-06-07T12:54:17.940 [INFO] Final Memory: 117M/1415M
2017-06-07T12:54:17.940 [INFO] ------------------------------------------------------------------------
2017-06-07T12:54:17.941 [WARNING] The requested profile "validates-runner-tests" could not
be activated because it does not exist.
Waiting for Jenkins to finish collecting data
2017-06-07T12:54:19.243 [ERROR] Failed to execute goal on project beam-runners-apex: Could
not resolve dependencies for project org.apache.beam:beam-runners-apex:jar:2.1.0-SNAPSHOT:
Failed to collect dependencies at org.apache.apex:apex-common:jar:3.6.0: Failed to read artifact
descriptor for org.apache.apex:apex-common:jar:3.6.0: Could not transfer artifact org.apache.apex:apex-common:pom:3.6.0
from/to central (https://repo.maven.apache.org/maven2): Connection reset -> [Help 1]
2017-06-07T12:54:19.243 [ERROR] 
2017-06-07T12:54:19.243 [ERROR] To see the full stack trace of the errors, re-run Maven with
the -e switch.
2017-06-07T12:54:19.243 [ERROR] Re-run Maven using the -X switch to enable full debug logging.
2017-06-07T12:54:19.243 [ERROR] 
2017-06-07T12:54:19.243 [ERROR] For more information about the errors and possible solutions,
please read the following articles:
2017-06-07T12:54:19.243 [ERROR] [Help 1] http://cwiki.apache.org/confluence/display/MAVEN/DependencyResolutionException
2017-06-07T12:54:19.243 [ERROR] 
2017-06-07T12:54:19.243 [ERROR] After correcting the problems, you can resume the build with
the command
2017-06-07T12:54:19.243 [ERROR]   mvn <goals> -rf :beam-runners-apex
channel stopped

Mime
View raw message