beam-commits mailing list archives

Site index · List index
Message view « Date » · « Thread »
Top « Date » · « Thread »
From Apache Jenkins Server <jenk...@builds.apache.org>
Subject Build failed in Jenkins: beam_PostCommit_Java_JDK_Versions_Test » JDK 1.7 (latest),beam #101
Date Sun, 18 Jun 2017 18:34:41 GMT
See <https://builds.apache.org/job/beam_PostCommit_Java_JDK_Versions_Test/jdk=JDK%201.7%20(latest),label=beam/101/display/redirect>

------------------------------------------
[...truncated 1.59 MB...]
  [javadoc]     OutputT extends Object declared in class Factory
  [javadoc] <https://builds.apache.org/job/beam_PostCommit_Java_JDK_Versions_Test/jdk=JDK%201.7%20(latest),label=beam/ws/sdks/java/javadoc/target/collected/org/apache/beam/runners/core/BeamFnDataReadRunner.java>:87:
error: cannot find symbol
  [javadoc]         Consumer<ThrowingRunnable> addStartFunction,
  [javadoc]         ^
  [javadoc]   symbol:   class Consumer
  [javadoc]   location: class Factory<OutputT>
  [javadoc]   where OutputT is a type-variable:
  [javadoc]     OutputT extends Object declared in class Factory
  [javadoc] <https://builds.apache.org/job/beam_PostCommit_Java_JDK_Versions_Test/jdk=JDK%201.7%20(latest),label=beam/ws/sdks/java/javadoc/target/collected/org/apache/beam/runners/core/BeamFnDataReadRunner.java>:88:
error: cannot find symbol
  [javadoc]         Consumer<ThrowingRunnable> addFinishFunction) throws IOException
{
  [javadoc]         ^
  [javadoc]   symbol:   class Consumer
  [javadoc]   location: class Factory<OutputT>
  [javadoc]   where OutputT is a type-variable:
  [javadoc]     OutputT extends Object declared in class Factory
  [javadoc] <https://builds.apache.org/job/beam_PostCommit_Java_JDK_Versions_Test/jdk=JDK%201.7%20(latest),label=beam/ws/sdks/java/javadoc/target/collected/org/apache/beam/runners/core/DoFnRunner.java>:51:
warning - Tag @link: reference not found: DoFn.FinishBundle @FinishBundle
  [javadoc] <https://builds.apache.org/job/beam_PostCommit_Java_JDK_Versions_Test/jdk=JDK%201.7%20(latest),label=beam/ws/sdks/java/javadoc/target/collected/org/apache/beam/runners/core/DoFnRunner.java>:45:
warning - Tag @link: reference not found: DoFn.OnTimer @OnTimer
  [javadoc] <https://builds.apache.org/job/beam_PostCommit_Java_JDK_Versions_Test/jdk=JDK%201.7%20(latest),label=beam/ws/sdks/java/javadoc/target/collected/org/apache/beam/runners/core/DoFnRunner.java>:39:
warning - Tag @link: reference not found: DoFn.ProcessElement @ProcessElement
  [javadoc] <https://builds.apache.org/job/beam_PostCommit_Java_JDK_Versions_Test/jdk=JDK%201.7%20(latest),label=beam/ws/sdks/java/javadoc/target/collected/org/apache/beam/runners/core/DoFnRunner.java>:39:
warning - Tag @link: reference not found: DoFn.ProcessContext
  [javadoc] <https://builds.apache.org/job/beam_PostCommit_Java_JDK_Versions_Test/jdk=JDK%201.7%20(latest),label=beam/ws/sdks/java/javadoc/target/collected/org/apache/beam/runners/core/DoFnRunner.java>:33:
warning - Tag @link: reference not found: DoFn.StartBundle @StartBundle
  [javadoc] <https://builds.apache.org/job/beam_PostCommit_Java_JDK_Versions_Test/jdk=JDK%201.7%20(latest),label=beam/ws/sdks/java/javadoc/target/collected/org/apache/beam/runners/core/DoFnRunner.java>:33:
warning - Tag @link: reference not found: DoFn.StartBundle @StartBundle
  [javadoc] <https://builds.apache.org/job/beam_PostCommit_Java_JDK_Versions_Test/jdk=JDK%201.7%20(latest),label=beam/ws/sdks/java/javadoc/target/collected/org/apache/beam/runners/core/DoFnRunner.java>:39:
warning - Tag @link: reference not found: DoFn.ProcessElement @ProcessElement
  [javadoc] <https://builds.apache.org/job/beam_PostCommit_Java_JDK_Versions_Test/jdk=JDK%201.7%20(latest),label=beam/ws/sdks/java/javadoc/target/collected/org/apache/beam/runners/core/DoFnRunner.java>:39:
warning - Tag @link: reference not found: DoFn.ProcessContext
  [javadoc] <https://builds.apache.org/job/beam_PostCommit_Java_JDK_Versions_Test/jdk=JDK%201.7%20(latest),label=beam/ws/sdks/java/javadoc/target/collected/org/apache/beam/runners/core/DoFnRunner.java>:45:
warning - Tag @link: reference not found: DoFn.OnTimer @OnTimer
  [javadoc] <https://builds.apache.org/job/beam_PostCommit_Java_JDK_Versions_Test/jdk=JDK%201.7%20(latest),label=beam/ws/sdks/java/javadoc/target/collected/org/apache/beam/runners/core/DoFnRunner.java>:51:
warning - Tag @link: reference not found: DoFn.FinishBundle @FinishBundle
  [javadoc] <https://builds.apache.org/job/beam_PostCommit_Java_JDK_Versions_Test/jdk=JDK%201.7%20(latest),label=beam/ws/sdks/java/javadoc/target/collected/org/apache/beam/runners/flink/metrics/ReaderInvocationUtil.java>:34:
warning - Tag @link: reference not found: Source.Reader
  [javadoc] <https://builds.apache.org/job/beam_PostCommit_Java_JDK_Versions_Test/jdk=JDK%201.7%20(latest),label=beam/ws/sdks/java/javadoc/target/collected/org/apache/beam/runners/spark/io/SourceRDD.java>:292:
warning - Tag @link: reference not found: UnboundedSource.CheckpointMark
  [javadoc] <https://builds.apache.org/job/beam_PostCommit_Java_JDK_Versions_Test/jdk=JDK%201.7%20(latest),label=beam/ws/sdks/java/javadoc/target/collected/org/apache/beam/runners/spark/stateful/StateSpecFunctions.java>:101:
warning - Tag @link: reference not found: UnboundedSource.CheckpointMark
  [javadoc] <https://builds.apache.org/job/beam_PostCommit_Java_JDK_Versions_Test/jdk=JDK%201.7%20(latest),label=beam/ws/sdks/java/javadoc/target/collected/org/apache/beam/runners/spark/stateful/StateSpecFunctions.java>:101:
warning - Tag @link: reference not found: UnboundedSource.CheckpointMark
  [javadoc] <https://builds.apache.org/job/beam_PostCommit_Java_JDK_Versions_Test/jdk=JDK%201.7%20(latest),label=beam/ws/sdks/java/javadoc/target/collected/org/apache/beam/sdk/extensions/protobuf/ByteStringCoder.java>:37:
warning - Tag @link: reference not found: Coder.Context
  [javadoc] <https://builds.apache.org/job/beam_PostCommit_Java_JDK_Versions_Test/jdk=JDK%201.7%20(latest),label=beam/ws/sdks/java/javadoc/target/collected/org/apache/beam/sdk/extensions/protobuf/ByteStringCoder.java>:106:
warning - Tag @link: reference not found: Coder.Context
  [javadoc] <https://builds.apache.org/job/beam_PostCommit_Java_JDK_Versions_Test/jdk=JDK%201.7%20(latest),label=beam/ws/sdks/java/javadoc/target/collected/org/apache/beam/sdk/io/AvroIO.java>:319:
warning - Tag @link: can't find withFilenamePolicy(FilenamePolicy) in org.apache.beam.sdk.io.AvroIO.Write
  [javadoc] <https://builds.apache.org/job/beam_PostCommit_Java_JDK_Versions_Test/jdk=JDK%201.7%20(latest),label=beam/ws/sdks/java/javadoc/target/collected/org/apache/beam/sdk/io/AvroIO.java>:303:
warning - Tag @link: can't find withFilenamePolicy(FilenamePolicy) in org.apache.beam.sdk.io.AvroIO.Write
  [javadoc] <https://builds.apache.org/job/beam_PostCommit_Java_JDK_Versions_Test/jdk=JDK%201.7%20(latest),label=beam/ws/sdks/java/javadoc/target/collected/org/apache/beam/sdk/io/AvroIO.java>:358:
warning - Tag @link: can't find withFilenamePolicy(FilenamePolicy) in org.apache.beam.sdk.io.AvroIO.Write
  [javadoc] <https://builds.apache.org/job/beam_PostCommit_Java_JDK_Versions_Test/jdk=JDK%201.7%20(latest),label=beam/ws/sdks/java/javadoc/target/collected/org/apache/beam/sdk/io/AvroIO.java>:369:
warning - Tag @link: can't find withFilenamePolicy(FilenamePolicy) in org.apache.beam.sdk.io.AvroIO.Write
  [javadoc] <https://builds.apache.org/job/beam_PostCommit_Java_JDK_Versions_Test/jdk=JDK%201.7%20(latest),label=beam/ws/sdks/java/javadoc/target/collected/org/apache/beam/sdk/io/CompressedSource.java>:534:
warning - Tag @link: reference not found: FileBasedReader#startReading(ReadableByteChannel)
  [javadoc] <https://builds.apache.org/job/beam_PostCommit_Java_JDK_Versions_Test/jdk=JDK%201.7%20(latest),label=beam/ws/sdks/java/javadoc/target/collected/org/apache/beam/sdk/io/CompressedSource.java>:534:
warning - Tag @link: reference not found: FileBasedReader#startReading(ReadableByteChannel)
  [javadoc] <https://builds.apache.org/job/beam_PostCommit_Java_JDK_Versions_Test/jdk=JDK%201.7%20(latest),label=beam/ws/sdks/java/javadoc/target/collected/org/apache/beam/sdk/io/FileBasedSource.java>:184:
warning - Tag @link: can't find FileBasedSource(Metadata, long, long, long) in org.apache.beam.sdk.io.FileBasedSource
  [javadoc] <https://builds.apache.org/job/beam_PostCommit_Java_JDK_Versions_Test/jdk=JDK%201.7%20(latest),label=beam/ws/sdks/java/javadoc/target/collected/org/apache/beam/sdk/io/OffsetBasedSource.java>:295:
warning - Tag @link: reference not found: BoundedReader#start
  [javadoc] <https://builds.apache.org/job/beam_PostCommit_Java_JDK_Versions_Test/jdk=JDK%201.7%20(latest),label=beam/ws/sdks/java/javadoc/target/collected/org/apache/beam/sdk/io/OffsetBasedSource.java>:295:
warning - Tag @see: reference not found: BoundedReader#start
  [javadoc] <https://builds.apache.org/job/beam_PostCommit_Java_JDK_Versions_Test/jdk=JDK%201.7%20(latest),label=beam/ws/sdks/java/javadoc/target/collected/org/apache/beam/sdk/io/OffsetBasedSource.java>:309:
warning - Tag @link: reference not found: BoundedReader#advance
  [javadoc] <https://builds.apache.org/job/beam_PostCommit_Java_JDK_Versions_Test/jdk=JDK%201.7%20(latest),label=beam/ws/sdks/java/javadoc/target/collected/org/apache/beam/sdk/io/OffsetBasedSource.java>:309:
warning - Tag @see: reference not found: BoundedReader#advance
  [javadoc] <https://builds.apache.org/job/beam_PostCommit_Java_JDK_Versions_Test/jdk=JDK%201.7%20(latest),label=beam/ws/sdks/java/javadoc/target/collected/org/apache/beam/sdk/io/FileSystem.java>:80:
warning - Tag @link: reference not found: ResourceIdT
  [javadoc] <https://builds.apache.org/job/beam_PostCommit_Java_JDK_Versions_Test/jdk=JDK%201.7%20(latest),label=beam/ws/sdks/java/javadoc/target/collected/org/apache/beam/sdk/io/FileSystem.java>:70:
warning - Tag @link: reference not found: ResourceIdT ResourceIds
  [javadoc] <https://builds.apache.org/job/beam_PostCommit_Java_JDK_Versions_Test/jdk=JDK%201.7%20(latest),label=beam/ws/sdks/java/javadoc/target/collected/org/apache/beam/sdk/io/FileSystem.java>:93:
warning - Tag @link: reference not found: ResourceIdT
  [javadoc] <https://builds.apache.org/job/beam_PostCommit_Java_JDK_Versions_Test/jdk=JDK%201.7%20(latest),label=beam/ws/sdks/java/javadoc/target/collected/org/apache/beam/sdk/io/FileSystem.java>:70:
warning - Tag @link: reference not found: ResourceIdT ResourceIds
  [javadoc] <https://builds.apache.org/job/beam_PostCommit_Java_JDK_Versions_Test/jdk=JDK%201.7%20(latest),label=beam/ws/sdks/java/javadoc/target/collected/org/apache/beam/sdk/io/FileSystem.java>:70:
warning - Tag @link: reference not found: ResourceIdT
  [javadoc] <https://builds.apache.org/job/beam_PostCommit_Java_JDK_Versions_Test/jdk=JDK%201.7%20(latest),label=beam/ws/sdks/java/javadoc/target/collected/org/apache/beam/sdk/io/FileSystem.java>:70:
warning - Tag @link: reference not found: ResourceIdT
  [javadoc] <https://builds.apache.org/job/beam_PostCommit_Java_JDK_Versions_Test/jdk=JDK%201.7%20(latest),label=beam/ws/sdks/java/javadoc/target/collected/org/apache/beam/sdk/io/FileSystem.java>:80:
warning - Tag @link: reference not found: ResourceIdT
  [javadoc] <https://builds.apache.org/job/beam_PostCommit_Java_JDK_Versions_Test/jdk=JDK%201.7%20(latest),label=beam/ws/sdks/java/javadoc/target/collected/org/apache/beam/sdk/io/FileSystem.java>:93:
warning - Tag @link: reference not found: ResourceIdT
  [javadoc] <https://builds.apache.org/job/beam_PostCommit_Java_JDK_Versions_Test/jdk=JDK%201.7%20(latest),label=beam/ws/sdks/java/javadoc/target/collected/org/apache/beam/sdk/io/OffsetBasedSource.java>:295:
warning - Tag @link: reference not found: BoundedReader#start
  [javadoc] <https://builds.apache.org/job/beam_PostCommit_Java_JDK_Versions_Test/jdk=JDK%201.7%20(latest),label=beam/ws/sdks/java/javadoc/target/collected/org/apache/beam/sdk/io/OffsetBasedSource.java>:295:
warning - Tag @see: reference not found: BoundedReader#start
  [javadoc] <https://builds.apache.org/job/beam_PostCommit_Java_JDK_Versions_Test/jdk=JDK%201.7%20(latest),label=beam/ws/sdks/java/javadoc/target/collected/org/apache/beam/sdk/io/OffsetBasedSource.java>:309:
warning - Tag @link: reference not found: BoundedReader#advance
  [javadoc] <https://builds.apache.org/job/beam_PostCommit_Java_JDK_Versions_Test/jdk=JDK%201.7%20(latest),label=beam/ws/sdks/java/javadoc/target/collected/org/apache/beam/sdk/io/OffsetBasedSource.java>:309:
warning - Tag @see: reference not found: BoundedReader#advance
  [javadoc] <https://builds.apache.org/job/beam_PostCommit_Java_JDK_Versions_Test/jdk=JDK%201.7%20(latest),label=beam/ws/sdks/java/javadoc/target/collected/org/apache/beam/sdk/io/TextIO.java>:314:
warning - Tag @link: can't find withFilenamePolicy(FilenamePolicy) in org.apache.beam.sdk.io.TextIO.Write
  [javadoc] <https://builds.apache.org/job/beam_PostCommit_Java_JDK_Versions_Test/jdk=JDK%201.7%20(latest),label=beam/ws/sdks/java/javadoc/target/collected/org/apache/beam/sdk/io/TextIO.java>:295:
warning - Tag @link: can't find withFilenamePolicy(FilenamePolicy) in org.apache.beam.sdk.io.TextIO.Write
  [javadoc] <https://builds.apache.org/job/beam_PostCommit_Java_JDK_Versions_Test/jdk=JDK%201.7%20(latest),label=beam/ws/sdks/java/javadoc/target/collected/org/apache/beam/sdk/io/TextIO.java>:346:
warning - Tag @link: can't find withFilenamePolicy(FilenamePolicy) in org.apache.beam.sdk.io.TextIO.Write
  [javadoc] <https://builds.apache.org/job/beam_PostCommit_Java_JDK_Versions_Test/jdk=JDK%201.7%20(latest),label=beam/ws/sdks/java/javadoc/target/collected/org/apache/beam/sdk/io/TextIO.java>:357:
warning - Tag @link: can't find withFilenamePolicy(FilenamePolicy) in org.apache.beam.sdk.io.TextIO.Write
  [javadoc] <https://builds.apache.org/job/beam_PostCommit_Java_JDK_Versions_Test/jdk=JDK%201.7%20(latest),label=beam/ws/sdks/java/javadoc/target/collected/org/apache/beam/sdk/io/cassandra/CassandraServiceImpl.java>:376:
warning - Tag @link: reference not found: Mapper
  [javadoc] <https://builds.apache.org/job/beam_PostCommit_Java_JDK_Versions_Test/jdk=JDK%201.7%20(latest),label=beam/ws/sdks/java/javadoc/target/collected/org/apache/beam/sdk/io/cassandra/CassandraServiceImpl.java>:376:
warning - Tag @link: reference not found: MappingManager
  [javadoc] <https://builds.apache.org/job/beam_PostCommit_Java_JDK_Versions_Test/jdk=JDK%201.7%20(latest),label=beam/ws/sdks/java/javadoc/target/collected/org/apache/beam/sdk/io/cassandra/CassandraServiceImpl.java>:376:
warning - Tag @link: reference not found: Mapper
  [javadoc] <https://builds.apache.org/job/beam_PostCommit_Java_JDK_Versions_Test/jdk=JDK%201.7%20(latest),label=beam/ws/sdks/java/javadoc/target/collected/org/apache/beam/sdk/io/cassandra/CassandraServiceImpl.java>:376:
warning - Tag @link: reference not found: MappingManager
  [javadoc] <https://builds.apache.org/job/beam_PostCommit_Java_JDK_Versions_Test/jdk=JDK%201.7%20(latest),label=beam/ws/sdks/java/javadoc/target/collected/org/apache/beam/sdk/io/cassandra/CassandraServiceImpl.java>:376:
warning - Tag @link: reference not found: Mapper#save(Object)
  [javadoc] <https://builds.apache.org/job/beam_PostCommit_Java_JDK_Versions_Test/jdk=JDK%201.7%20(latest),label=beam/ws/sdks/java/javadoc/target/collected/org/apache/beam/sdk/io/gcp/bigquery/DynamicDestinations.java>:136:
warning - Tag @link: reference not found: DestinationT
  [javadoc] <https://builds.apache.org/job/beam_PostCommit_Java_JDK_Versions_Test/jdk=JDK%201.7%20(latest),label=beam/ws/sdks/java/javadoc/target/collected/org/apache/beam/sdk/io/gcp/bigquery/DynamicDestinations.java>:136:
warning - Tag @link: reference not found: DestinationT
  [javadoc] <https://builds.apache.org/job/beam_PostCommit_Java_JDK_Versions_Test/jdk=JDK%201.7%20(latest),label=beam/ws/sdks/java/javadoc/target/collected/org/apache/beam/sdk/io/gcp/bigquery/DynamicDestinations.java>:136:
warning - Tag @link: reference not found: DestinationT
  [javadoc] <https://builds.apache.org/job/beam_PostCommit_Java_JDK_Versions_Test/jdk=JDK%201.7%20(latest),label=beam/ws/sdks/java/javadoc/target/collected/org/apache/beam/sdk/io/gcp/datastore/DatastoreV1.java>:472:
warning - Tag @link: reference not found: Query.Builder#setLimit
  [javadoc] <https://builds.apache.org/job/beam_PostCommit_Java_JDK_Versions_Test/jdk=JDK%201.7%20(latest),label=beam/ws/sdks/java/javadoc/target/collected/org/apache/beam/sdk/io/gcp/pubsub/PubsubUnboundedSource.java>:110:
warning - Tag @link: reference not found: UnboundedSource.UnboundedReader
  [javadoc] <https://builds.apache.org/job/beam_PostCommit_Java_JDK_Versions_Test/jdk=JDK%201.7%20(latest),label=beam/ws/sdks/java/javadoc/target/collected/org/apache/beam/sdk/io/kafka/KafkaIO.java>:239:
warning - Tag @link: reference not found: org.apache.kafka.common.serialization
  [javadoc] <https://builds.apache.org/job/beam_PostCommit_Java_JDK_Versions_Test/jdk=JDK%201.7%20(latest),label=beam/ws/sdks/java/javadoc/target/collected/org/apache/beam/sdk/io/kafka/KafkaIO.java>:239:
warning - Tag @link: reference not found: UnboundedKafkaSource#split(int, PipelineOptions)
  [javadoc] <https://builds.apache.org/job/beam_PostCommit_Java_JDK_Versions_Test/jdk=JDK%201.7%20(latest),label=beam/ws/sdks/java/javadoc/target/collected/org/apache/beam/sdk/io/kafka/KafkaIO.java>:350:
warning - Tag @link: reference not found: UnboundedKafkaSource#split(int, PipelineOptions)
  [javadoc] <https://builds.apache.org/job/beam_PostCommit_Java_JDK_Versions_Test/jdk=JDK%201.7%20(latest),label=beam/ws/sdks/java/javadoc/target/collected/org/apache/beam/sdk/io/kafka/KafkaIO.java>:361:
warning - Tag @link: reference not found: UnboundedKafkaSource#split(int, PipelineOptions)
  [javadoc] <https://builds.apache.org/job/beam_PostCommit_Java_JDK_Versions_Test/jdk=JDK%201.7%20(latest),label=beam/ws/sdks/java/javadoc/target/collected/org/apache/beam/sdk/io/kafka/KafkaIO.java>:374:
warning - Tag @link: reference not found: UnboundedKafkaSource#split(int, PipelineOptions)
  [javadoc] <https://builds.apache.org/job/beam_PostCommit_Java_JDK_Versions_Test/jdk=JDK%201.7%20(latest),label=beam/ws/sdks/java/javadoc/target/collected/org/apache/beam/sdk/options/PipelineOptions.java>:199:
warning - Tag @link: reference not found: DoFn.ProcessContext Context
  [javadoc] <https://builds.apache.org/job/beam_PostCommit_Java_JDK_Versions_Test/jdk=JDK%201.7%20(latest),label=beam/ws/sdks/java/javadoc/target/collected/org/apache/beam/sdk/state/StateSpecs.java>:73:
warning - Tag @see: can't find combining(Coder, CombineFn) in org.apache.beam.sdk.state.StateSpecs
  [javadoc] <https://builds.apache.org/job/beam_PostCommit_Java_JDK_Versions_Test/jdk=JDK%201.7%20(latest),label=beam/ws/sdks/java/javadoc/target/collected/org/apache/beam/sdk/state/StateSpecs.java>:91:
warning - Tag @see: can't find combining(Coder, CombineFnWithContext) in org.apache.beam.sdk.state.StateSpecs
  [javadoc] <https://builds.apache.org/job/beam_PostCommit_Java_JDK_Versions_Test/jdk=JDK%201.7%20(latest),label=beam/ws/sdks/java/javadoc/target/collected/org/apache/beam/sdk/state/StateSpecs.java>:102:
warning - Tag @link: can't find combining(CombineFn) in org.apache.beam.sdk.state.StateSpecs
  [javadoc] <https://builds.apache.org/job/beam_PostCommit_Java_JDK_Versions_Test/jdk=JDK%201.7%20(latest),label=beam/ws/sdks/java/javadoc/target/collected/org/apache/beam/sdk/state/StateSpecs.java>:120:
warning - Tag @link: can't find combining(CombineFnWithContext) in org.apache.beam.sdk.state.StateSpecs
  [javadoc] <https://builds.apache.org/job/beam_PostCommit_Java_JDK_Versions_Test/jdk=JDK%201.7%20(latest),label=beam/ws/sdks/java/javadoc/target/collected/org/apache/beam/sdk/state/Timer.java>:45:
warning - Tag @link: reference not found: DoFn.TimerId
  [javadoc] <https://builds.apache.org/job/beam_PostCommit_Java_JDK_Versions_Test/jdk=JDK%201.7%20(latest),label=beam/ws/sdks/java/javadoc/target/collected/org/apache/beam/sdk/testing/SourceTestUtils.java>:80:
warning - Tag @link: reference not found: BoundedSource.BoundedReader#splitAtFraction
  [javadoc] <https://builds.apache.org/job/beam_PostCommit_Java_JDK_Versions_Test/jdk=JDK%201.7%20(latest),label=beam/ws/sdks/java/javadoc/target/collected/org/apache/beam/sdk/testing/SourceTestUtils.java>:552:
warning - Tag @link: reference not found: BoundedSource.BoundedReader#splitAtFraction
  [javadoc] <https://builds.apache.org/job/beam_PostCommit_Java_JDK_Versions_Test/jdk=JDK%201.7%20(latest),label=beam/ws/sdks/java/javadoc/target/collected/org/apache/beam/sdk/testing/SourceTestUtils.java>:450:
warning - Tag @link: reference not found: BoundedSource.BoundedReader#splitAtFraction
  [javadoc] <https://builds.apache.org/job/beam_PostCommit_Java_JDK_Versions_Test/jdk=JDK%201.7%20(latest),label=beam/ws/sdks/java/javadoc/target/collected/org/apache/beam/sdk/testing/SourceTestUtils.java>:152:
warning - Tag @link: reference not found: Source.Reader
  [javadoc] <https://builds.apache.org/job/beam_PostCommit_Java_JDK_Versions_Test/jdk=JDK%201.7%20(latest),label=beam/ws/sdks/java/javadoc/target/collected/org/apache/beam/sdk/testing/SourceTestUtils.java>:145:
warning - Tag @link: reference not found: Source.Reader
  [javadoc] <https://builds.apache.org/job/beam_PostCommit_Java_JDK_Versions_Test/jdk=JDK%201.7%20(latest),label=beam/ws/sdks/java/javadoc/target/collected/org/apache/beam/sdk/testing/SourceTestUtils.java>:168:
warning - Tag @link: reference not found: Source.Reader
  [javadoc] <https://builds.apache.org/job/beam_PostCommit_Java_JDK_Versions_Test/jdk=JDK%201.7%20(latest),label=beam/ws/sdks/java/javadoc/target/collected/org/apache/beam/sdk/testing/SourceTestUtils.java>:168:
warning - Tag @link: reference not found: Source.Reader#start
  [javadoc] <https://builds.apache.org/job/beam_PostCommit_Java_JDK_Versions_Test/jdk=JDK%201.7%20(latest),label=beam/ws/sdks/java/javadoc/target/collected/org/apache/beam/sdk/testing/SourceTestUtils.java>:159:
warning - Tag @link: reference not found: Source.Reader
  [javadoc] <https://builds.apache.org/job/beam_PostCommit_Java_JDK_Versions_Test/jdk=JDK%201.7%20(latest),label=beam/ws/sdks/java/javadoc/target/collected/org/apache/beam/sdk/testing/SourceTestUtils.java>:200:
warning - Tag @link: reference not found: Source.Reader
  [javadoc] <https://builds.apache.org/job/beam_PostCommit_Java_JDK_Versions_Test/jdk=JDK%201.7%20(latest),label=beam/ws/sdks/java/javadoc/target/collected/org/apache/beam/sdk/testing/SourceTestUtils.java>:145:
warning - Tag @link: reference not found: Source.Reader
  [javadoc] <https://builds.apache.org/job/beam_PostCommit_Java_JDK_Versions_Test/jdk=JDK%201.7%20(latest),label=beam/ws/sdks/java/javadoc/target/collected/org/apache/beam/sdk/testing/SourceTestUtils.java>:152:
warning - Tag @link: reference not found: Source.Reader
  [javadoc] <https://builds.apache.org/job/beam_PostCommit_Java_JDK_Versions_Test/jdk=JDK%201.7%20(latest),label=beam/ws/sdks/java/javadoc/target/collected/org/apache/beam/sdk/testing/SourceTestUtils.java>:159:
warning - Tag @link: reference not found: Source.Reader
  [javadoc] <https://builds.apache.org/job/beam_PostCommit_Java_JDK_Versions_Test/jdk=JDK%201.7%20(latest),label=beam/ws/sdks/java/javadoc/target/collected/org/apache/beam/sdk/testing/SourceTestUtils.java>:168:
warning - Tag @link: reference not found: Source.Reader
  [javadoc] <https://builds.apache.org/job/beam_PostCommit_Java_JDK_Versions_Test/jdk=JDK%201.7%20(latest),label=beam/ws/sdks/java/javadoc/target/collected/org/apache/beam/sdk/testing/SourceTestUtils.java>:168:
warning - Tag @link: reference not found: Source.Reader#start
  [javadoc] <https://builds.apache.org/job/beam_PostCommit_Java_JDK_Versions_Test/jdk=JDK%201.7%20(latest),label=beam/ws/sdks/java/javadoc/target/collected/org/apache/beam/sdk/testing/SourceTestUtils.java>:200:
warning - Tag @link: reference not found: Source.Reader
  [javadoc] <https://builds.apache.org/job/beam_PostCommit_Java_JDK_Versions_Test/jdk=JDK%201.7%20(latest),label=beam/ws/sdks/java/javadoc/target/collected/org/apache/beam/sdk/testing/SourceTestUtils.java>:450:
warning - Tag @link: reference not found: BoundedSource.BoundedReader#splitAtFraction
  [javadoc] <https://builds.apache.org/job/beam_PostCommit_Java_JDK_Versions_Test/jdk=JDK%201.7%20(latest),label=beam/ws/sdks/java/javadoc/target/collected/org/apache/beam/sdk/testing/SourceTestUtils.java>:552:
warning - Tag @link: reference not found: BoundedSource.BoundedReader#splitAtFraction
  [javadoc] <https://builds.apache.org/job/beam_PostCommit_Java_JDK_Versions_Test/jdk=JDK%201.7%20(latest),label=beam/ws/sdks/java/javadoc/target/collected/org/apache/beam/sdk/transforms/PTransform.java>:208:
warning - Tag @link: reference not found: InputT
  [javadoc] <https://builds.apache.org/job/beam_PostCommit_Java_JDK_Versions_Test/jdk=JDK%201.7%20(latest),label=beam/ws/sdks/java/javadoc/target/collected/org/apache/beam/sdk/transforms/PTransform.java>:208:
warning - Tag @link: reference not found: InputT
  [javadoc] <https://builds.apache.org/job/beam_PostCommit_Java_JDK_Versions_Test/jdk=JDK%201.7%20(latest),label=beam/ws/sdks/java/javadoc/target/collected/org/apache/beam/sdk/transforms/splittabledofn/RestrictionTracker.java>:47:
warning - Tag @link: reference not found: DoFn.ProcessElement
  [javadoc] <https://builds.apache.org/job/beam_PostCommit_Java_JDK_Versions_Test/jdk=JDK%201.7%20(latest),label=beam/ws/sdks/java/javadoc/target/collected/org/apache/beam/sdk/transforms/splittabledofn/RestrictionTracker.java>:39:
warning - Tag @link: reference not found: DoFn.ProcessElement
  [javadoc] <https://builds.apache.org/job/beam_PostCommit_Java_JDK_Versions_Test/jdk=JDK%201.7%20(latest),label=beam/ws/sdks/java/javadoc/target/collected/org/apache/beam/sdk/transforms/splittabledofn/RestrictionTracker.java>:31:
warning - Tag @link: reference not found: DoFn.ProcessElement
  [javadoc] <https://builds.apache.org/job/beam_PostCommit_Java_JDK_Versions_Test/jdk=JDK%201.7%20(latest),label=beam/ws/sdks/java/javadoc/target/collected/org/apache/beam/sdk/transforms/splittabledofn/RestrictionTracker.java>:31:
warning - Tag @link: reference not found: DoFn.ProcessElement
  [javadoc] <https://builds.apache.org/job/beam_PostCommit_Java_JDK_Versions_Test/jdk=JDK%201.7%20(latest),label=beam/ws/sdks/java/javadoc/target/collected/org/apache/beam/sdk/transforms/splittabledofn/RestrictionTracker.java>:39:
warning - Tag @link: reference not found: DoFn.ProcessElement
  [javadoc] <https://builds.apache.org/job/beam_PostCommit_Java_JDK_Versions_Test/jdk=JDK%201.7%20(latest),label=beam/ws/sdks/java/javadoc/target/collected/org/apache/beam/sdk/transforms/splittabledofn/RestrictionTracker.java>:47:
warning - Tag @link: reference not found: DoFn.ProcessElement
  [javadoc] <https://builds.apache.org/job/beam_PostCommit_Java_JDK_Versions_Test/jdk=JDK%201.7%20(latest),label=beam/ws/sdks/java/javadoc/target/collected/org/apache/beam/sdk/transforms/splittabledofn/RestrictionTracker.java>:47:
warning - Tag @link: reference not found: DoFn.ProcessElement
  [javadoc] <https://builds.apache.org/job/beam_PostCommit_Java_JDK_Versions_Test/jdk=JDK%201.7%20(latest),label=beam/ws/sdks/java/javadoc/target/collected/org/apache/beam/sdk/transforms/splittabledofn/RestrictionTracker.java>:39:
warning - Tag @link: reference not found: DoFn.ProcessElement
  [javadoc] <https://builds.apache.org/job/beam_PostCommit_Java_JDK_Versions_Test/jdk=JDK%201.7%20(latest),label=beam/ws/sdks/java/javadoc/target/collected/org/apache/beam/sdk/transforms/splittabledofn/RestrictionTracker.java>:31:
warning - Tag @link: reference not found: DoFn.ProcessElement
  [javadoc] <https://builds.apache.org/job/beam_PostCommit_Java_JDK_Versions_Test/jdk=JDK%201.7%20(latest),label=beam/ws/sdks/java/javadoc/target/collected/org/apache/beam/sdk/transforms/splittabledofn/RestrictionTracker.java>:31:
warning - Tag @link: reference not found: DoFn.ProcessElement
  [javadoc] <https://builds.apache.org/job/beam_PostCommit_Java_JDK_Versions_Test/jdk=JDK%201.7%20(latest),label=beam/ws/sdks/java/javadoc/target/collected/org/apache/beam/sdk/transforms/splittabledofn/RestrictionTracker.java>:39:
warning - Tag @link: reference not found: DoFn.ProcessElement
  [javadoc] <https://builds.apache.org/job/beam_PostCommit_Java_JDK_Versions_Test/jdk=JDK%201.7%20(latest),label=beam/ws/sdks/java/javadoc/target/collected/org/apache/beam/sdk/transforms/splittabledofn/RestrictionTracker.java>:47:
warning - Tag @link: reference not found: DoFn.ProcessElement
  [javadoc] <https://builds.apache.org/job/beam_PostCommit_Java_JDK_Versions_Test/jdk=JDK%201.7%20(latest),label=beam/ws/sdks/java/javadoc/target/collected/org/apache/beam/sdk/transforms/windowing/PaneInfo.java>:44:
warning - Tag @link: reference not found: DoFn.ProcessContext#pane
  [javadoc] <https://builds.apache.org/job/beam_PostCommit_Java_JDK_Versions_Test/jdk=JDK%201.7%20(latest),label=beam/ws/sdks/java/javadoc/target/collected/org/apache/beam/sdk/transforms/windowing/PaneInfo.java>:44:
warning - Tag @link: reference not found: DoFn.ProcessElement
  [javadoc] <https://builds.apache.org/job/beam_PostCommit_Java_JDK_Versions_Test/jdk=JDK%201.7%20(latest),label=beam/ws/sdks/java/javadoc/target/collected/org/apache/beam/runners/dataflow/PrimitiveParDoSingleFactory.java>:40:
warning - Tag @link: reference not found: ParDo.SingleOutput
  [javadoc] <https://builds.apache.org/job/beam_PostCommit_Java_JDK_Versions_Test/jdk=JDK%201.7%20(latest),label=beam/ws/sdks/java/javadoc/target/collected/org/apache/beam/runners/direct/package-info.java>:25:
warning - Tag @link: reference not found: org.apache.beam.sdk.runners
  [javadoc] <https://builds.apache.org/job/beam_PostCommit_Java_JDK_Versions_Test/jdk=JDK%201.7%20(latest),label=beam/ws/sdks/java/javadoc/target/collected/org/apache/beam/runners/flink/metrics/ReaderInvocationUtil.java>:34:
warning - Tag @link: reference not found: Source.Reader
  [javadoc] Building index for all the packages and classes...
  [javadoc] <https://builds.apache.org/job/beam_PostCommit_Java_JDK_Versions_Test/jdk=JDK%201.7%20(latest),label=beam/ws/sdks/java/javadoc/target/collected/org/apache/beam/sdk/testing/SourceTestUtils.java>:552:
warning - Tag @link: reference not found: BoundedSource.BoundedReader#splitAtFraction
  [javadoc] <https://builds.apache.org/job/beam_PostCommit_Java_JDK_Versions_Test/jdk=JDK%201.7%20(latest),label=beam/ws/sdks/java/javadoc/target/collected/org/apache/beam/sdk/testing/SourceTestUtils.java>:450:
warning - Tag @link: reference not found: BoundedSource.BoundedReader#splitAtFraction
  [javadoc] <https://builds.apache.org/job/beam_PostCommit_Java_JDK_Versions_Test/jdk=JDK%201.7%20(latest),label=beam/ws/sdks/java/javadoc/target/collected/org/apache/beam/sdk/transforms/splittabledofn/RestrictionTracker.java>:47:
warning - Tag @link: reference not found: DoFn.ProcessElement
  [javadoc] <https://builds.apache.org/job/beam_PostCommit_Java_JDK_Versions_Test/jdk=JDK%201.7%20(latest),label=beam/ws/sdks/java/javadoc/target/collected/org/apache/beam/sdk/transforms/splittabledofn/RestrictionTracker.java>:39:
warning - Tag @link: reference not found: DoFn.ProcessElement
  [javadoc] <https://builds.apache.org/job/beam_PostCommit_Java_JDK_Versions_Test/jdk=JDK%201.7%20(latest),label=beam/ws/sdks/java/javadoc/target/collected/org/apache/beam/sdk/io/FileSystem.java>:80:
warning - Tag @link: reference not found: ResourceIdT
  [javadoc] <https://builds.apache.org/job/beam_PostCommit_Java_JDK_Versions_Test/jdk=JDK%201.7%20(latest),label=beam/ws/sdks/java/javadoc/target/collected/org/apache/beam/sdk/transforms/splittabledofn/RestrictionTracker.java>:31:
warning - Tag @link: reference not found: DoFn.ProcessElement
  [javadoc] <https://builds.apache.org/job/beam_PostCommit_Java_JDK_Versions_Test/jdk=JDK%201.7%20(latest),label=beam/ws/sdks/java/javadoc/target/collected/org/apache/beam/sdk/transforms/PTransform.java>:208:
warning - Tag @link: reference not found: InputT
  [javadoc] <https://builds.apache.org/job/beam_PostCommit_Java_JDK_Versions_Test/jdk=JDK%201.7%20(latest),label=beam/ws/sdks/java/javadoc/target/collected/org/apache/beam/sdk/io/gcp/bigquery/DynamicDestinations.java>:136:
warning - Tag @link: reference not found: DestinationT
  [javadoc] <https://builds.apache.org/job/beam_PostCommit_Java_JDK_Versions_Test/jdk=JDK%201.7%20(latest),label=beam/ws/sdks/java/javadoc/target/collected/org/apache/beam/sdk/io/FileSystem.java>:70:
warning - Tag @link: reference not found: ResourceIdT ResourceIds
  [javadoc] <https://builds.apache.org/job/beam_PostCommit_Java_JDK_Versions_Test/jdk=JDK%201.7%20(latest),label=beam/ws/sdks/java/javadoc/target/collected/org/apache/beam/sdk/io/FileSystem.java>:93:
warning - Tag @link: reference not found: ResourceIdT
  [javadoc] <https://builds.apache.org/job/beam_PostCommit_Java_JDK_Versions_Test/jdk=JDK%201.7%20(latest),label=beam/ws/sdks/java/javadoc/target/collected/org/apache/beam/runners/dataflow/PrimitiveParDoSingleFactory.java>:40:
warning - Tag @link: reference not found: ParDo.SingleOutput
  [javadoc] <https://builds.apache.org/job/beam_PostCommit_Java_JDK_Versions_Test/jdk=JDK%201.7%20(latest),label=beam/ws/sdks/java/javadoc/target/collected/org/apache/beam/runners/flink/metrics/ReaderInvocationUtil.java>:34:
warning - Tag @link: reference not found: Source.Reader
  [javadoc] <https://builds.apache.org/job/beam_PostCommit_Java_JDK_Versions_Test/jdk=JDK%201.7%20(latest),label=beam/ws/sdks/java/javadoc/target/collected/org/apache/beam/sdk/testing/SourceTestUtils.java>:152:
warning - Tag @link: reference not found: Source.Reader
  [javadoc] <https://builds.apache.org/job/beam_PostCommit_Java_JDK_Versions_Test/jdk=JDK%201.7%20(latest),label=beam/ws/sdks/java/javadoc/target/collected/org/apache/beam/sdk/testing/SourceTestUtils.java>:145:
warning - Tag @link: reference not found: Source.Reader
  [javadoc] <https://builds.apache.org/job/beam_PostCommit_Java_JDK_Versions_Test/jdk=JDK%201.7%20(latest),label=beam/ws/sdks/java/javadoc/target/collected/org/apache/beam/sdk/testing/SourceTestUtils.java>:168:
warning - Tag @link: reference not found: Source.Reader
  [javadoc] <https://builds.apache.org/job/beam_PostCommit_Java_JDK_Versions_Test/jdk=JDK%201.7%20(latest),label=beam/ws/sdks/java/javadoc/target/collected/org/apache/beam/sdk/testing/SourceTestUtils.java>:168:
warning - Tag @link: reference not found: Source.Reader#start
  [javadoc] <https://builds.apache.org/job/beam_PostCommit_Java_JDK_Versions_Test/jdk=JDK%201.7%20(latest),label=beam/ws/sdks/java/javadoc/target/collected/org/apache/beam/sdk/testing/SourceTestUtils.java>:159:
warning - Tag @link: reference not found: Source.Reader
  [javadoc] <https://builds.apache.org/job/beam_PostCommit_Java_JDK_Versions_Test/jdk=JDK%201.7%20(latest),label=beam/ws/sdks/java/javadoc/target/collected/org/apache/beam/sdk/testing/SourceTestUtils.java>:200:
warning - Tag @link: reference not found: Source.Reader
  [javadoc] <https://builds.apache.org/job/beam_PostCommit_Java_JDK_Versions_Test/jdk=JDK%201.7%20(latest),label=beam/ws/sdks/java/javadoc/target/collected/org/apache/beam/sdk/io/CompressedSource.java>:534:
warning - Tag @link: reference not found: FileBasedReader#startReading(ReadableByteChannel)
  [javadoc] Building index for all classes...
  [javadoc] Generating <https://builds.apache.org/job/beam_PostCommit_Java_JDK_Versions_Test/jdk=JDK%201.7%20(latest),label=beam/ws/sdks/java/target/site/javadoc/help-doc.html...>
  [javadoc] 73 errors
  [javadoc] 189 warnings
  [javadoc] <https://builds.apache.org/job/beam_PostCommit_Java_JDK_Versions_Test/jdk=JDK%201.7%20(latest),label=beam/ws/sdks/java/javadoc/target/collected/org/apache/beam/sdk/io/cassandra/CassandraServiceImpl.java>:376:
warning - Tag @link: reference not found: Mapper
  [javadoc] <https://builds.apache.org/job/beam_PostCommit_Java_JDK_Versions_Test/jdk=JDK%201.7%20(latest),label=beam/ws/sdks/java/javadoc/target/collected/org/apache/beam/sdk/io/cassandra/CassandraServiceImpl.java>:376:
warning - Tag @link: reference not found: MappingManager
2017-06-18\T\18:34:23.775 [INFO] ------------------------------------------------------------------------
2017-06-18\T\18:34:23.775 [INFO] Reactor Summary:
2017-06-18\T\18:34:23.775 [INFO] 
2017-06-18\T\18:34:23.776 [INFO] Apache Beam :: Parent .............................. SUCCESS
[ 17.222 s]
2017-06-18\T\18:34:23.776 [INFO] Apache Beam :: SDKs :: Java :: Build Tools ......... SUCCESS
[  5.787 s]
2017-06-18\T\18:34:23.776 [INFO] Apache Beam :: SDKs ................................ SUCCESS
[  0.434 s]
2017-06-18\T\18:34:23.776 [INFO] Apache Beam :: SDKs :: Common ...................... SUCCESS
[  0.388 s]
2017-06-18\T\18:34:23.776 [INFO] Apache Beam :: SDKs :: Common :: Runner API ........ SUCCESS
[  6.250 s]
2017-06-18\T\18:34:23.776 [INFO] Apache Beam :: SDKs :: Common :: Fn API ............ SUCCESS
[  5.081 s]
2017-06-18\T\18:34:23.776 [INFO] Apache Beam :: SDKs :: Java ........................ SUCCESS
[  0.414 s]
2017-06-18\T\18:34:23.776 [INFO] Apache Beam :: SDKs :: Java :: Core ................ SUCCESS
[01:10 min]
2017-06-18\T\18:34:23.776 [INFO] Apache Beam :: Runners ............................. SUCCESS
[  0.398 s]
2017-06-18\T\18:34:23.776 [INFO] Apache Beam :: Runners :: Core Construction Java ... SUCCESS
[ 10.683 s]
2017-06-18\T\18:34:23.776 [INFO] Apache Beam :: Runners :: Core Java ................ SUCCESS
[ 22.795 s]
2017-06-18\T\18:34:23.776 [INFO] Apache Beam :: Runners :: Direct Java .............. SUCCESS
[02:59 min]
2017-06-18\T\18:34:23.776 [INFO] Apache Beam :: SDKs :: Java :: IO .................. SUCCESS
[  0.399 s]
2017-06-18\T\18:34:23.776 [INFO] Apache Beam :: SDKs :: Java :: IO :: Common ........ SUCCESS
[  2.537 s]
2017-06-18\T\18:34:23.776 [INFO] Apache Beam :: SDKs :: Java :: IO :: Cassandra ..... SUCCESS
[ 14.509 s]
2017-06-18\T\18:34:23.776 [INFO] Apache Beam :: SDKs :: Java :: IO :: Elasticsearch . SUCCESS
[ 23.361 s]
2017-06-18\T\18:34:23.776 [INFO] Apache Beam :: SDKs :: Java :: Extensions .......... SUCCESS
[  0.388 s]
2017-06-18\T\18:34:23.776 [INFO] Apache Beam :: SDKs :: Java :: Extensions :: Google Cloud
Platform Core SUCCESS [ 19.765 s]
2017-06-18\T\18:34:23.776 [INFO] Apache Beam :: SDKs :: Java :: Extensions :: Protobuf SUCCESS
[  7.927 s]
2017-06-18\T\18:34:23.776 [INFO] Apache Beam :: SDKs :: Java :: IO :: Google Cloud Platform
SUCCESS [ 49.801 s]
2017-06-18\T\18:34:23.776 [INFO] Apache Beam :: SDKs :: Java :: IO :: Hadoop Common . SUCCESS
[ 11.323 s]
2017-06-18\T\18:34:23.776 [INFO] Apache Beam :: SDKs :: Java :: IO :: Hadoop File System SUCCESS
[ 38.616 s]
2017-06-18\T\18:34:23.776 [INFO] Apache Beam :: SDKs :: Java :: IO :: Hadoop ........ SUCCESS
[  2.713 s]
2017-06-18\T\18:34:23.776 [INFO] Apache Beam :: SDKs :: Java :: IO :: Hadoop :: input-format
SUCCESS [ 11.033 s]
2017-06-18\T\18:34:23.776 [INFO] Apache Beam :: SDKs :: Java :: IO :: HBase ......... SUCCESS
[01:00 min]
2017-06-18\T\18:34:23.776 [INFO] Apache Beam :: SDKs :: Java :: IO :: HCatalog ...... SUCCESS
[01:04 min]
2017-06-18\T\18:34:23.776 [INFO] Apache Beam :: Runners :: Google Cloud Dataflow .... SUCCESS
[05:51 min]
2017-06-18\T\18:34:23.776 [INFO] Apache Beam :: SDKs :: Java :: IO :: JDBC .......... SUCCESS
[ 20.373 s]
2017-06-18\T\18:34:23.776 [INFO] Apache Beam :: SDKs :: Java :: IO :: JMS ........... SUCCESS
[ 10.402 s]
2017-06-18\T\18:34:23.776 [INFO] Apache Beam :: SDKs :: Java :: IO :: Kafka ......... SUCCESS
[ 30.910 s]
2017-06-18\T\18:34:23.776 [INFO] Apache Beam :: SDKs :: Java :: IO :: Kinesis ....... SUCCESS
[ 15.670 s]
2017-06-18\T\18:34:23.776 [INFO] Apache Beam :: SDKs :: Java :: IO :: MongoDB ....... SUCCESS
[ 29.691 s]
2017-06-18\T\18:34:23.776 [INFO] Apache Beam :: SDKs :: Java :: IO :: MQTT .......... SUCCESS
[ 14.593 s]
2017-06-18\T\18:34:23.776 [INFO] Apache Beam :: SDKs :: Java :: IO :: XML ........... SUCCESS
[ 19.549 s]
2017-06-18\T\18:34:23.776 [INFO] Apache Beam :: SDKs :: Java :: Maven Archetypes .... SUCCESS
[  0.380 s]
2017-06-18\T\18:34:23.776 [INFO] Apache Beam :: SDKs :: Java :: Maven Archetypes :: Starter
SUCCESS [ 11.155 s]
2017-06-18\T\18:34:23.776 [INFO] Apache Beam :: Examples ............................ SUCCESS
[  0.401 s]
2017-06-18\T\18:34:23.776 [INFO] Apache Beam :: Examples :: Java .................... SUCCESS
[08:11 min]
2017-06-18\T\18:34:23.776 [INFO] Apache Beam :: SDKs :: Java :: Maven Archetypes :: Examples
SUCCESS [ 41.132 s]
2017-06-18\T\18:34:23.776 [INFO] Apache Beam :: SDKs :: Java :: Extensions :: Jackson SUCCESS
[  9.481 s]
2017-06-18\T\18:34:23.776 [INFO] Apache Beam :: SDKs :: Java :: Extensions :: Join library
SUCCESS [ 14.001 s]
2017-06-18\T\18:34:23.776 [INFO] Apache Beam :: SDKs :: Java :: Extensions :: Sorter  SUCCESS
[ 28.001 s]
2017-06-18\T\18:34:23.776 [INFO] Apache Beam :: Runners :: Flink .................... SUCCESS
[ 33.219 s]
2017-06-18\T\18:34:23.776 [INFO] Apache Beam :: Runners :: Spark .................... SUCCESS
[03:55 min]
2017-06-18\T\18:34:23.777 [INFO] Apache Beam :: SDKs :: Java :: Aggregated Javadoc .. FAILURE
[ 31.085 s]
2017-06-18\T\18:34:23.777 [INFO] ------------------------------------------------------------------------
2017-06-18\T\18:34:23.777 [INFO] BUILD FAILURE
2017-06-18\T\18:34:23.777 [INFO] ------------------------------------------------------------------------
2017-06-18\T\18:34:23.777 [INFO] Total time: 33:38 min
2017-06-18\T\18:34:23.777 [INFO] Finished at: 2017-06-18T18:34:23+00:00
2017-06-18\T\18:34:24.383 [INFO] Final Memory: 199M/2089M
2017-06-18\T\18:34:24.383 [INFO] ------------------------------------------------------------------------
2017-06-18\T\18:34:24.384 [ERROR] PermGen space -> [Help 1]
---------------------------------------------------
constituent[0]: file:/home/jenkins/tools/maven/apache-maven-3.3.3/lib/commons-lang-2.6.jar
constituent[1]: file:/home/jenkins/tools/maven/apache-maven-3.3.3/lib/plexus-interpolation-1.21.jar
constituent[2]: file:/home/jenkins/tools/maven/apache-maven-3.3.3/lib/org.eclipse.sisu.plexus-0.3.0.jar
constituent[3]: file:/home/jenkins/tools/maven/apache-maven-3.3.3/lib/plexus-utils-3.0.20.jar
constituent[4]: file:/home/jenkins/tools/maven/apache-maven-3.3.3/lib/wagon-file-2.9.jar
constituent[5]: file:/home/jenkins/tools/maven/apache-maven-3.3.3/lib/cdi-api-1.0.jar
constituent[6]: file:/home/jenkins/tools/maven/apache-maven-3.3.3/lib/wagon-http-shared-2.9.jar
constituent[7]: file:/home/jenkins/tools/maven/apache-maven-3.3.3/lib/aether-api-1.0.2.v20150114.jar
constituent[8]: file:/home/jenkins/tools/maven/apache-maven-3.3.3/lib/plexus-component-annotations-1.5.5.jar
constituent[9]: file:/home/jenkins/tools/maven/apache-maven-3.3.3/lib/jsoup-1.7.2.jar
constituent[10]: file:/home/jenkins/tools/maven/apache-maven-3.3.3/lib/wagon-http-2.9-shaded.jar
constituent[11]: file:/home/jenkins/tools/maven/apache-maven-3.3.3/lib/plexus-cipher-1.7.jar
constituent[12]: file:/home/jenkins/tools/maven/apache-maven-3.3.3/lib/org.eclipse.sisu.inject-0.3.0.jar
constituent[13]: file:/home/jenkins/tools/maven/apache-maven-3.3.3/lib/aether-spi-1.0.2.v20150114.jar
constituent[14]: file:/home/jenkins/tools/maven/apache-maven-3.3.3/lib/commons-cli-1.2.jar
constituent[15]: file:/home/jenkins/tools/maven/apache-maven-3.3.3/lib/aether-transport-wagon-1.0.2.v20150114.jar
constituent[16]: file:/home/jenkins/tools/maven/apache-maven-3.3.3/lib/javax.inject-1.jar
constituent[17]: file:/home/jenkins/tools/maven/apache-maven-3.3.3/lib/maven-compat-3.3.3.jar
constituent[18]: file:/home/jenkins/tools/maven/apache-maven-3.3.3/lib/maven-model-builder-3.3.3.jar
constituent[19]: file:/home/jenkins/tools/maven/apache-maven-3.3.3/lib/maven-settings-builder-3.3.3.jar
constituent[20]: file:/home/jenkins/tools/maven/apache-maven-3.3.3/lib/jsr250-api-1.0.jar
constituent[21]: file:/home/jenkins/tools/maven/apache-maven-3.3.3/lib/maven-model-3.3.3.jar
constituent[22]: file:/home/jenkins/tools/maven/apache-maven-3.3.3/lib/slf4j-simple-1.7.5.jar
constituent[23]: file:/home/jenkins/tools/maven/apache-maven-3.3.3/lib/wagon-provider-api-2.9.jar
constituent[24]: file:/home/jenkins/tools/maven/apache-maven-3.3.3/lib/maven-plugin-api-3.3.3.jar
constituent[25]: file:/home/jenkins/tools/maven/apache-maven-3.3.3/lib/commons-io-2.2.jar
constituent[26]: file:/home/jenkins/tools/maven/apache-maven-3.3.3/lib/maven-repository-metadata-3.3.3.jar
constituent[27]: file:/home/jenkins/tools/maven/apache-maven-3.3.3/lib/maven-core-3.3.3.jar
constituent[28]: file:/home/jenkins/tools/maven/apache-maven-3.3.3/lib/aether-connector-basic-1.0.2.v20150114.jar
constituent[29]: file:/home/jenkins/tools/maven/apache-maven-3.3.3/lib/sisu-guice-3.2.5-no_aop.jar
constituent[30]: file:/home/jenkins/tools/maven/apache-maven-3.3.3/lib/maven-artifact-3.3.3.jar
constituent[31]: file:/home/jenkins/tools/maven/apache-maven-3.3.3/lib/maven-builder-support-3.3.3.jar
constituent[32]: file:/home/jenkins/tools/maven/apache-maven-3.3.3/lib/aopalliance-1.0.jar
constituent[33]: file:/home/jenkins/tools/maven/apache-maven-3.3.3/lib/aether-impl-1.0.2.v20150114.jar
constituent[34]: file:/home/jenkins/tools/maven/apache-maven-3.3.3/lib/plexus-sec-dispatcher-1.3.jar
constituent[35]: file:/home/jenkins/tools/maven/apache-maven-3.3.3/lib/maven-settings-3.3.3.jar
constituent[36]: file:/home/jenkins/tools/maven/apache-maven-3.3.3/lib/aether-util-1.0.2.v20150114.jar
constituent[37]: file:/home/jenkins/tools/maven/apache-maven-3.3.3/lib/maven-embedder-3.3.3.jar
constituent[38]: file:/home/jenkins/tools/maven/apache-maven-3.3.3/lib/guava-18.0.jar
constituent[39]: file:/home/jenkins/tools/maven/apache-maven-3.3.3/lib/slf4j-api-1.7.5.jar
constituent[40]: file:/home/jenkins/tools/maven/apache-maven-3.3.3/lib/maven-aether-provider-3.3.3.jar
constituent[41]: file:/home/jenkins/tools/maven/apache-maven-3.3.3/conf/logging/
---------------------------------------------------
Exception in thread "main" 
Exception: java.lang.OutOfMemoryError thrown from the UncaughtExceptionHandler in thread "main"
Build step 'Invoke top-level Maven targets' marked build as failure
Not sending mail to unregistered user aljoscha.krettek@gmail.com
Not sending mail to unregistered user hepei.hp@alibaba-inc.com
Not sending mail to unregistered user klk@google.com
Not sending mail to unregistered user ccy@google.com
Not sending mail to unregistered user kirpichov@google.com

Mime
View raw message