beam-commits mailing list archives

Site index · List index
Message view « Date » · « Thread »
Top « Date » · « Thread »
From Apache Jenkins Server <jenk...@builds.apache.org>
Subject Build failed in Jenkins: beam_PostCommit_Java_ValidatesRunner_Dataflow #3448
Date Mon, 26 Jun 2017 06:02:47 GMT
See <https://builds.apache.org/job/beam_PostCommit_Java_ValidatesRunner_Dataflow/3448/display/redirect>

------------------------------------------
[...truncated 261.94 KB...]
2017-06-26T06:02:34.910 [INFO] 
2017-06-26T06:02:34.910 [INFO] --- maven-site-plugin:3.5.1:attach-descriptor (attach-descriptor)
@ beam-sdks-common-parent ---
2017-06-26T06:02:35.010 [INFO] 
2017-06-26T06:02:35.010 [INFO] --- maven-jar-plugin:3.0.2:jar (default-jar) @ beam-sdks-common-parent
---
2017-06-26T06:02:35.011 [INFO] Skipping packaging of the jar
2017-06-26T06:02:35.109 [INFO] 
2017-06-26T06:02:35.109 [INFO] --- maven-jar-plugin:3.0.2:test-jar (default-test-jar) @ beam-sdks-common-parent
---
2017-06-26T06:02:35.110 [INFO] Skipping packaging of the test-jar
2017-06-26T06:02:35.159 [INFO] 
2017-06-26T06:02:35.159 [INFO] --- maven-shade-plugin:3.0.0:shade (bundle-and-repackage) @
beam-sdks-common-parent ---
2017-06-26T06:02:35.163 [INFO] Replacing original artifact with shaded artifact.
2017-06-26T06:02:35.212 [INFO] 
2017-06-26T06:02:35.212 [INFO] --- maven-dependency-plugin:3.0.1:analyze-only (default) @
beam-sdks-common-parent ---
2017-06-26T06:02:35.213 [INFO] Skipping pom project
[JENKINS] Archiving disabled
2017-06-26T06:02:35.841 [INFO]                                                           
             
2017-06-26T06:02:35.841 [INFO] ------------------------------------------------------------------------
2017-06-26T06:02:35.841 [INFO] Building Apache Beam :: SDKs :: Common :: Runner API 2.1.0-SNAPSHOT
2017-06-26T06:02:35.841 [INFO] ------------------------------------------------------------------------
2017-06-26T06:02:35.842 [INFO] Downloading: https://repo.maven.apache.org/maven2/org/xolstice/maven/plugins/protobuf-maven-plugin/0.5.0/protobuf-maven-plugin-0.5.0.pom
2017-06-26T06:02:35.872 [INFO] Downloaded: https://repo.maven.apache.org/maven2/org/xolstice/maven/plugins/protobuf-maven-plugin/0.5.0/protobuf-maven-plugin-0.5.0.pom
(30 KB at 975.7 KB/sec)
2017-06-26T06:02:35.874 [INFO] Downloading: https://repo.maven.apache.org/maven2/org/xolstice/maven/plugins/protobuf-maven-plugin/0.5.0/protobuf-maven-plugin-0.5.0.jar
2017-06-26T06:02:35.912 [INFO] Downloaded: https://repo.maven.apache.org/maven2/org/xolstice/maven/plugins/protobuf-maven-plugin/0.5.0/protobuf-maven-plugin-0.5.0.jar
(176 KB at 4625.4 KB/sec)
2017-06-26T06:02:35.920 [INFO] Downloading: https://repo.maven.apache.org/maven2/org/codehaus/mojo/findbugs-maven-plugin/3.0.4/findbugs-maven-plugin-3.0.4.pom
2017-06-26T06:02:35.947 [INFO] Downloaded: https://repo.maven.apache.org/maven2/org/codehaus/mojo/findbugs-maven-plugin/3.0.4/findbugs-maven-plugin-3.0.4.pom
(22 KB at 798.0 KB/sec)
2017-06-26T06:02:35.949 [INFO] Downloading: https://repo.maven.apache.org/maven2/org/codehaus/mojo/mojo-parent/35/mojo-parent-35.pom
2017-06-26T06:02:35.977 [INFO] Downloaded: https://repo.maven.apache.org/maven2/org/codehaus/mojo/mojo-parent/35/mojo-parent-35.pom
(25 KB at 868.5 KB/sec)
2017-06-26T06:02:35.979 [INFO] Downloading: https://repo.maven.apache.org/maven2/org/codehaus/codehaus-parent/4/codehaus-parent-4.pom
2017-06-26T06:02:36.004 [INFO] Downloaded: https://repo.maven.apache.org/maven2/org/codehaus/codehaus-parent/4/codehaus-parent-4.pom
(5 KB at 188.3 KB/sec)
2017-06-26T06:02:36.007 [INFO] Downloading: https://repo.maven.apache.org/maven2/org/codehaus/mojo/findbugs-maven-plugin/3.0.4/findbugs-maven-plugin-3.0.4.jar
2017-06-26T06:02:36.044 [INFO] Downloaded: https://repo.maven.apache.org/maven2/org/codehaus/mojo/findbugs-maven-plugin/3.0.4/findbugs-maven-plugin-3.0.4.jar
(143 KB at 3844.5 KB/sec)
2017-06-26T06:02:36.049 [INFO] Downloading: https://repo.maven.apache.org/maven2/com/google/protobuf/protobuf-java/3.2.0/protobuf-java-3.2.0.pom
2017-06-26T06:02:36.077 [INFO] Downloaded: https://repo.maven.apache.org/maven2/com/google/protobuf/protobuf-java/3.2.0/protobuf-java-3.2.0.pom
(5 KB at 162.9 KB/sec)
2017-06-26T06:02:36.078 [INFO] Downloading: https://repo.maven.apache.org/maven2/com/google/protobuf/protobuf-parent/3.2.0/protobuf-parent-3.2.0.pom
2017-06-26T06:02:36.106 [INFO] Downloaded: https://repo.maven.apache.org/maven2/com/google/protobuf/protobuf-parent/3.2.0/protobuf-parent-3.2.0.pom
(7 KB at 238.7 KB/sec)
2017-06-26T06:02:36.108 [INFO] Downloading: https://repo.maven.apache.org/maven2/com/google/protobuf/protobuf-java/3.2.0/protobuf-java-3.2.0.jar
2017-06-26T06:02:36.230 [INFO] Downloaded: https://repo.maven.apache.org/maven2/com/google/protobuf/protobuf-java/3.2.0/protobuf-java-3.2.0.jar
(1316 KB at 10783.2 KB/sec)
2017-06-26T06:02:36.231 [INFO] 
2017-06-26T06:02:36.231 [INFO] --- maven-clean-plugin:3.0.0:clean (default-clean) @ beam-sdks-common-runner-api
---
2017-06-26T06:02:36.232 [INFO] Deleting <https://builds.apache.org/job/beam_PostCommit_Java_ValidatesRunner_Dataflow/ws/sdks/common/runner-api>
(includes = [**/*.pyc, **/*.egg-info/, **/sdks/python/LICENSE, **/sdks/python/NOTICE, **/sdks/python/README.md],
excludes = [])
2017-06-26T06:02:36.282 [INFO] 
2017-06-26T06:02:36.282 [INFO] --- maven-enforcer-plugin:1.4.1:enforce (enforce) @ beam-sdks-common-runner-api
---
2017-06-26T06:02:36.355 [INFO] 
2017-06-26T06:02:36.355 [INFO] --- maven-enforcer-plugin:1.4.1:enforce (enforce-banned-dependencies)
@ beam-sdks-common-runner-api ---
2017-06-26T06:02:36.408 [INFO] 
2017-06-26T06:02:36.408 [INFO] --- protobuf-maven-plugin:0.5.0:compile (default) @ beam-sdks-common-runner-api
---
2017-06-26T06:02:36.411 [INFO] Downloading: https://repo.maven.apache.org/maven2/com/google/guava/guava/18.0/guava-18.0.pom
2017-06-26T06:02:36.437 [INFO] Downloaded: https://repo.maven.apache.org/maven2/com/google/guava/guava/18.0/guava-18.0.pom
(6 KB at 212.8 KB/sec)
2017-06-26T06:02:36.438 [INFO] Downloading: https://repo.maven.apache.org/maven2/com/google/guava/guava-parent/18.0/guava-parent-18.0.pom
2017-06-26T06:02:36.465 [INFO] Downloaded: https://repo.maven.apache.org/maven2/com/google/guava/guava-parent/18.0/guava-parent-18.0.pom
(8 KB at 278.0 KB/sec)
2017-06-26T06:02:36.467 [INFO] Downloading: https://repo.maven.apache.org/maven2/org/apache/maven/plugin-tools/maven-plugin-annotations/3.4/maven-plugin-annotations-3.4.pom
2017-06-26T06:02:36.494 [INFO] Downloaded: https://repo.maven.apache.org/maven2/org/apache/maven/plugin-tools/maven-plugin-annotations/3.4/maven-plugin-annotations-3.4.pom
(2 KB at 58.9 KB/sec)
2017-06-26T06:02:36.495 [INFO] Downloading: https://repo.maven.apache.org/maven2/org/apache/maven/plugin-tools/maven-plugin-tools/3.4/maven-plugin-tools-3.4.pom
2017-06-26T06:02:36.523 [INFO] Downloaded: https://repo.maven.apache.org/maven2/org/apache/maven/plugin-tools/maven-plugin-tools/3.4/maven-plugin-tools-3.4.pom
(14 KB at 474.0 KB/sec)
2017-06-26T06:02:36.529 [INFO] Downloading: https://repo.maven.apache.org/maven2/com/google/guava/guava/18.0/guava-18.0.jar
2017-06-26T06:02:36.529 [INFO] Downloading: https://repo.maven.apache.org/maven2/org/apache/maven/plugin-tools/maven-plugin-annotations/3.4/maven-plugin-annotations-3.4.jar
2017-06-26T06:02:36.530 [INFO] Downloading: https://repo.maven.apache.org/maven2/org/apache/maven/wagon/wagon-provider-api/1.0-beta-6/wagon-provider-api-1.0-beta-6.jar
2017-06-26T06:02:36.556 [INFO] Downloaded: https://repo.maven.apache.org/maven2/org/apache/maven/plugin-tools/maven-plugin-annotations/3.4/maven-plugin-annotations-3.4.jar
(14 KB at 515.3 KB/sec)
2017-06-26T06:02:36.558 [INFO] Downloaded: https://repo.maven.apache.org/maven2/org/apache/maven/wagon/wagon-provider-api/1.0-beta-6/wagon-provider-api-1.0-beta-6.jar
(52 KB at 1791.0 KB/sec)
2017-06-26T06:02:36.709 [INFO] Downloaded: https://repo.maven.apache.org/maven2/com/google/guava/guava/18.0/guava-18.0.jar
(2204 KB at 12240.7 KB/sec)
2017-06-26T06:02:36.765 [INFO] Downloading: https://repo.maven.apache.org/maven2/com/google/protobuf/protoc/3.2.0/protoc-3.2.0.pom
2017-06-26T06:02:36.791 [INFO] Downloaded: https://repo.maven.apache.org/maven2/com/google/protobuf/protoc/3.2.0/protoc-3.2.0.pom
(5 KB at 170.6 KB/sec)
2017-06-26T06:02:36.795 [INFO] Downloading: https://repo.maven.apache.org/maven2/com/google/protobuf/protoc/3.2.0/protoc-3.2.0-linux-x86_64.exe
[JENKINS] Archiving disabled
[JENKINS] Archiving disabled
[JENKINS] Archiving disabled
[JENKINS] Archiving disabled
[JENKINS] Archiving disabled
[JENKINS] Archiving disabled
[JENKINS] Archiving disabled
[JENKINS] Archiving disabled
[JENKINS] Archiving disabled
[JENKINS] Archiving disabled
[JENKINS] Archiving disabled
[JENKINS] Archiving disabled
[JENKINS] Archiving disabled
[JENKINS] Archiving disabled
[JENKINS] Archiving disabled
[JENKINS] Archiving disabled
[JENKINS] Archiving disabled
[JENKINS] Archiving disabled
[JENKINS] Archiving disabled
2017-06-26T06:02:41.341 [INFO] ------------------------------------------------------------------------
2017-06-26T06:02:41.341 [INFO] Reactor Summary:
2017-06-26T06:02:41.341 [INFO] 
2017-06-26T06:02:41.342 [INFO] Apache Beam :: Parent .............................. SUCCESS
[ 18.697 s]
2017-06-26T06:02:41.342 [INFO] Apache Beam :: SDKs :: Java :: Build Tools ......... SUCCESS
[  9.620 s]
2017-06-26T06:02:41.342 [INFO] Apache Beam :: SDKs ................................ SUCCESS
[  3.207 s]
2017-06-26T06:02:41.342 [INFO] Apache Beam :: SDKs :: Common ...................... SUCCESS
[  1.668 s]
2017-06-26T06:02:41.342 [INFO] Apache Beam :: SDKs :: Common :: Runner API ........ FAILURE
[  1.205 s]
2017-06-26T06:02:41.342 [INFO] Apache Beam :: SDKs :: Common :: Fn API ............ SKIPPED
2017-06-26T06:02:41.342 [INFO] Apache Beam :: SDKs :: Java ........................ SKIPPED
2017-06-26T06:02:41.342 [INFO] Apache Beam :: SDKs :: Java :: Core ................ SKIPPED
2017-06-26T06:02:41.342 [INFO] Apache Beam :: Runners ............................. SKIPPED
2017-06-26T06:02:41.342 [INFO] Apache Beam :: Runners :: Core Construction Java ... SKIPPED
2017-06-26T06:02:41.342 [INFO] Apache Beam :: Runners :: Core Java ................ SKIPPED
2017-06-26T06:02:41.342 [INFO] Apache Beam :: Runners :: Direct Java .............. SKIPPED
2017-06-26T06:02:41.342 [INFO] Apache Beam :: SDKs :: Java :: IO .................. SKIPPED
2017-06-26T06:02:41.342 [INFO] Apache Beam :: SDKs :: Java :: Extensions .......... SKIPPED
2017-06-26T06:02:41.342 [INFO] Apache Beam :: SDKs :: Java :: Extensions :: Google Cloud Platform
Core SKIPPED
2017-06-26T06:02:41.342 [INFO] Apache Beam :: SDKs :: Java :: Extensions :: Protobuf SKIPPED
2017-06-26T06:02:41.342 [INFO] Apache Beam :: SDKs :: Java :: IO :: Google Cloud Platform
SKIPPED
2017-06-26T06:02:41.342 [INFO] Apache Beam :: Runners :: Google Cloud Dataflow .... SKIPPED
2017-06-26T06:02:41.342 [INFO] ------------------------------------------------------------------------
2017-06-26T06:02:41.342 [INFO] BUILD FAILURE
2017-06-26T06:02:41.342 [INFO] ------------------------------------------------------------------------
2017-06-26T06:02:41.342 [INFO] Total time: 01:10 min
2017-06-26T06:02:41.342 [INFO] Finished at: 2017-06-26T06:02:41+00:00
2017-06-26T06:02:41.639 [INFO] Final Memory: 71M/780M
2017-06-26T06:02:41.640 [INFO] ------------------------------------------------------------------------
2017-06-26T06:02:41.846 [ERROR] Failed to execute goal org.xolstice.maven.plugins:protobuf-maven-plugin:0.5.0:compile
(default) on project beam-sdks-common-runner-api: Could not transfer artifact com.google.protobuf:protoc:exe:linux-x86_64:3.2.0
from/to central (https://repo.maven.apache.org/maven2): GET request of: com/google/protobuf/protoc/3.2.0/protoc-3.2.0-linux-x86_64.exe
from central failed
2017-06-26T06:02:41.847 [ERROR] com.google.protobuf:protoc:exe:3.2.0
2017-06-26T06:02:41.847 [ERROR] 
2017-06-26T06:02:41.847 [ERROR] from the specified remote repositories:
2017-06-26T06:02:41.847 [ERROR] Nexus (http://repository.apache.org/snapshots, releases=false,
snapshots=true),
Waiting for Jenkins to finish collecting data2017-06-26T06:02:41.847 [ERROR] central (https://repo.maven.apache.org/maven2,
releases=true, snapshots=false)
2017-06-26T06:02:41.847 [ERROR] Path to dependency:
2017-06-26T06:02:41.847 [ERROR] 1) org.apache.beam:beam-sdks-common-runner-api:jar:2.1.0-SNAPSHOT
2017-06-26T06:02:41.847 [ERROR] 2) com.google.protobuf:protoc:exe:linux-x86_64:3.2.0: Connection
reset
2017-06-26T06:02:41.847 [ERROR] -> [Help 1]
org.apache.maven.lifecycle.LifecycleExecutionException: Failed to execute goal org.xolstice.maven.plugins:protobuf-maven-plugin:0.5.0:compile
(default) on project beam-sdks-common-runner-api: Could not transfer artifact com.google.protobuf:protoc:exe:linux-x86_64:3.2.0
from/to central (https://repo.maven.apache.org/maven2): GET request of: com/google/protobuf/protoc/3.2.0/protoc-3.2.0-linux-x86_64.exe
from central failed
  com.google.protobuf:protoc:exe:3.2.0

from the specified remote repositories:
  Nexus (http://repository.apache.org/snapshots, releases=false, snapshots=true),
  central (https://repo.maven.apache.org/maven2, releases=true, snapshots=false)
Path to dependency: 
	1) org.apache.beam:beam-sdks-common-runner-api:jar:2.1.0-SNAPSHOT
	2) com.google.protobuf:protoc:exe:linux-x86_64:3.2.0


	at org.apache.maven.lifecycle.internal.MojoExecutor.execute(MojoExecutor.java:216)
	at org.apache.maven.lifecycle.internal.MojoExecutor.execute(MojoExecutor.java:153)
	at org.apache.maven.lifecycle.internal.MojoExecutor.execute(MojoExecutor.java:145)
	at org.apache.maven.lifecycle.internal.LifecycleModuleBuilder.buildProject(LifecycleModuleBuilder.java:116)
	at org.apache.maven.lifecycle.internal.LifecycleModuleBuilder.buildProject(LifecycleModuleBuilder.java:80)
	at org.apache.maven.lifecycle.internal.builder.singlethreaded.SingleThreadedBuilder.build(SingleThreadedBuilder.java:51)
	at org.apache.maven.lifecycle.internal.LifecycleStarter.execute(LifecycleStarter.java:128)
	at org.apache.maven.DefaultMaven.doExecute(DefaultMaven.java:307)
	at org.apache.maven.DefaultMaven.doExecute(DefaultMaven.java:193)
	at org.apache.maven.DefaultMaven.execute(DefaultMaven.java:106)
	at org.jvnet.hudson.maven3.launcher.Maven33Launcher.main(Maven33Launcher.java:129)
	at sun.reflect.NativeMethodAccessorImpl.invoke0(Native Method)
	at sun.reflect.NativeMethodAccessorImpl.invoke(NativeMethodAccessorImpl.java:62)
	at sun.reflect.DelegatingMethodAccessorImpl.invoke(DelegatingMethodAccessorImpl.java:43)
	at java.lang.reflect.Method.invoke(Method.java:498)
	at org.codehaus.plexus.classworlds.launcher.Launcher.launchStandard(Launcher.java:330)
	at org.codehaus.plexus.classworlds.launcher.Launcher.launch(Launcher.java:238)
	at jenkins.maven3.agent.Maven33Main.launch(Maven33Main.java:176)
	at sun.reflect.NativeMethodAccessorImpl.invoke0(Native Method)
	at sun.reflect.NativeMethodAccessorImpl.invoke(NativeMethodAccessorImpl.java:62)
	at sun.reflect.DelegatingMethodAccessorImpl.invoke(DelegatingMethodAccessorImpl.java:43)
	at java.lang.reflect.Method.invoke(Method.java:498)
	at hudson.maven.Maven3Builder.call(Maven3Builder.java:139)
	at hudson.maven.Maven3Builder.call(Maven3Builder.java:70)
	at hudson.remoting.UserRequest.perform(UserRequest.java:153)
	at hudson.remoting.UserRequest.perform(UserRequest.java:50)
	at hudson.remoting.Request$2.run(Request.java:336)
	at hudson.remoting.InterceptingExecutorService$1.call(InterceptingExecutorService.java:68)
	at java.util.concurrent.FutureTask.run(FutureTask.java:266)
	at java.util.concurrent.ThreadPoolExecutor.runWorker(ThreadPoolExecutor.java:1142)
	at java.util.concurrent.ThreadPoolExecutor$Worker.run(ThreadPoolExecutor.java:617)
	at java.lang.Thread.run(Thread.java:748)
Caused by: org.apache.maven.plugin.MojoExecutionException: Could not transfer artifact com.google.protobuf:protoc:exe:linux-x86_64:3.2.0
from/to central (https://repo.maven.apache.org/maven2): GET request of: com/google/protobuf/protoc/3.2.0/protoc-3.2.0-linux-x86_64.exe
from central failed
  com.google.protobuf:protoc:exe:3.2.0

from the specified remote repositories:
  Nexus (http://repository.apache.org/snapshots, releases=false, snapshots=true),
  central (https://repo.maven.apache.org/maven2, releases=true, snapshots=false)
Path to dependency: 
	1) org.apache.beam:beam-sdks-common-runner-api:jar:2.1.0-SNAPSHOT
	2) com.google.protobuf:protoc:exe:linux-x86_64:3.2.0


	at org.xolstice.maven.plugin.protobuf.AbstractProtocMojo.resolveBinaryArtifact(AbstractProtocMojo.java:962)
	at org.xolstice.maven.plugin.protobuf.AbstractProtocMojo.execute(AbstractProtocMojo.java:489)
	at org.xolstice.maven.plugin.protobuf.AbstractProtocCompileMojo.execute(AbstractProtocCompileMojo.java:31)
	at org.apache.maven.plugin.DefaultBuildPluginManager.executeMojo(DefaultBuildPluginManager.java:134)
	at org.apache.maven.lifecycle.internal.MojoExecutor.execute(MojoExecutor.java:208)
	... 31 more
Caused by: org.apache.maven.artifact.resolver.ArtifactResolutionException: Could not transfer
artifact com.google.protobuf:protoc:exe:linux-x86_64:3.2.0 from/to central (https://repo.maven.apache.org/maven2):
GET request of: com/google/protobuf/protoc/3.2.0/protoc-3.2.0-linux-x86_64.exe from central
failed
  com.google.protobuf:protoc:exe:3.2.0

from the specified remote repositories:
  Nexus (http://repository.apache.org/snapshots, releases=false, snapshots=true),
  central (https://repo.maven.apache.org/maven2, releases=true, snapshots=false)
Path to dependency: 
	1) org.apache.beam:beam-sdks-common-runner-api:jar:2.1.0-SNAPSHOT
	2) com.google.protobuf:protoc:exe:linux-x86_64:3.2.0


	at org.apache.maven.artifact.resolver.DefaultArtifactResolver.resolve(DefaultArtifactResolver.java:222)
	at org.apache.maven.artifact.resolver.DefaultArtifactResolver.access$000(DefaultArtifactResolver.java:74)
	at org.apache.maven.artifact.resolver.DefaultArtifactResolver$ResolveTask.run(DefaultArtifactResolver.java:602)
	... 3 more
Caused by: org.eclipse.aether.resolution.ArtifactResolutionException: Could not transfer artifact
com.google.protobuf:protoc:exe:linux-x86_64:3.2.0 from/to central (https://repo.maven.apache.org/maven2):
GET request of: com/google/protobuf/protoc/3.2.0/protoc-3.2.0-linux-x86_64.exe from central
failed
	at org.eclipse.aether.internal.impl.DefaultArtifactResolver.resolve(DefaultArtifactResolver.java:444)
	at org.eclipse.aether.internal.impl.DefaultArtifactResolver.resolveArtifacts(DefaultArtifactResolver.java:246)
	at org.eclipse.aether.internal.impl.DefaultArtifactResolver.resolveArtifact(DefaultArtifactResolver.java:223)
	at org.eclipse.aether.internal.impl.DefaultRepositorySystem.resolveArtifact(DefaultRepositorySystem.java:294)
	at org.apache.maven.artifact.resolver.DefaultArtifactResolver.resolve(DefaultArtifactResolver.java:212)
	... 5 more
Caused by: org.eclipse.aether.transfer.ArtifactTransferException: Could not transfer artifact
com.google.protobuf:protoc:exe:linux-x86_64:3.2.0 from/to central (https://repo.maven.apache.org/maven2):
GET request of: com/google/protobuf/protoc/3.2.0/protoc-3.2.0-linux-x86_64.exe from central
failed
	at org.eclipse.aether.connector.basic.ArtifactTransportListener.transferFailed(ArtifactTransportListener.java:43)
	at org.eclipse.aether.connector.basic.BasicRepositoryConnector$TaskRunner.run(BasicRepositoryConnector.java:355)
	at org.eclipse.aether.util.concurrency.RunnableErrorForwarder$1.run(RunnableErrorForwarder.java:67)
	at org.eclipse.aether.connector.basic.BasicRepositoryConnector$DirectExecutor.execute(BasicRepositoryConnector.java:581)
	at org.eclipse.aether.connector.basic.BasicRepositoryConnector.get(BasicRepositoryConnector.java:249)
	at org.eclipse.aether.internal.impl.DefaultArtifactResolver.performDownloads(DefaultArtifactResolver.java:520)
	at org.eclipse.aether.internal.impl.DefaultArtifactResolver.resolve(DefaultArtifactResolver.java:421)
	... 9 more
Caused by: org.apache.maven.wagon.TransferFailedException: GET request of: com/google/protobuf/protoc/3.2.0/protoc-3.2.0-linux-x86_64.exe
from central failed
	at org.apache.maven.wagon.AbstractWagon.getTransfer(AbstractWagon.java:363)
	at org.apache.maven.wagon.AbstractWagon.getTransfer(AbstractWagon.java:316)
	at org.apache.maven.wagon.AbstractWagon.getTransfer(AbstractWagon.java:285)
	at org.apache.maven.wagon.StreamWagon.getIfNewer(StreamWagon.java:97)
	at org.apache.maven.wagon.StreamWagon.get(StreamWagon.java:61)
	at org.eclipse.aether.transport.wagon.WagonTransporter$GetTaskRunner.run(WagonTransporter.java:560)
	at org.eclipse.aether.transport.wagon.WagonTransporter.execute(WagonTransporter.java:427)
	at org.eclipse.aether.transport.wagon.WagonTransporter.get(WagonTransporter.java:404)
	at org.eclipse.aether.connector.basic.BasicRepositoryConnector$GetTaskRunner.runTask(BasicRepositoryConnector.java:447)
	at org.eclipse.aether.connector.basic.BasicRepositoryConnector$TaskRunner.run(BasicRepositoryConnector.java:350)
	... 14 more
Caused by: java.net.SocketException: Connection reset
	at java.net.SocketInputStream.read(SocketInputStream.java:210)
	at java.net.SocketInputStream.read(SocketInputStream.java:141)
	at sun.security.ssl.InputRecord.readFully(InputRecord.java:465)
	at sun.security.ssl.InputRecord.readV3Record(InputRecord.java:593)
	at sun.security.ssl.InputRecord.read(InputRecord.java:532)
	at sun.security.ssl.SSLSocketImpl.readRecord(SSLSocketImpl.java:973)
	at sun.security.ssl.SSLSocketImpl.readDataRecord(SSLSocketImpl.java:930)
	at sun.security.ssl.AppInputStream.read(AppInputStream.java:105)
	at org.apache.maven.wagon.providers.http.httpclient.impl.io.SessionInputBufferImpl.streamRead(SessionInputBufferImpl.java:136)
	at org.apache.maven.wagon.providers.http.httpclient.impl.io.SessionInputBufferImpl.read(SessionInputBufferImpl.java:195)
	at org.apache.maven.wagon.providers.http.httpclient.impl.io.ContentLengthInputStream.read(ContentLengthInputStream.java:178)
	at org.apache.maven.wagon.providers.http.httpclient.conn.EofSensorInputStream.read(EofSensorInputStream.java:137)
	at org.apache.maven.wagon.AbstractWagon.transfer(AbstractWagon.java:531)
	at org.apache.maven.wagon.AbstractWagon.getTransfer(AbstractWagon.java:353)
	... 23 more
2017-06-26T06:02:41.848 [ERROR] 
2017-06-26T06:02:41.848 [ERROR] Re-run Maven using the -X switch to enable full debug logging.
2017-06-26T06:02:41.848 [ERROR] 
2017-06-26T06:02:41.848 [ERROR] For more information about the errors and possible solutions,
please read the following articles:
2017-06-26T06:02:41.848 [ERROR] [Help 1] http://cwiki.apache.org/confluence/display/MAVEN/MojoExecutionException
2017-06-26T06:02:41.849 [ERROR] 
2017-06-26T06:02:41.849 [ERROR] After correcting the problems, you can resume the build with
the command
2017-06-26T06:02:41.849 [ERROR]   mvn <goals> -rf :beam-sdks-common-runner-api

channel stopped

Mime
View raw message