beam-commits mailing list archives

Site index · List index
Message view « Date » · « Thread »
Top « Date » · « Thread »
From Apache Jenkins Server <jenk...@builds.apache.org>
Subject Build failed in Jenkins: beam_PostCommit_Java_JDK_Versions_Test » OpenJDK 8 (on Ubuntu only),beam #41
Date Sun, 04 Jun 2017 06:18:32 GMT
See <https://builds.apache.org/job/beam_PostCommit_Java_JDK_Versions_Test/jdk=OpenJDK%208%20(on%20Ubuntu%20only),label=beam/41/display/redirect>

------------------------------------------
[...truncated 876.05 KB...]
2017-06-04\T\06:13:05.579 [INFO] Excluding com.google.api-client:google-api-client-java6:jar:1.22.0
from the shaded jar.
2017-06-04\T\06:13:05.579 [INFO] Excluding com.google.api-client:google-api-client-jackson2:jar:1.22.0
from the shaded jar.
2017-06-04\T\06:13:05.579 [INFO] Excluding com.google.oauth-client:google-oauth-client-java6:jar:1.22.0
from the shaded jar.
2017-06-04\T\06:13:05.579 [INFO] Including com.google.guava:guava:jar:20.0 in the shaded jar.
2017-06-04\T\06:13:05.579 [INFO] Excluding org.apache.avro:avro:jar:1.8.2 from the shaded
jar.
2017-06-04\T\06:13:05.579 [INFO] Excluding org.codehaus.jackson:jackson-core-asl:jar:1.9.13
from the shaded jar.
2017-06-04\T\06:13:05.579 [INFO] Excluding org.codehaus.jackson:jackson-mapper-asl:jar:1.9.13
from the shaded jar.
2017-06-04\T\06:13:05.579 [INFO] Excluding com.thoughtworks.paranamer:paranamer:jar:2.7 from
the shaded jar.
2017-06-04\T\06:13:05.579 [INFO] Excluding org.tukaani:xz:jar:1.5 from the shaded jar.
2017-06-04\T\06:13:05.579 [INFO] Excluding com.google.errorprone:error_prone_annotations:jar:2.0.15
from the shaded jar.
2017-06-04\T\06:13:05.579 [INFO] Excluding joda-time:joda-time:jar:2.4 from the shaded jar.
2017-06-04\T\06:13:05.579 [INFO] Excluding com.google.code.findbugs:jsr305:jar:3.0.1 from
the shaded jar.
2017-06-04\T\06:13:05.579 [INFO] Excluding com.fasterxml.jackson.core:jackson-core:jar:2.8.8
from the shaded jar.
2017-06-04\T\06:13:05.579 [INFO] Excluding com.fasterxml.jackson.core:jackson-annotations:jar:2.8.8
from the shaded jar.
2017-06-04\T\06:13:05.579 [INFO] Excluding com.fasterxml.jackson.core:jackson-databind:jar:2.8.8
from the shaded jar.
2017-06-04\T\06:13:05.579 [INFO] Excluding org.slf4j:slf4j-api:jar:1.7.14 from the shaded
jar.
2017-06-04\T\06:13:05.579 [INFO] Excluding com.google.auto.service:auto-service:jar:1.0-rc2
from the shaded jar.
2017-06-04\T\06:13:05.579 [INFO] Excluding com.google.auto:auto-common:jar:0.3 from the shaded
jar.
2017-06-04\T\06:13:05.579 [INFO] Excluding com.google.api.grpc:grpc-google-common-protos:jar:0.1.9
from the shaded jar.
2017-06-04\T\06:13:05.579 [INFO] Excluding io.grpc:grpc-protobuf:jar:1.2.0 from the shaded
jar.
2017-06-04\T\06:13:09.999 [INFO] Replacing original artifact with shaded artifact.
2017-06-04\T\06:13:09.999 [INFO] Replacing <https://builds.apache.org/job/beam_PostCommit_Java_JDK_Versions_Test/jdk=OpenJDK%208%20(on%20Ubuntu%20only),label=beam/ws/runners/google-cloud-dataflow-java/target/beam-runners-google-cloud-dataflow-java-2.1.0-SNAPSHOT.jar>
with <https://builds.apache.org/job/beam_PostCommit_Java_JDK_Versions_Test/jdk=OpenJDK%208%20(on%20Ubuntu%20only),label=beam/ws/runners/google-cloud-dataflow-java/target/beam-runners-google-cloud-dataflow-java-2.1.0-SNAPSHOT-shaded.jar>
2017-06-04\T\06:13:10.000 [INFO] Replacing original test artifact with shaded test artifact.
2017-06-04\T\06:13:10.000 [INFO] Replacing <https://builds.apache.org/job/beam_PostCommit_Java_JDK_Versions_Test/jdk=OpenJDK%208%20(on%20Ubuntu%20only),label=beam/ws/runners/google-cloud-dataflow-java/target/beam-runners-google-cloud-dataflow-java-2.1.0-SNAPSHOT-tests.jar>
with <https://builds.apache.org/job/beam_PostCommit_Java_JDK_Versions_Test/jdk=OpenJDK%208%20(on%20Ubuntu%20only),label=beam/ws/runners/google-cloud-dataflow-java/target/beam-runners-google-cloud-dataflow-java-2.1.0-SNAPSHOT-shaded-tests.jar>
2017-06-04\T\06:13:10.000 [INFO] Dependency-reduced POM written at: <https://builds.apache.org/job/beam_PostCommit_Java_JDK_Versions_Test/jdk=OpenJDK%208%20(on%20Ubuntu%20only),label=beam/ws/runners/google-cloud-dataflow-java/dependency-reduced-pom.xml>
2017-06-04\T\06:13:10.114 [INFO] 
2017-06-04\T\06:13:10.114 [INFO] --- maven-failsafe-plugin:2.20:integration-test (integration-test)
@ beam-runners-google-cloud-dataflow-java ---
2017-06-04\T\06:13:10.199 [INFO] Failsafe report directory: <https://builds.apache.org/job/beam_PostCommit_Java_JDK_Versions_Test/jdk=OpenJDK%208%20(on%20Ubuntu%20only),label=beam/ws/runners/google-cloud-dataflow-java/target/failsafe-reports>
2017-06-04\T\06:13:10.204 [INFO] parallel='all', perCoreThreadCount=true, threadCount=4, useUnlimitedThreads=false,
threadCountSuites=0, threadCountClasses=0, threadCountMethods=0, parallelOptimized=true
2017-06-04\T\06:13:10.222 [INFO] 
2017-06-04\T\06:13:10.222 [INFO] -------------------------------------------------------
2017-06-04\T\06:13:10.222 [INFO]  T E S T S
2017-06-04\T\06:13:10.222 [INFO] -------------------------------------------------------
2017-06-04\T\06:18:29.658 [INFO] Running org.apache.beam.sdk.io.gcp.datastore.SplitQueryFnIT
2017-06-04\T\06:18:29.673 [INFO] Tests run: 2, Failures: 0, Errors: 0, Skipped: 0, Time elapsed:
10.803 s - in org.apache.beam.sdk.io.gcp.datastore.SplitQueryFnIT
2017-06-04\T\06:18:29.674 [INFO] Running org.apache.beam.sdk.io.gcp.bigtable.BigtableWriteIT
2017-06-04\T\06:18:29.678 [INFO] Tests run: 1, Failures: 0, Errors: 0, Skipped: 0, Time elapsed:
248.994 s - in org.apache.beam.sdk.io.gcp.bigtable.BigtableWriteIT
2017-06-04\T\06:18:29.678 [INFO] Running org.apache.beam.sdk.io.gcp.datastore.V1ReadIT
2017-06-04\T\06:18:29.688 [INFO] Tests run: 3, Failures: 0, Errors: 0, Skipped: 0, Time elapsed:
304.104 s - in org.apache.beam.sdk.io.gcp.datastore.V1ReadIT
2017-06-04\T\06:18:29.688 [INFO] Running org.apache.beam.sdk.io.gcp.spanner.SpannerWriteIT
2017-06-04\T\06:18:29.703 [ERROR] Tests run: 1, Failures: 0, Errors: 1, Skipped: 0, Time elapsed:
218.158 s <<< FAILURE! - in org.apache.beam.sdk.io.gcp.spanner.SpannerWriteIT
2017-06-04\T\06:18:29.703 [ERROR] testWrite(org.apache.beam.sdk.io.gcp.spanner.SpannerWriteIT)
 Time elapsed: 218.158 s  <<< ERROR!
com.google.cloud.spanner.SpannerException: 
NOT_FOUND: io.grpc.StatusRuntimeException: NOT_FOUND: Database not found: projects/apache-beam-testing/instances/beam-test/databases/beam-testdb
resource_type: "type.googleapis.com/google.spanner.admin.database.v1.Database"
resource_name: "projects/apache-beam-testing/instances/beam-test/databases/beam-testdb"
description: "Database does not exist."

	at com.google.cloud.spanner.SpannerExceptionFactory.newSpannerExceptionPreformatted(SpannerExceptionFactory.java:119)
	at com.google.cloud.spanner.SpannerExceptionFactory.newSpannerException(SpannerExceptionFactory.java:71)
	at com.google.cloud.spanner.SpannerExceptionFactory.newSpannerException(SpannerExceptionFactory.java:58)
	at com.google.cloud.spanner.SessionPool$Waiter.take(SessionPool.java:376)
	at com.google.cloud.spanner.SessionPool$Waiter.access$2800(SessionPool.java:362)
	at com.google.cloud.spanner.SessionPool.getReadSession(SessionPool.java:697)
	at com.google.cloud.spanner.DatabaseClientImpl.singleUse(DatabaseClientImpl.java:42)
	at org.apache.beam.sdk.io.gcp.spanner.SpannerWriteIT.testWrite(SpannerWriteIT.java:126)
	at sun.reflect.NativeMethodAccessorImpl.invoke0(Native Method)
	at sun.reflect.NativeMethodAccessorImpl.invoke(NativeMethodAccessorImpl.java:57)
	at sun.reflect.DelegatingMethodAccessorImpl.invoke(DelegatingMethodAccessorImpl.java:43)
	at java.lang.reflect.Method.invoke(Method.java:606)
	at org.junit.runners.model.FrameworkMethod$1.runReflectiveCall(FrameworkMethod.java:50)
	at org.junit.internal.runners.model.ReflectiveCallable.run(ReflectiveCallable.java:12)
	at org.junit.runners.model.FrameworkMethod.invokeExplosively(FrameworkMethod.java:47)
	at org.junit.internal.runners.statements.InvokeMethod.evaluate(InvokeMethod.java:17)
	at org.junit.internal.runners.statements.RunBefores.evaluate(RunBefores.java:26)
	at org.junit.internal.runners.statements.RunAfters.evaluate(RunAfters.java:27)
	at org.apache.beam.sdk.testing.TestPipeline$1.evaluate(TestPipeline.java:321)
	at org.junit.rules.RunRules.evaluate(RunRules.java:20)
	at org.junit.runners.ParentRunner.runLeaf(ParentRunner.java:325)
	at org.junit.runners.BlockJUnit4ClassRunner.runChild(BlockJUnit4ClassRunner.java:78)
	at org.junit.runners.BlockJUnit4ClassRunner.runChild(BlockJUnit4ClassRunner.java:57)
	at org.junit.runners.ParentRunner$3.run(ParentRunner.java:290)
	at org.apache.maven.surefire.junitcore.pc.Scheduler$1.run(Scheduler.java:393)
	at java.util.concurrent.Executors$RunnableAdapter.call(Executors.java:473)
	at java.util.concurrent.FutureTask.run(FutureTask.java:262)
	at java.util.concurrent.ThreadPoolExecutor.runWorker(ThreadPoolExecutor.java:1145)
	at java.util.concurrent.ThreadPoolExecutor$Worker.run(ThreadPoolExecutor.java:615)
	at java.lang.Thread.run(Thread.java:745)
Caused by: com.google.cloud.spanner.SpannerException: NOT_FOUND: io.grpc.StatusRuntimeException:
NOT_FOUND: Database not found: projects/apache-beam-testing/instances/beam-test/databases/beam-testdb
resource_type: "type.googleapis.com/google.spanner.admin.database.v1.Database"
resource_name: "projects/apache-beam-testing/instances/beam-test/databases/beam-testdb"
description: "Database does not exist."

	at com.google.cloud.spanner.SpannerExceptionFactory.newSpannerExceptionPreformatted(SpannerExceptionFactory.java:119)
	at com.google.cloud.spanner.SpannerExceptionFactory.newSpannerException(SpannerExceptionFactory.java:43)
	at com.google.cloud.spanner.SpannerExceptionFactory.newSpannerException(SpannerExceptionFactory.java:80)
	at com.google.cloud.spanner.spi.v1.GrpcSpannerRpc.get(GrpcSpannerRpc.java:404)
	at com.google.cloud.spanner.spi.v1.GrpcSpannerRpc.createSession(GrpcSpannerRpc.java:322)
	at com.google.cloud.spanner.SpannerImpl$2.call(SpannerImpl.java:223)
	at com.google.cloud.spanner.SpannerImpl$2.call(SpannerImpl.java:220)
	at com.google.cloud.spanner.SpannerImpl.runWithRetries(SpannerImpl.java:202)
	at com.google.cloud.spanner.SpannerImpl.createSession(SpannerImpl.java:219)
	at com.google.cloud.spanner.SessionPool$4.run(SessionPool.java:987)
	at java.util.concurrent.Executors$RunnableAdapter.call(Executors.java:473)
	at java.util.concurrent.FutureTask.run(FutureTask.java:262)
	at java.util.concurrent.ScheduledThreadPoolExecutor$ScheduledFutureTask.access$201(ScheduledThreadPoolExecutor.java:178)
	at java.util.concurrent.ScheduledThreadPoolExecutor$ScheduledFutureTask.run(ScheduledThreadPoolExecutor.java:292)
	... 3 more
Caused by: java.util.concurrent.ExecutionException: io.grpc.StatusRuntimeException: NOT_FOUND:
Database not found: projects/apache-beam-testing/instances/beam-test/databases/beam-testdb
resource_type: "type.googleapis.com/google.spanner.admin.database.v1.Database"
resource_name: "projects/apache-beam-testing/instances/beam-test/databases/beam-testdb"
description: "Database does not exist."

	at com.google.common.util.concurrent.AbstractFuture.getDoneValue(AbstractFuture.java:500)
	at com.google.common.util.concurrent.AbstractFuture.get(AbstractFuture.java:479)
	at com.google.cloud.spanner.spi.v1.GrpcSpannerRpc.get(GrpcSpannerRpc.java:398)
	... 13 more
Caused by: io.grpc.StatusRuntimeException: NOT_FOUND: Database not found: projects/apache-beam-testing/instances/beam-test/databases/beam-testdb
resource_type: "type.googleapis.com/google.spanner.admin.database.v1.Database"
resource_name: "projects/apache-beam-testing/instances/beam-test/databases/beam-testdb"
description: "Database does not exist."

	at io.grpc.Status.asRuntimeException(Status.java:540)
	at io.grpc.stub.ClientCalls$UnaryStreamToFuture.onClose(ClientCalls.java:439)
	at io.grpc.ForwardingClientCallListener.onClose(ForwardingClientCallListener.java:56)
	at com.google.cloud.spanner.spi.v1.SpannerErrorInterceptor$1$1.onClose(SpannerErrorInterceptor.java:100)
	at io.grpc.ForwardingClientCallListener.onClose(ForwardingClientCallListener.java:56)
	at com.google.cloud.spanner.spi.v1.WatchdogInterceptor$MonitoredCall$1.onClose(WatchdogInterceptor.java:190)
	at io.grpc.internal.ClientCallImpl.closeObserver(ClientCallImpl.java:428)
	at io.grpc.internal.ClientCallImpl.access$100(ClientCallImpl.java:76)
	at io.grpc.internal.ClientCallImpl$ClientStreamListenerImpl.close(ClientCallImpl.java:514)
	at io.grpc.internal.ClientCallImpl$ClientStreamListenerImpl.access$700(ClientCallImpl.java:431)
	at io.grpc.internal.ClientCallImpl$ClientStreamListenerImpl$1StreamClosed.runInContext(ClientCallImpl.java:546)
	at io.grpc.internal.ContextRunnable.run(ContextRunnable.java:52)
	at io.grpc.internal.SerializingExecutor$TaskRunner.run(SerializingExecutor.java:152)
	... 3 more

2017-06-04\T\06:18:29.704 [INFO] Running org.apache.beam.sdk.io.gcp.datastore.V1WriteIT
2017-06-04\T\06:18:29.706 [INFO] Tests run: 2, Failures: 0, Errors: 0, Skipped: 0, Time elapsed:
316.635 s - in org.apache.beam.sdk.io.gcp.datastore.V1WriteIT
2017-06-04\T\06:18:29.706 [INFO] Running org.apache.beam.sdk.io.gcp.bigtable.BigtableReadIT
2017-06-04\T\06:18:29.708 [INFO] Tests run: 1, Failures: 0, Errors: 0, Skipped: 0, Time elapsed:
299.253 s - in org.apache.beam.sdk.io.gcp.bigtable.BigtableReadIT
2017-06-04\T\06:18:30.458 [INFO] 
2017-06-04\T\06:18:30.458 [INFO] Results:
2017-06-04\T\06:18:30.458 [INFO] 
2017-06-04\T\06:18:30.458 [ERROR] Errors: 
2017-06-04\T\06:18:30.458 [ERROR]   SpannerWriteIT.testWrite:126 » Spanner NOT_FOUND: io.grpc.StatusRuntimeExcepti...
2017-06-04\T\06:18:30.458 [INFO] 
2017-06-04\T\06:18:30.458 [ERROR] Tests run: 10, Failures: 0, Errors: 1, Skipped: 0
2017-06-04\T\06:18:30.458 [INFO] 
2017-06-04\T\06:18:30.841 [INFO] 
2017-06-04\T\06:18:30.841 [INFO] --- maven-dependency-plugin:3.0.1:analyze-only (default)
@ beam-runners-google-cloud-dataflow-java ---
2017-06-04\T\06:18:30.959 [INFO] No dependency problems found
2017-06-04\T\06:18:30.959 [INFO] 
2017-06-04\T\06:18:30.959 [INFO] --- maven-failsafe-plugin:2.20:verify (integration-test)
@ beam-runners-google-cloud-dataflow-java ---
2017-06-04\T\06:18:30.960 [INFO] Failsafe report directory: <https://builds.apache.org/job/beam_PostCommit_Java_JDK_Versions_Test/jdk=OpenJDK%208%20(on%20Ubuntu%20only),label=beam/ws/runners/google-cloud-dataflow-java/target/failsafe-reports>
2017-06-04\T\06:18:30.971 [INFO] ------------------------------------------------------------------------
2017-06-04\T\06:18:30.971 [INFO] Reactor Summary:
2017-06-04\T\06:18:30.971 [INFO] 
2017-06-04\T\06:18:30.971 [INFO] Apache Beam :: Parent .............................. SUCCESS
[ 21.341 s]
2017-06-04\T\06:18:30.971 [INFO] Apache Beam :: SDKs :: Java :: Build Tools ......... SUCCESS
[ 11.491 s]
2017-06-04\T\06:18:30.971 [INFO] Apache Beam :: SDKs ................................ SUCCESS
[  0.587 s]
2017-06-04\T\06:18:30.971 [INFO] Apache Beam :: SDKs :: Common ...................... SUCCESS
[  0.432 s]
2017-06-04\T\06:18:30.971 [INFO] Apache Beam :: SDKs :: Common :: Runner API ........ SUCCESS
[ 10.512 s]
2017-06-04\T\06:18:30.971 [INFO] Apache Beam :: SDKs :: Common :: Fn API ............ SUCCESS
[  9.942 s]
2017-06-04\T\06:18:30.971 [INFO] Apache Beam :: SDKs :: Java ........................ SUCCESS
[  0.453 s]
2017-06-04\T\06:18:30.971 [INFO] Apache Beam :: SDKs :: Java :: Core ................ SUCCESS
[01:43 min]
2017-06-04\T\06:18:30.971 [INFO] Apache Beam :: SDKs :: Java :: IO .................. SUCCESS
[  0.476 s]
2017-06-04\T\06:18:30.971 [INFO] Apache Beam :: SDKs :: Java :: IO :: Common ........ SUCCESS
[  3.268 s]
2017-06-04\T\06:18:30.971 [INFO] Apache Beam :: Runners ............................. SUCCESS
[  0.479 s]
2017-06-04\T\06:18:30.971 [INFO] Apache Beam :: Runners :: Core Construction Java ... SUCCESS
[ 16.703 s]
2017-06-04\T\06:18:30.971 [INFO] Apache Beam :: Runners :: Core Java ................ SUCCESS
[ 29.466 s]
2017-06-04\T\06:18:30.971 [INFO] Apache Beam :: Runners :: Direct Java .............. SUCCESS
[03:30 min]
2017-06-04\T\06:18:30.971 [INFO] Apache Beam :: SDKs :: Java :: IO :: Elasticsearch . SUCCESS
[ 33.210 s]
2017-06-04\T\06:18:30.971 [INFO] Apache Beam :: SDKs :: Java :: Extensions .......... SUCCESS
[  0.394 s]
2017-06-04\T\06:18:30.971 [INFO] Apache Beam :: SDKs :: Java :: Extensions :: Google Cloud
Platform Core SUCCESS [ 31.391 s]
2017-06-04\T\06:18:30.971 [INFO] Apache Beam :: SDKs :: Java :: Extensions :: Protobuf SUCCESS
[ 10.537 s]
2017-06-04\T\06:18:30.971 [INFO] Apache Beam :: SDKs :: Java :: IO :: Google Cloud Platform
SUCCESS [01:07 min]
2017-06-04\T\06:18:30.971 [INFO] Apache Beam :: SDKs :: Java :: IO :: Hadoop Common . SUCCESS
[ 14.358 s]
2017-06-04\T\06:18:30.971 [INFO] Apache Beam :: SDKs :: Java :: IO :: Hadoop File System SUCCESS
[ 31.672 s]
2017-06-04\T\06:18:30.971 [INFO] Apache Beam :: SDKs :: Java :: IO :: Hadoop ........ SUCCESS
[  4.001 s]
2017-06-04\T\06:18:30.971 [INFO] Apache Beam :: SDKs :: Java :: IO :: Hadoop :: input-format
SUCCESS [ 14.975 s]
2017-06-04\T\06:18:30.971 [INFO] Apache Beam :: SDKs :: Java :: IO :: HBase ......... SUCCESS
[01:10 min]
2017-06-04\T\06:18:30.971 [INFO] Apache Beam :: Runners :: Google Cloud Dataflow .... FAILURE
[05:58 min]
2017-06-04\T\06:18:30.971 [INFO] Apache Beam :: SDKs :: Java :: IO :: JDBC .......... SKIPPED
2017-06-04\T\06:18:30.971 [INFO] Apache Beam :: SDKs :: Java :: IO :: JMS ........... SKIPPED
2017-06-04\T\06:18:30.971 [INFO] Apache Beam :: SDKs :: Java :: IO :: Kafka ......... SKIPPED
2017-06-04\T\06:18:30.971 [INFO] Apache Beam :: SDKs :: Java :: IO :: Kinesis ....... SKIPPED
2017-06-04\T\06:18:30.971 [INFO] Apache Beam :: SDKs :: Java :: IO :: MongoDB ....... SKIPPED
2017-06-04\T\06:18:30.971 [INFO] Apache Beam :: SDKs :: Java :: IO :: MQTT .......... SKIPPED
2017-06-04\T\06:18:30.972 [INFO] Apache Beam :: SDKs :: Java :: IO :: XML ........... SKIPPED
2017-06-04\T\06:18:30.972 [INFO] Apache Beam :: SDKs :: Java :: Maven Archetypes .... SKIPPED
2017-06-04\T\06:18:30.972 [INFO] Apache Beam :: SDKs :: Java :: Maven Archetypes :: Starter
SKIPPED
2017-06-04\T\06:18:30.972 [INFO] Apache Beam :: Examples ............................ SKIPPED
2017-06-04\T\06:18:30.972 [INFO] Apache Beam :: Examples :: Java .................... SKIPPED
2017-06-04\T\06:18:30.972 [INFO] Apache Beam :: SDKs :: Java :: Maven Archetypes :: Examples
SKIPPED
2017-06-04\T\06:18:30.972 [INFO] Apache Beam :: SDKs :: Java :: Extensions :: Jackson SKIPPED
2017-06-04\T\06:18:30.972 [INFO] Apache Beam :: SDKs :: Java :: Extensions :: Join library
SKIPPED
2017-06-04\T\06:18:30.972 [INFO] Apache Beam :: SDKs :: Java :: Extensions :: Sorter  SKIPPED
2017-06-04\T\06:18:30.972 [INFO] Apache Beam :: Runners :: Flink .................... SKIPPED
2017-06-04\T\06:18:30.972 [INFO] Apache Beam :: Runners :: Spark .................... SKIPPED
2017-06-04\T\06:18:30.972 [INFO] Apache Beam :: SDKs :: Java :: Aggregated Javadoc .. SKIPPED
2017-06-04\T\06:18:30.972 [INFO] ------------------------------------------------------------------------
2017-06-04\T\06:18:30.972 [INFO] BUILD FAILURE
2017-06-04\T\06:18:30.972 [INFO] ------------------------------------------------------------------------
2017-06-04\T\06:18:30.972 [INFO] Total time: 17:40 min
2017-06-04\T\06:18:30.972 [INFO] Finished at: 2017-06-04T06:18:30+00:00
2017-06-04\T\06:18:31.830 [INFO] Final Memory: 176M/1289M
2017-06-04\T\06:18:31.830 [INFO] ------------------------------------------------------------------------
2017-06-04\T\06:18:31.831 [ERROR] Failed to execute goal org.apache.maven.plugins:maven-failsafe-plugin:2.20:verify
(integration-test) on project beam-runners-google-cloud-dataflow-java: There are test failures.
2017-06-04\T\06:18:31.831 [ERROR] 
2017-06-04\T\06:18:31.831 [ERROR] Please refer to <https://builds.apache.org/job/beam_PostCommit_Java_JDK_Versions_Test/jdk=OpenJDK%208%20(on%20Ubuntu%20only),label=beam/ws/runners/google-cloud-dataflow-java/target/failsafe-reports>
for the individual test results.
2017-06-04\T\06:18:31.831 [ERROR] Please refer to dump files (if any exist) [date]-jvmRun[N].dump,
[date].dumpstream and [date]-jvmRun[N].dumpstream.
2017-06-04\T\06:18:31.831 [ERROR] -> [Help 1]
org.apache.maven.lifecycle.LifecycleExecutionException: Failed to execute goal org.apache.maven.plugins:maven-failsafe-plugin:2.20:verify
(integration-test) on project beam-runners-google-cloud-dataflow-java: There are test failures.

Please refer to <https://builds.apache.org/job/beam_PostCommit_Java_JDK_Versions_Test/jdk=OpenJDK%208%20(on%20Ubuntu%20only),label=beam/ws/runners/google-cloud-dataflow-java/target/failsafe-reports>
for the individual test results.
Please refer to dump files (if any exist) [date]-jvmRun[N].dump, [date].dumpstream and [date]-jvmRun[N].dumpstream.
	at org.apache.maven.lifecycle.internal.MojoExecutor.execute(MojoExecutor.java:212)
	at org.apache.maven.lifecycle.internal.MojoExecutor.execute(MojoExecutor.java:153)
	at org.apache.maven.lifecycle.internal.MojoExecutor.execute(MojoExecutor.java:145)
	at org.apache.maven.lifecycle.internal.LifecycleModuleBuilder.buildProject(LifecycleModuleBuilder.java:116)
	at org.apache.maven.lifecycle.internal.LifecycleModuleBuilder.buildProject(LifecycleModuleBuilder.java:80)
	at org.apache.maven.lifecycle.internal.builder.singlethreaded.SingleThreadedBuilder.build(SingleThreadedBuilder.java:51)
	at org.apache.maven.lifecycle.internal.LifecycleStarter.execute(LifecycleStarter.java:128)
	at org.apache.maven.DefaultMaven.doExecute(DefaultMaven.java:307)
	at org.apache.maven.DefaultMaven.doExecute(DefaultMaven.java:193)
	at org.apache.maven.DefaultMaven.execute(DefaultMaven.java:106)
	at org.apache.maven.cli.MavenCli.execute(MavenCli.java:862)
	at org.apache.maven.cli.MavenCli.doMain(MavenCli.java:286)
	at org.apache.maven.cli.MavenCli.main(MavenCli.java:197)
	at sun.reflect.NativeMethodAccessorImpl.invoke0(Native Method)
	at sun.reflect.NativeMethodAccessorImpl.invoke(NativeMethodAccessorImpl.java:57)
	at sun.reflect.DelegatingMethodAccessorImpl.invoke(DelegatingMethodAccessorImpl.java:43)
	at java.lang.reflect.Method.invoke(Method.java:606)
	at org.codehaus.plexus.classworlds.launcher.Launcher.launchEnhanced(Launcher.java:289)
	at org.codehaus.plexus.classworlds.launcher.Launcher.launch(Launcher.java:229)
	at org.codehaus.plexus.classworlds.launcher.Launcher.mainWithExitCode(Launcher.java:415)
	at org.codehaus.plexus.classworlds.launcher.Launcher.main(Launcher.java:356)
Caused by: org.apache.maven.plugin.MojoFailureException: There are test failures.

Please refer to <https://builds.apache.org/job/beam_PostCommit_Java_JDK_Versions_Test/jdk=OpenJDK%208%20(on%20Ubuntu%20only),label=beam/ws/runners/google-cloud-dataflow-java/target/failsafe-reports>
for the individual test results.
Please refer to dump files (if any exist) [date]-jvmRun[N].dump, [date].dumpstream and [date]-jvmRun[N].dumpstream.
	at org.apache.maven.plugin.surefire.SurefireHelper.throwException(SurefireHelper.java:204)
	at org.apache.maven.plugin.surefire.SurefireHelper.reportExecution(SurefireHelper.java:98)
	at org.apache.maven.plugin.failsafe.VerifyMojo.execute(VerifyMojo.java:191)
	at org.apache.maven.plugin.DefaultBuildPluginManager.executeMojo(DefaultBuildPluginManager.java:134)
	at org.apache.maven.lifecycle.internal.MojoExecutor.execute(MojoExecutor.java:208)
	... 20 more
2017-06-04\T\06:18:31.832 [ERROR] 
2017-06-04\T\06:18:31.832 [ERROR] Re-run Maven using the -X switch to enable full debug logging.
2017-06-04\T\06:18:31.832 [ERROR] 
2017-06-04\T\06:18:31.832 [ERROR] For more information about the errors and possible solutions,
please read the following articles:
2017-06-04\T\06:18:31.832 [ERROR] [Help 1] http://cwiki.apache.org/confluence/display/MAVEN/MojoFailureException
2017-06-04\T\06:18:31.832 [ERROR] 
2017-06-04\T\06:18:31.832 [ERROR] After correcting the problems, you can resume the build
with the command
2017-06-04\T\06:18:31.832 [ERROR]   mvn <goals> -rf :beam-runners-google-cloud-dataflow-java
Build step 'Invoke top-level Maven targets' marked build as failure
Not sending mail to unregistered user kirpichov@google.com
Not sending mail to unregistered user klk@google.com

Mime
View raw message