beam-commits mailing list archives

Site index · List index
Message view « Date » · « Thread »
Top « Date » · « Thread »
From Apache Jenkins Server <jenk...@builds.apache.org>
Subject Build failed in Jenkins: beam_PostCommit_Java_MavenInstall #4164
Date Wed, 21 Jun 2017 00:37:17 GMT
See <https://builds.apache.org/job/beam_PostCommit_Java_MavenInstall/4164/display/redirect>

------------------------------------------
[...truncated 1.05 MB...]
2017-06-21T00:36:39.720 [INFO] Downloaded: https://repo.maven.apache.org/maven2/de/jflex/jflex/1.6.0/jflex-1.6.0.jar
(1025 KB at 152.2 KB/sec)
2017-06-21T00:36:39.720 [INFO] Downloading: https://repo.maven.apache.org/maven2/net/mintern/primitive/1.0/primitive-1.0.jar
2017-06-21T00:36:39.763 [INFO] Downloaded: https://repo.maven.apache.org/maven2/net/mintern/primitive/1.0/primitive-1.0.jar
(52 KB at 7.6 KB/sec)
2017-06-21T00:36:39.763 [INFO] Downloading: https://repo.maven.apache.org/maven2/com/github/rholder/snowball-stemmer/1.3.0.581.1/snowball-stemmer-1.3.0.581.1.jar
2017-06-21T00:36:39.813 [INFO] Downloaded: https://repo.maven.apache.org/maven2/com/github/rholder/snowball-stemmer/1.3.0.581.1/snowball-stemmer-1.3.0.581.1.jar
(91 KB at 13.3 KB/sec)
2017-06-21T00:36:39.813 [INFO] Downloading: https://repo.maven.apache.org/maven2/com/googlecode/concurrent-trees/concurrent-trees/2.4.0/concurrent-trees-2.4.0.jar
2017-06-21T00:36:39.817 [INFO] Downloaded: https://repo.maven.apache.org/maven2/org/apache/cassandra/cassandra-thrift/3.9/cassandra-thrift-3.9.jar
(1858 KB at 272.1 KB/sec)
2017-06-21T00:36:39.817 [INFO] Downloading: https://repo.maven.apache.org/maven2/com/github/jbellis/jamm/0.3.0/jamm-0.3.0.jar
2017-06-21T00:36:39.855 [INFO] Downloaded: https://repo.maven.apache.org/maven2/com/github/jbellis/jamm/0.3.0/jamm-0.3.0.jar
(21 KB at 3.0 KB/sec)
2017-06-21T00:36:39.855 [INFO] Downloading: https://repo.maven.apache.org/maven2/io/netty/netty-all/4.0.39.Final/netty-all-4.0.39.Final.jar
2017-06-21T00:36:39.872 [INFO] Downloaded: https://repo.maven.apache.org/maven2/com/googlecode/concurrent-trees/concurrent-trees/2.4.0/concurrent-trees-2.4.0.jar
(116 KB at 16.8 KB/sec)
2017-06-21T00:36:39.872 [INFO] Downloading: https://repo.maven.apache.org/maven2/org/fusesource/sigar/1.6.4/sigar-1.6.4.jar
2017-06-21T00:36:39.913 [INFO] Downloaded: https://repo.maven.apache.org/maven2/org/apache/cassandra/cassandra-all/3.9/cassandra-all-3.9.jar
(5923 KB at 855.5 KB/sec)
2017-06-21T00:36:39.913 [INFO] Downloading: https://repo.maven.apache.org/maven2/org/eclipse/jdt/core/compiler/ecj/4.4.2/ecj-4.4.2.jar
2017-06-21T00:36:39.960 [INFO] Downloaded: https://repo.maven.apache.org/maven2/org/fusesource/sigar/1.6.4/sigar-1.6.4.jar
(419 KB at 60.1 KB/sec)
2017-06-21T00:36:39.960 [INFO] Downloading: https://repo.maven.apache.org/maven2/org/caffinitas/ohc/ohc-core/0.4.3/ohc-core-0.4.3.jar
2017-06-21T00:36:40.014 [INFO] Downloaded: https://repo.maven.apache.org/maven2/org/caffinitas/ohc/ohc-core/0.4.3/ohc-core-0.4.3.jar
(125 KB at 17.7 KB/sec)
2017-06-21T00:36:40.015 [INFO] Downloading: https://repo.maven.apache.org/maven2/com/github/ben-manes/caffeine/caffeine/2.2.6/caffeine-2.2.6.jar
2017-06-21T00:36:40.192 [INFO] Downloaded: https://repo.maven.apache.org/maven2/com/github/ben-manes/caffeine/caffeine/2.2.6/caffeine-2.2.6.jar
(926 KB at 128.5 KB/sec)
2017-06-21T00:36:40.192 [INFO] Downloading: https://repo.maven.apache.org/maven2/com/datastax/cassandra/cassandra-driver-core/3.1.1/cassandra-driver-core-3.1.1.jar
2017-06-21T00:36:40.311 [INFO] Downloaded: https://repo.maven.apache.org/maven2/org/eclipse/jdt/core/compiler/ecj/4.4.2/ecj-4.4.2.jar
(2257 KB at 308.2 KB/sec)
2017-06-21T00:36:40.314 [INFO] Downloaded: https://repo.maven.apache.org/maven2/io/netty/netty-all/4.0.39.Final/netty-all-4.0.39.Final.jar
(2219 KB at 302.9 KB/sec)
2017-06-21T00:36:40.412 [INFO] Downloaded: https://repo.maven.apache.org/maven2/com/datastax/cassandra/cassandra-driver-core/3.1.1/cassandra-driver-core-3.1.1.jar
(1029 KB at 138.5 KB/sec)
2017-06-21T00:36:41.165 [INFO] Downloaded: https://repo.maven.apache.org/maven2/it/unimi/dsi/fastutil/6.5.7/fastutil-6.5.7.jar
(16508 KB at 2019.3 KB/sec)
2017-06-21T00:36:41.216 [INFO] Downloaded: https://repo.maven.apache.org/maven2/org/apache/storm/storm-core/1.0.1/storm-core-1.0.1.jar
(19650 KB at 2388.7 KB/sec)
2017-06-21T00:36:41.275 [INFO] Downloading: http://conjars.org/repo/org/pentaho/pentaho-aggdesigner-algorithm/5.1.5-jhyde/pentaho-aggdesigner-algorithm-5.1.5-jhyde.jar
2017-06-21T00:36:41.275 [INFO] Downloading: http://conjars.org/repo/org/apache/spark/spark-core_2.10/2.0.0/spark-core_2.10-2.0.0.jar
2017-06-21T00:36:41.275 [INFO] Downloading: http://conjars.org/repo/org/scala-lang/scala-library/2.10.6/scala-library-2.10.6.jar
2017-06-21T00:36:41.276 [INFO] Downloading: http://conjars.org/repo/cascading/cascading-hadoop/2.6.3/cascading-hadoop-2.6.3.jar
2017-06-21T00:36:41.278 [INFO] Downloading: http://conjars.org/repo/cascading/cascading-core/2.6.3/cascading-core-2.6.3.jar
2017-06-21T00:36:41.335 [INFO] Downloading: http://conjars.org/repo/riffle/riffle/0.1-dev/riffle-0.1-dev.jar
2017-06-21T00:36:41.335 [INFO] Downloading: http://conjars.org/repo/thirdparty/jgrapht-jdk1.6/0.8.1/jgrapht-jdk1.6-0.8.1.jar
2017-06-21T00:36:41.451 [INFO] Downloaded: http://conjars.org/repo/org/pentaho/pentaho-aggdesigner-algorithm/5.1.5-jhyde/pentaho-aggdesigner-algorithm-5.1.5-jhyde.jar
(48 KB at 269.4 KB/sec)
2017-06-21T00:36:41.451 [INFO] Downloading: http://conjars.org/repo/cascading/cascading-local/2.6.3/cascading-local-2.6.3.jar
2017-06-21T00:36:41.466 [INFO] Downloaded: http://conjars.org/repo/riffle/riffle/0.1-dev/riffle-0.1-dev.jar
(12 KB at 58.3 KB/sec)
2017-06-21T00:36:41.620 [INFO] Downloaded: http://conjars.org/repo/cascading/cascading-local/2.6.3/cascading-local-2.6.3.jar
(43 KB at 123.1 KB/sec)
2017-06-21T00:36:41.664 [INFO] Downloaded: http://conjars.org/repo/cascading/cascading-hadoop/2.6.3/cascading-hadoop-2.6.3.jar
(246 KB at 632.1 KB/sec)
2017-06-21T00:36:41.683 [INFO] Downloaded: http://conjars.org/repo/thirdparty/jgrapht-jdk1.6/0.8.1/jgrapht-jdk1.6-0.8.1.jar
(230 KB at 563.3 KB/sec)
2017-06-21T00:36:41.939 [INFO] Downloaded: http://conjars.org/repo/cascading/cascading-core/2.6.3/cascading-core-2.6.3.jar
(680 KB at 1024.8 KB/sec)
2017-06-21T00:36:41.943 [INFO] Downloading: http://clojars.org/repo/org/apache/spark/spark-core_2.10/2.0.0/spark-core_2.10-2.0.0.jar
2017-06-21T00:36:41.943 [INFO] Downloading: http://clojars.org/repo/org/scala-lang/scala-library/2.10.6/scala-library-2.10.6.jar
2017-06-21T00:36:42.015 [INFO]                                                           
             
2017-06-21T00:36:42.015 [INFO] ------------------------------------------------------------------------
2017-06-21T00:36:42.015 [INFO] Skipping Apache Beam :: Parent
2017-06-21T00:36:42.015 [INFO] This project has been banned from the build due to previous
failures.
2017-06-21T00:36:42.015 [INFO] ------------------------------------------------------------------------
[JENKINS] Archiving disabled
[JENKINS] Archiving disabled
[JENKINS] Archiving disabled
[JENKINS] Archiving disabled
[JENKINS] Archiving disabled
[JENKINS] Archiving disabled
[JENKINS] Archiving disabled
[JENKINS] Archiving disabled
[JENKINS] Archiving disabled
[JENKINS] Archiving disabled
[JENKINS] Archiving disabled
[JENKINS] Archiving disabled
[JENKINS] Archiving disabled
[JENKINS] Archiving disabled
[JENKINS] Archiving disabled
[JENKINS] Archiving disabled
[JENKINS] Archiving disabled
[JENKINS] Archiving disabled
[JENKINS] Archiving disabled
[JENKINS] Archiving disabled
[JENKINS] Archiving disabled
[JENKINS] Archiving disabled
[JENKINS] Archiving disabled
[JENKINS] Archiving disabled
[JENKINS] Archiving disabled
[JENKINS] Archiving disabled
[JENKINS] Archiving disabled
[JENKINS] Archiving disabled
[JENKINS] Archiving disabled
[JENKINS] Archiving disabled
[JENKINS] Archiving disabled
[JENKINS] Archiving disabled
[JENKINS] Archiving disabled
[JENKINS] Archiving disabled
[JENKINS] Archiving disabled
[JENKINS] Archiving disabled
[JENKINS] Archiving disabled
[JENKINS] Archiving disabled
[JENKINS] Archiving disabled
[JENKINS] Archiving disabled
[JENKINS] Archiving disabled
[JENKINS] Archiving disabled
[JENKINS] Archiving disabled
[JENKINS] Archiving disabled
[JENKINS] Archiving disabled
[JENKINS] Archiving disabled
[JENKINS] Archiving disabled
[JENKINS] Archiving disabled
2017-06-21T00:37:02.839 [INFO] ------------------------------------------------------------------------
2017-06-21T00:37:02.839 [INFO] Reactor Summary:
2017-06-21T00:37:02.839 [INFO] 
2017-06-21T00:37:02.839 [INFO] Apache Beam :: Parent .............................. SUCCESS
[ 46.288 s]
2017-06-21T00:37:02.839 [INFO] Apache Beam :: SDKs :: Java :: Build Tools ......... SUCCESS
[ 11.222 s]
2017-06-21T00:37:02.839 [INFO] Apache Beam :: SDKs ................................ SUCCESS
[  5.508 s]
2017-06-21T00:37:02.839 [INFO] Apache Beam :: SDKs :: Common ...................... SUCCESS
[  1.916 s]
2017-06-21T00:37:02.839 [INFO] Apache Beam :: SDKs :: Common :: Runner API ........ SUCCESS
[ 23.392 s]
2017-06-21T00:37:02.839 [INFO] Apache Beam :: SDKs :: Common :: Fn API ............ SUCCESS
[ 25.162 s]
2017-06-21T00:37:02.839 [INFO] Apache Beam :: SDKs :: Java ........................ SUCCESS
[  1.955 s]
2017-06-21T00:37:02.839 [INFO] Apache Beam :: SDKs :: Java :: Core ................ SUCCESS
[03:03 min]
2017-06-21T00:37:02.839 [INFO] Apache Beam :: Runners ............................. SUCCESS
[  2.189 s]
2017-06-21T00:37:02.840 [INFO] Apache Beam :: Runners :: Core Construction Java ... SUCCESS
[ 42.587 s]
2017-06-21T00:37:02.840 [INFO] Apache Beam :: Runners :: Core Java ................ SUCCESS
[ 59.328 s]
2017-06-21T00:37:02.840 [INFO] Apache Beam :: Runners :: Direct Java .............. SUCCESS
[04:23 min]
2017-06-21T00:37:02.840 [INFO] Apache Beam :: SDKs :: Java :: IO .................. SUCCESS
[  2.432 s]
2017-06-21T00:37:02.840 [INFO] Apache Beam :: SDKs :: Java :: IO :: Common ........ SUCCESS
[  8.070 s]
2017-06-21T00:37:02.840 [INFO] Apache Beam :: SDKs :: Java :: IO :: Cassandra ..... SUCCESS
[ 42.365 s]
2017-06-21T00:37:02.840 [INFO] Apache Beam :: SDKs :: Java :: IO :: Elasticsearch . SUCCESS
[ 50.619 s]
2017-06-21T00:37:02.840 [INFO] Apache Beam :: SDKs :: Java :: Extensions .......... SUCCESS
[  3.856 s]
2017-06-21T00:37:02.840 [INFO] Apache Beam :: SDKs :: Java :: Extensions :: Google Cloud Platform
Core SUCCESS [ 51.422 s]
2017-06-21T00:37:02.840 [INFO] Apache Beam :: SDKs :: Java :: Extensions :: Protobuf SUCCESS
[ 24.833 s]
2017-06-21T00:37:02.840 [INFO] Apache Beam :: SDKs :: Java :: IO :: Google Cloud Platform
SUCCESS [01:38 min]
2017-06-21T00:37:02.840 [INFO] Apache Beam :: SDKs :: Java :: IO :: Hadoop Common . SUCCESS
[ 30.058 s]
2017-06-21T00:37:02.840 [INFO] Apache Beam :: SDKs :: Java :: IO :: Hadoop File System SUCCESS
[ 54.185 s]
2017-06-21T00:37:02.840 [INFO] Apache Beam :: SDKs :: Java :: IO :: Hadoop ........ SUCCESS
[  6.076 s]
2017-06-21T00:37:02.840 [INFO] Apache Beam :: SDKs :: Java :: IO :: Hadoop :: input-format
SUCCESS [ 34.055 s]
2017-06-21T00:37:02.840 [INFO] Apache Beam :: Runners :: Google Cloud Dataflow .... SUCCESS
[06:17 min]
2017-06-21T00:37:02.840 [INFO] Apache Beam :: SDKs :: Java :: IO :: Hadoop :: jdk1.8-tests
FAILURE [ 21.776 s]
2017-06-21T00:37:02.840 [INFO] Apache Beam :: SDKs :: Java :: IO :: HBase ......... SKIPPED
2017-06-21T00:37:02.840 [INFO] Apache Beam :: SDKs :: Java :: IO :: HCatalog ...... SKIPPED
2017-06-21T00:37:02.840 [INFO] Apache Beam :: SDKs :: Java :: IO :: JDBC .......... SKIPPED
2017-06-21T00:37:02.840 [INFO] Apache Beam :: SDKs :: Java :: IO :: JMS ........... SKIPPED
2017-06-21T00:37:02.840 [INFO] Apache Beam :: SDKs :: Java :: IO :: Kafka ......... SKIPPED
2017-06-21T00:37:02.840 [INFO] Apache Beam :: SDKs :: Java :: IO :: Kinesis ....... SKIPPED
2017-06-21T00:37:02.840 [INFO] Apache Beam :: SDKs :: Java :: IO :: MongoDB ....... SKIPPED
2017-06-21T00:37:02.840 [INFO] Apache Beam :: SDKs :: Java :: IO :: MQTT .......... SKIPPED
2017-06-21T00:37:02.840 [INFO] Apache Beam :: SDKs :: Java :: IO :: XML ........... SKIPPED
2017-06-21T00:37:02.840 [INFO] Apache Beam :: SDKs :: Java :: Maven Archetypes .... SKIPPED
2017-06-21T00:37:02.840 [INFO] Apache Beam :: SDKs :: Java :: Maven Archetypes :: Starter
SKIPPED
2017-06-21T00:37:02.840 [INFO] Apache Beam :: Examples ............................ SKIPPED
2017-06-21T00:37:02.840 [INFO] Apache Beam :: Examples :: Java .................... SKIPPED
2017-06-21T00:37:02.840 [INFO] Apache Beam :: SDKs :: Java :: Maven Archetypes :: Examples
SKIPPED
2017-06-21T00:37:02.840 [INFO] Apache Beam :: Examples :: Java 8 .................. SKIPPED
2017-06-21T00:37:02.840 [INFO] Apache Beam :: SDKs :: Java :: Maven Archetypes :: Examples
- Java 8 SKIPPED
2017-06-21T00:37:02.840 [INFO] Apache Beam :: SDKs :: Java :: Extensions :: Jackson SKIPPED
2017-06-21T00:37:02.840 [INFO] Apache Beam :: SDKs :: Java :: Extensions :: Join library SKIPPED
2017-06-21T00:37:02.840 [INFO] Apache Beam :: SDKs :: Java :: Extensions :: Sorter  SKIPPED
2017-06-21T00:37:02.840 [INFO] Apache Beam :: SDKs :: Java :: Harness ............. SKIPPED
2017-06-21T00:37:02.840 [INFO] Apache Beam :: SDKs :: Java :: Java 8 Tests ........ SKIPPED
2017-06-21T00:37:02.840 [INFO] Apache Beam :: SDKs :: Python ...................... SKIPPED
2017-06-21T00:37:02.840 [INFO] Apache Beam :: Runners :: Flink .................... SKIPPED
2017-06-21T00:37:02.840 [INFO] Apache Beam :: Runners :: Spark .................... SKIPPED
2017-06-21T00:37:02.840 [INFO] Apache Beam :: Runners :: Apex ..................... SKIPPED
2017-06-21T00:37:02.840 [INFO] Apache Beam :: SDKs :: Java :: Aggregated Javadoc .. SKIPPED
2017-06-21T00:37:02.840 [INFO] ------------------------------------------------------------------------
2017-06-21T00:37:02.840 [INFO] BUILD FAILURE
2017-06-21T00:37:02.840 [INFO] ------------------------------------------------------------------------
2017-06-21T00:37:02.840 [INFO] Total time: 25:29 min
2017-06-21T00:37:02.841 [INFO] Finished at: 2017-06-21T00:37:02+00:00
2017-06-21T00:37:03.675 [INFO] Final Memory: 184M/1462M
2017-06-21T00:37:03.675 [INFO] ------------------------------------------------------------------------
Waiting for Jenkins to finish collecting data
2017-06-21T00:37:09.375 [ERROR] Failed to execute goal on project beam-sdks-java-io-hadoop-jdk1.8-tests:
Could not resolve dependencies for project org.apache.beam:beam-sdks-java-io-hadoop-jdk1.8-tests:jar:2.1.0-SNAPSHOT:
The following artifacts could not be resolved: org.apache.spark:spark-core_2.10:jar:2.0.0,
org.scala-lang:scala-library:jar:2.10.6: Could not transfer artifact org.apache.spark:spark-core_2.10:jar:2.0.0
from/to central (https://repo.maven.apache.org/maven2): GET request of: org/apache/spark/spark-core_2.10/2.0.0/spark-core_2.10-2.0.0.jar
from central failed: Connection reset -> [Help 1]
org.apache.maven.lifecycle.LifecycleExecutionException: Failed to execute goal on project
beam-sdks-java-io-hadoop-jdk1.8-tests: Could not resolve dependencies for project org.apache.beam:beam-sdks-java-io-hadoop-jdk1.8-tests:jar:2.1.0-SNAPSHOT:
The following artifacts could not be resolved: org.apache.spark:spark-core_2.10:jar:2.0.0,
org.scala-lang:scala-library:jar:2.10.6: Could not transfer artifact org.apache.spark:spark-core_2.10:jar:2.0.0
from/to central (https://repo.maven.apache.org/maven2): GET request of: org/apache/spark/spark-core_2.10/2.0.0/spark-core_2.10-2.0.0.jar
from central failed
	at org.apache.maven.lifecycle.internal.LifecycleDependencyResolver.getDependencies(LifecycleDependencyResolver.java:221)
	at org.apache.maven.lifecycle.internal.LifecycleDependencyResolver.resolveProjectDependencies(LifecycleDependencyResolver.java:127)
	at org.apache.maven.lifecycle.internal.MojoExecutor.ensureDependenciesAreResolved(MojoExecutor.java:257)
	at org.apache.maven.lifecycle.internal.MojoExecutor.execute(MojoExecutor.java:200)
	at org.apache.maven.lifecycle.internal.MojoExecutor.execute(MojoExecutor.java:153)
	at org.apache.maven.lifecycle.internal.MojoExecutor.execute(MojoExecutor.java:145)
	at org.apache.maven.lifecycle.internal.LifecycleModuleBuilder.buildProject(LifecycleModuleBuilder.java:116)
	at org.apache.maven.lifecycle.internal.LifecycleModuleBuilder.buildProject(LifecycleModuleBuilder.java:80)
	at org.apache.maven.lifecycle.internal.builder.singlethreaded.SingleThreadedBuilder.build(SingleThreadedBuilder.java:51)
	at org.apache.maven.lifecycle.internal.LifecycleStarter.execute(LifecycleStarter.java:128)
	at org.apache.maven.DefaultMaven.doExecute(DefaultMaven.java:307)
	at org.apache.maven.DefaultMaven.doExecute(DefaultMaven.java:193)
	at org.apache.maven.DefaultMaven.execute(DefaultMaven.java:106)
	at org.jvnet.hudson.maven3.launcher.Maven33Launcher.main(Maven33Launcher.java:129)
	at sun.reflect.NativeMethodAccessorImpl.invoke0(Native Method)
	at sun.reflect.NativeMethodAccessorImpl.invoke(NativeMethodAccessorImpl.java:62)
	at sun.reflect.DelegatingMethodAccessorImpl.invoke(DelegatingMethodAccessorImpl.java:43)
	at java.lang.reflect.Method.invoke(Method.java:498)
	at org.codehaus.plexus.classworlds.launcher.Launcher.launchStandard(Launcher.java:330)
	at org.codehaus.plexus.classworlds.launcher.Launcher.launch(Launcher.java:238)
	at jenkins.maven3.agent.Maven33Main.launch(Maven33Main.java:176)
	at sun.reflect.NativeMethodAccessorImpl.invoke0(Native Method)
	at sun.reflect.NativeMethodAccessorImpl.invoke(NativeMethodAccessorImpl.java:62)
	at sun.reflect.DelegatingMethodAccessorImpl.invoke(DelegatingMethodAccessorImpl.java:43)
	at java.lang.reflect.Method.invoke(Method.java:498)
	at hudson.maven.Maven3Builder.call(Maven3Builder.java:139)
	at hudson.maven.Maven3Builder.call(Maven3Builder.java:70)
	at hudson.remoting.UserRequest.perform(UserRequest.java:153)
	at hudson.remoting.UserRequest.perform(UserRequest.java:50)
	at hudson.remoting.Request$2.run(Request.java:336)
	at hudson.remoting.InterceptingExecutorService$1.call(InterceptingExecutorService.java:68)
	at java.util.concurrent.FutureTask.run(FutureTask.java:266)
	at java.util.concurrent.ThreadPoolExecutor.runWorker(ThreadPoolExecutor.java:1142)
	at java.util.concurrent.ThreadPoolExecutor$Worker.run(ThreadPoolExecutor.java:617)
	at java.lang.Thread.run(Thread.java:748)
Caused by: org.apache.maven.project.DependencyResolutionException: Could not resolve dependencies
for project org.apache.beam:beam-sdks-java-io-hadoop-jdk1.8-tests:jar:2.1.0-SNAPSHOT: The
following artifacts could not be resolved: org.apache.spark:spark-core_2.10:jar:2.0.0, org.scala-lang:scala-library:jar:2.10.6:
Could not transfer artifact org.apache.spark:spark-core_2.10:jar:2.0.0 from/to central (https://repo.maven.apache.org/maven2):
GET request of: org/apache/spark/spark-core_2.10/2.0.0/spark-core_2.10-2.0.0.jar from central
failed
	at org.apache.maven.project.DefaultProjectDependenciesResolver.resolve(DefaultProjectDependenciesResolver.java:211)
	at org.apache.maven.lifecycle.internal.LifecycleDependencyResolver.getDependencies(LifecycleDependencyResolver.java:195)
	... 34 more
Caused by: org.eclipse.aether.resolution.DependencyResolutionException: The following artifacts
could not be resolved: org.apache.spark:spark-core_2.10:jar:2.0.0, org.scala-lang:scala-library:jar:2.10.6:
Could not transfer artifact org.apache.spark:spark-core_2.10:jar:2.0.0 from/to central (https://repo.maven.apache.org/maven2):
GET request of: org/apache/spark/spark-core_2.10/2.0.0/spark-core_2.10-2.0.0.jar from central
failed
	at org.eclipse.aether.internal.impl.DefaultRepositorySystem.resolveDependencies(DefaultRepositorySystem.java:384)
	at org.apache.maven.project.DefaultProjectDependenciesResolver.resolve(DefaultProjectDependenciesResolver.java:205)
	... 35 more
Caused by: org.eclipse.aether.resolution.ArtifactResolutionException: The following artifacts
could not be resolved: org.apache.spark:spark-core_2.10:jar:2.0.0, org.scala-lang:scala-library:jar:2.10.6:
Could not transfer artifact org.apache.spark:spark-core_2.10:jar:2.0.0 from/to central (https://repo.maven.apache.org/maven2):
GET request of: org/apache/spark/spark-core_2.10/2.0.0/spark-core_2.10-2.0.0.jar from central
failed
	at org.eclipse.aether.internal.impl.DefaultArtifactResolver.resolve(DefaultArtifactResolver.java:444)
	at org.eclipse.aether.internal.impl.DefaultArtifactResolver.resolveArtifacts(DefaultArtifactResolver.java:246)
	at org.eclipse.aether.internal.impl.DefaultRepositorySystem.resolveDependencies(DefaultRepositorySystem.java:367)
	... 36 more
Caused by: org.eclipse.aether.transfer.ArtifactTransferException: Could not transfer artifact
org.apache.spark:spark-core_2.10:jar:2.0.0 from/to central (https://repo.maven.apache.org/maven2):
GET request of: org/apache/spark/spark-core_2.10/2.0.0/spark-core_2.10-2.0.0.jar from central
failed
	at org.eclipse.aether.connector.basic.ArtifactTransportListener.transferFailed(ArtifactTransportListener.java:43)
	at org.eclipse.aether.connector.basic.BasicRepositoryConnector$TaskRunner.run(BasicRepositoryConnector.java:355)
	at org.eclipse.aether.util.concurrency.RunnableErrorForwarder$1.run(RunnableErrorForwarder.java:67)
	... 3 more
Caused by: org.apache.maven.wagon.TransferFailedException: GET request of: org/apache/spark/spark-core_2.10/2.0.0/spark-core_2.10-2.0.0.jar
from central failed
	at org.apache.maven.wagon.AbstractWagon.getTransfer(AbstractWagon.java:363)
	at org.apache.maven.wagon.AbstractWagon.getTransfer(AbstractWagon.java:316)
	at org.apache.maven.wagon.AbstractWagon.getTransfer(AbstractWagon.java:285)
	at org.apache.maven.wagon.StreamWagon.getIfNewer(StreamWagon.java:97)
	at org.apache.maven.wagon.StreamWagon.get(StreamWagon.java:61)
	at org.eclipse.aether.transport.wagon.WagonTransporter$GetTaskRunner.run(WagonTransporter.java:560)
	at org.eclipse.aether.transport.wagon.WagonTransporter.execute(WagonTransporter.java:427)
	at org.eclipse.aether.transport.wagon.WagonTransporter.get(WagonTransporter.java:404)
	at org.eclipse.aether.connector.basic.BasicRepositoryConnector$GetTaskRunner.runTask(BasicRepositoryConnector.java:447)
	at org.eclipse.aether.connector.basic.BasicRepositoryConnector$TaskRunner.run(BasicRepositoryConnector.java:350)
	... 4 more
Caused by: java.net.SocketException: Connection reset
	at java.net.SocketInputStream.read(SocketInputStream.java:210)
	at java.net.SocketInputStream.read(SocketInputStream.java:141)
	at sun.security.ssl.InputRecord.readFully(InputRecord.java:465)
	at sun.security.ssl.InputRecord.readV3Record(InputRecord.java:593)
	at sun.security.ssl.InputRecord.read(InputRecord.java:532)
	at sun.security.ssl.SSLSocketImpl.readRecord(SSLSocketImpl.java:973)
	at sun.security.ssl.SSLSocketImpl.readDataRecord(SSLSocketImpl.java:930)
	at sun.security.ssl.AppInputStream.read(AppInputStream.java:105)
	at org.apache.maven.wagon.providers.http.httpclient.impl.io.SessionInputBufferImpl.streamRead(SessionInputBufferImpl.java:136)
	at org.apache.maven.wagon.providers.http.httpclient.impl.io.SessionInputBufferImpl.read(SessionInputBufferImpl.java:195)
	at org.apache.maven.wagon.providers.http.httpclient.impl.io.ContentLengthInputStream.read(ContentLengthInputStream.java:178)
	at org.apache.maven.wagon.providers.http.httpclient.conn.EofSensorInputStream.read(EofSensorInputStream.java:137)
	at org.apache.maven.wagon.AbstractWagon.transfer(AbstractWagon.java:531)
	at org.apache.maven.wagon.AbstractWagon.getTransfer(AbstractWagon.java:353)
	... 13 more
2017-06-21T00:37:09.378 [ERROR] 
2017-06-21T00:37:09.378 [ERROR] Re-run Maven using the -X switch to enable full debug logging.
2017-06-21T00:37:09.378 [ERROR] 
2017-06-21T00:37:09.378 [ERROR] For more information about the errors and possible solutions,
please read the following articles:
2017-06-21T00:37:09.378 [ERROR] [Help 1] http://cwiki.apache.org/confluence/display/MAVEN/DependencyResolutionException
2017-06-21T00:37:09.378 [ERROR] 
2017-06-21T00:37:09.378 [ERROR] After correcting the problems, you can resume the build with
the command
2017-06-21T00:37:09.378 [ERROR]   mvn <goals> -rf :beam-sdks-java-io-hadoop-jdk1.8-tests
channel stopped

Mime
View raw message