beam-commits mailing list archives

Site index · List index
Message view « Date » · « Thread »
Top « Date » · « Thread »
From Apache Jenkins Server <jenk...@builds.apache.org>
Subject Build failed in Jenkins: beam_PostCommit_Java_JDK_Versions_Test » OpenJDK 7 (on Ubuntu only),beam #58
Date Thu, 08 Jun 2017 01:02:28 GMT
See <https://builds.apache.org/job/beam_PostCommit_Java_JDK_Versions_Test/jdk=OpenJDK%207%20(on%20Ubuntu%20only),label=beam/58/display/redirect?page=changes>

Changes:

[lcwik] [BEAM-2421] Swap to use an Impulse primitive + DoFn for Create when

[iemejia] Shutdown Flink Streaming Pipeline when reaching +Inf watermark

------------------------------------------
[...truncated 1.26 MB...]
2017-06-08\T\01:02:16.940 [INFO] Downloaded: https://repo.maven.apache.org/maven2/com/data-artisans/flakka-slf4j_2.10/2.3-custom/flakka-slf4j_2.10-2.3-custom.pom
(3 KB at 80.6 KB/sec)
2017-06-08\T\01:02:16.942 [INFO] Downloading: https://repo.maven.apache.org/maven2/org/clapper/grizzled-slf4j_2.10/1.0.2/grizzled-slf4j_2.10-1.0.2.pom
2017-06-08\T\01:02:16.971 [INFO] Downloaded: https://repo.maven.apache.org/maven2/org/clapper/grizzled-slf4j_2.10/1.0.2/grizzled-slf4j_2.10-1.0.2.pom
(2 KB at 64.5 KB/sec)
2017-06-08\T\01:02:16.973 [INFO] Downloading: https://repo.maven.apache.org/maven2/org/scala-lang/scala-library/2.10.3/scala-library-2.10.3.pom
2017-06-08\T\01:02:17.002 [INFO] Downloaded: https://repo.maven.apache.org/maven2/org/scala-lang/scala-library/2.10.3/scala-library-2.10.3.pom
(2 KB at 68.8 KB/sec)
2017-06-08\T\01:02:17.014 [INFO] Downloading: https://repo.maven.apache.org/maven2/com/github/scopt/scopt_2.10/3.5.0/scopt_2.10-3.5.0.pom
2017-06-08\T\01:02:17.042 [INFO] Downloaded: https://repo.maven.apache.org/maven2/com/github/scopt/scopt_2.10/3.5.0/scopt_2.10-3.5.0.pom
(2 KB at 58.4 KB/sec)
2017-06-08\T\01:02:17.044 [INFO] Downloading: https://repo.maven.apache.org/maven2/com/twitter/chill_2.10/0.7.4/chill_2.10-0.7.4.pom
2017-06-08\T\01:02:17.082 [INFO] Downloaded: https://repo.maven.apache.org/maven2/com/twitter/chill_2.10/0.7.4/chill_2.10-0.7.4.pom
(3 KB at 61.0 KB/sec)
2017-06-08\T\01:02:17.084 [INFO] Downloading: https://repo.maven.apache.org/maven2/org/scala-lang/scala-library/2.10.5/scala-library-2.10.5.pom
2017-06-08\T\01:02:17.115 [INFO] Downloaded: https://repo.maven.apache.org/maven2/org/scala-lang/scala-library/2.10.5/scala-library-2.10.5.pom
(2 KB at 64.4 KB/sec)
2017-06-08\T\01:02:17.117 [INFO] Downloading: https://repo.maven.apache.org/maven2/com/twitter/chill-java/0.7.4/chill-java-0.7.4.pom
2017-06-08\T\01:02:17.167 [INFO] Downloaded: https://repo.maven.apache.org/maven2/com/twitter/chill-java/0.7.4/chill-java-0.7.4.pom
(2 KB at 39.7 KB/sec)
2017-06-08\T\01:02:17.170 [INFO] Downloading: https://repo.maven.apache.org/maven2/org/apache/flink/flink-optimizer_2.10/1.3.0/flink-optimizer_2.10-1.3.0.pom
2017-06-08\T\01:02:17.198 [INFO] Downloaded: https://repo.maven.apache.org/maven2/org/apache/flink/flink-optimizer_2.10/1.3.0/flink-optimizer_2.10-1.3.0.pom
(5 KB at 145.4 KB/sec)
2017-06-08\T\01:02:17.205 [INFO] Downloading: https://repo.maven.apache.org/maven2/org/apache/flink/flink-streaming-java_2.10/1.3.0/flink-streaming-java_2.10-1.3.0.pom
2017-06-08\T\01:02:17.236 [INFO] Downloaded: https://repo.maven.apache.org/maven2/org/apache/flink/flink-streaming-java_2.10/1.3.0/flink-streaming-java_2.10-1.3.0.pom
(7 KB at 194.5 KB/sec)
2017-06-08\T\01:02:17.243 [INFO] Downloading: https://repo.maven.apache.org/maven2/org/apache/sling/org.apache.sling.commons.json/2.0.6/org.apache.sling.commons.json-2.0.6.pom
2017-06-08\T\01:02:17.274 [INFO] Downloaded: https://repo.maven.apache.org/maven2/org/apache/sling/org.apache.sling.commons.json/2.0.6/org.apache.sling.commons.json-2.0.6.pom
(4 KB at 102.1 KB/sec)
2017-06-08\T\01:02:17.276 [INFO] Downloading: https://repo.maven.apache.org/maven2/org/apache/sling/sling/10/sling-10.pom
2017-06-08\T\01:02:17.308 [INFO] Downloaded: https://repo.maven.apache.org/maven2/org/apache/sling/sling/10/sling-10.pom
(26 KB at 783.3 KB/sec)
2017-06-08\T\01:02:17.310 [INFO] Downloading: https://repo.maven.apache.org/maven2/org/apache/apache/8/apache-8.pom
2017-06-08\T\01:02:17.338 [INFO] Downloaded: https://repo.maven.apache.org/maven2/org/apache/apache/8/apache-8.pom
(14 KB at 490.2 KB/sec)
2017-06-08\T\01:02:17.351 [INFO] Downloading: https://repo.maven.apache.org/maven2/org/apache/flink/flink-test-utils_2.10/1.3.0/flink-test-utils_2.10-1.3.0.pom
2017-06-08\T\01:02:17.380 [INFO] Downloaded: https://repo.maven.apache.org/maven2/org/apache/flink/flink-test-utils_2.10/1.3.0/flink-test-utils_2.10-1.3.0.pom
(5 KB at 159.7 KB/sec)
2017-06-08\T\01:02:17.382 [INFO] Downloading: https://repo.maven.apache.org/maven2/org/apache/flink/flink-test-utils-parent/1.3.0/flink-test-utils-parent-1.3.0.pom
2017-06-08\T\01:02:17.413 [INFO] Downloaded: https://repo.maven.apache.org/maven2/org/apache/flink/flink-test-utils-parent/1.3.0/flink-test-utils-parent-1.3.0.pom
(2 KB at 45.4 KB/sec)
2017-06-08\T\01:02:17.417 [INFO] Downloading: https://repo.maven.apache.org/maven2/org/apache/flink/flink-test-utils-junit/1.3.0/flink-test-utils-junit-1.3.0.pom
2017-06-08\T\01:02:17.447 [INFO] Downloaded: https://repo.maven.apache.org/maven2/org/apache/flink/flink-test-utils-junit/1.3.0/flink-test-utils-junit-1.3.0.pom
(4 KB at 107.0 KB/sec)
2017-06-08\T\01:02:17.454 [INFO] Downloading: https://repo.maven.apache.org/maven2/org/apache/curator/curator-test/2.12.0/curator-test-2.12.0.pom
2017-06-08\T\01:02:17.483 [INFO] Downloaded: https://repo.maven.apache.org/maven2/org/apache/curator/curator-test/2.12.0/curator-test-2.12.0.pom
(5 KB at 139.6 KB/sec)
2017-06-08\T\01:02:17.485 [INFO] Downloading: https://repo.maven.apache.org/maven2/org/apache/curator/apache-curator/2.12.0/apache-curator-2.12.0.pom
2017-06-08\T\01:02:17.514 [INFO] Downloaded: https://repo.maven.apache.org/maven2/org/apache/curator/apache-curator/2.12.0/apache-curator-2.12.0.pom
(32 KB at 1088.7 KB/sec)
2017-06-08\T\01:02:17.519 [INFO] Downloading: https://repo.maven.apache.org/maven2/org/apache/zookeeper/zookeeper/3.4.8/zookeeper-3.4.8.pom
2017-06-08\T\01:02:17.547 [INFO] Downloaded: https://repo.maven.apache.org/maven2/org/apache/zookeeper/zookeeper/3.4.8/zookeeper-3.4.8.pom
(4 KB at 140.4 KB/sec)
2017-06-08\T\01:02:17.550 [INFO] Downloading: https://repo.maven.apache.org/maven2/org/javassist/javassist/3.18.1-GA/javassist-3.18.1-GA.pom
2017-06-08\T\01:02:17.579 [INFO] Downloaded: https://repo.maven.apache.org/maven2/org/javassist/javassist/3.18.1-GA/javassist-3.18.1-GA.pom
(10 KB at 320.6 KB/sec)
2017-06-08\T\01:02:17.607 [INFO] Downloading: https://repo.maven.apache.org/maven2/org/apache/flink/flink-clients_2.10/1.3.0/flink-clients_2.10-1.3.0.jar
2017-06-08\T\01:02:17.608 [INFO] Downloading: https://repo.maven.apache.org/maven2/org/apache/flink/flink-optimizer_2.10/1.3.0/flink-optimizer_2.10-1.3.0.jar
2017-06-08\T\01:02:17.609 [INFO] Downloading: https://repo.maven.apache.org/maven2/org/apache/flink/force-shading/1.3.0/force-shading-1.3.0.jar
2017-06-08\T\01:02:17.609 [INFO] Downloading: https://repo.maven.apache.org/maven2/org/apache/flink/flink-core/1.3.0/flink-core-1.3.0.jar
2017-06-08\T\01:02:17.610 [INFO] Downloading: https://repo.maven.apache.org/maven2/org/apache/flink/flink-annotations/1.3.0/flink-annotations-1.3.0.jar
2017-06-08\T\01:02:17.639 [INFO] Downloaded: https://repo.maven.apache.org/maven2/org/apache/flink/force-shading/1.3.0/force-shading-1.3.0.jar
(8 KB at 229.4 KB/sec)
2017-06-08\T\01:02:17.639 [INFO] Downloading: https://repo.maven.apache.org/maven2/com/esotericsoftware/kryo/kryo/2.24.0/kryo-2.24.0.jar
2017-06-08\T\01:02:17.644 [INFO] Downloaded: https://repo.maven.apache.org/maven2/org/apache/flink/flink-clients_2.10/1.3.0/flink-clients_2.10-1.3.0.jar
(89 KB at 2397.5 KB/sec)
2017-06-08\T\01:02:17.644 [INFO] Downloading: https://repo.maven.apache.org/maven2/org/objenesis/objenesis/2.1/objenesis-2.1.jar
2017-06-08\T\01:02:17.649 [INFO] Downloaded: https://repo.maven.apache.org/maven2/org/apache/flink/flink-annotations/1.3.0/flink-annotations-1.3.0.jar
(8 KB at 180.3 KB/sec)
2017-06-08\T\01:02:17.649 [INFO] Downloading: https://repo.maven.apache.org/maven2/org/apache/flink/flink-metrics-core/1.3.0/flink-metrics-core-1.3.0.jar
2017-06-08\T\01:02:17.679 [INFO] Downloaded: https://repo.maven.apache.org/maven2/org/apache/flink/flink-metrics-core/1.3.0/flink-metrics-core-1.3.0.jar
(16 KB at 223.1 KB/sec)
2017-06-08\T\01:02:17.679 [INFO] Downloading: https://repo.maven.apache.org/maven2/org/apache/flink/flink-java/1.3.0/flink-java-1.3.0.jar
2017-06-08\T\01:02:17.684 [INFO] Downloaded: https://repo.maven.apache.org/maven2/org/objenesis/objenesis/2.1/objenesis-2.1.jar
(41 KB at 543.7 KB/sec)
2017-06-08\T\01:02:17.684 [INFO] Downloading: https://repo.maven.apache.org/maven2/org/apache/flink/flink-shaded-hadoop2/1.3.0/flink-shaded-hadoop2-1.3.0.jar
2017-06-08\T\01:02:17.708 [INFO] Downloaded: https://repo.maven.apache.org/maven2/com/esotericsoftware/kryo/kryo/2.24.0/kryo-2.24.0.jar
(332 KB at 3346.8 KB/sec)
2017-06-08\T\01:02:17.708 [INFO] Downloading: https://repo.maven.apache.org/maven2/commons-configuration/commons-configuration/1.7/commons-configuration-1.7.jar
2017-06-08\T\01:02:17.764 [INFO] Downloaded: https://repo.maven.apache.org/maven2/org/apache/flink/flink-core/1.3.0/flink-core-1.3.0.jar
(1362 KB at 8783.9 KB/sec)
2017-06-08\T\01:02:17.764 [INFO] Downloading: https://repo.maven.apache.org/maven2/commons-digester/commons-digester/1.8.1/commons-digester-1.8.1.jar
2017-06-08\T\01:02:17.776 [INFO] Downloaded: https://repo.maven.apache.org/maven2/commons-configuration/commons-configuration/1.7/commons-configuration-1.7.jar
(343 KB at 2061.0 KB/sec)
2017-06-08\T\01:02:17.776 [INFO] Downloading: https://repo.maven.apache.org/maven2/commons-beanutils/commons-beanutils-bean-collections/1.8.3/commons-beanutils-bean-collections-1.8.3.jar
2017-06-08\T\01:02:17.799 [INFO] Downloaded: https://repo.maven.apache.org/maven2/org/apache/flink/flink-java/1.3.0/flink-java-1.3.0.jar
(752 KB at 3999.4 KB/sec)
2017-06-08\T\01:02:17.799 [INFO] Downloading: https://repo.maven.apache.org/maven2/org/apache/commons/commons-math3/3.5/commons-math3-3.5.jar
2017-06-08\T\01:02:17.808 [INFO] Downloaded: https://repo.maven.apache.org/maven2/commons-beanutils/commons-beanutils-bean-collections/1.8.3/commons-beanutils-bean-collections-1.8.3.jar
(26 KB at 131.1 KB/sec)
2017-06-08\T\01:02:17.808 [INFO] Downloading: https://repo.maven.apache.org/maven2/org/apache/flink/flink-runtime_2.10/1.3.0/flink-runtime_2.10-1.3.0.jar
2017-06-08\T\01:02:17.808 [INFO] Downloaded: https://repo.maven.apache.org/maven2/commons-digester/commons-digester/1.8.1/commons-digester-1.8.1.jar
(143 KB at 720.6 KB/sec)
2017-06-08\T\01:02:17.809 [INFO] Downloading: https://repo.maven.apache.org/maven2/io/netty/netty-all/4.0.27.Final/netty-all-4.0.27.Final.jar
2017-06-08\T\01:02:17.836 [INFO] Downloaded: https://repo.maven.apache.org/maven2/org/apache/flink/flink-optimizer_2.10/1.3.0/flink-optimizer_2.10-1.3.0.jar
(2679 KB at 11698.4 KB/sec)
2017-06-08\T\01:02:17.839 [INFO] Downloading: https://repo.maven.apache.org/maven2/org/javassist/javassist/3.18.2-GA/javassist-3.18.2-GA.jar
2017-06-08\T\01:02:17.981 [INFO] Downloaded: https://repo.maven.apache.org/maven2/org/javassist/javassist/3.18.2-GA/javassist-3.18.2-GA.jar
(698 KB at 1880.8 KB/sec)
2017-06-08\T\01:02:17.981 [INFO] Downloading: https://repo.maven.apache.org/maven2/org/scala-lang/scala-library/2.10.4/scala-library-2.10.4.jar
2017-06-08\T\01:02:18.095 [INFO] Downloaded: https://repo.maven.apache.org/maven2/org/apache/commons/commons-math3/3.5/commons-math3-3.5.jar
(1991 KB at 4104.6 KB/sec)
2017-06-08\T\01:02:18.095 [INFO] Downloading: https://repo.maven.apache.org/maven2/com/data-artisans/flakka-actor_2.10/2.3-custom/flakka-actor_2.10-2.3-custom.jar
2017-06-08\T\01:02:18.124 [INFO] Downloaded: https://repo.maven.apache.org/maven2/io/netty/netty-all/4.0.27.Final/netty-all-4.0.27.Final.jar
(1894 KB at 3684.8 KB/sec)
2017-06-08\T\01:02:18.124 [INFO] Downloading: https://repo.maven.apache.org/maven2/com/typesafe/config/1.2.1/config-1.2.1.jar
2017-06-08\T\01:02:18.195 [INFO] Downloaded: https://repo.maven.apache.org/maven2/com/typesafe/config/1.2.1/config-1.2.1.jar
(215 KB at 366.5 KB/sec)
2017-06-08\T\01:02:18.195 [INFO] Downloading: https://repo.maven.apache.org/maven2/com/data-artisans/flakka-remote_2.10/2.3-custom/flakka-remote_2.10-2.3-custom.jar
2017-06-08\T\01:02:18.431 [INFO] Downloaded: https://repo.maven.apache.org/maven2/com/data-artisans/flakka-remote_2.10/2.3-custom/flakka-remote_2.10-2.3-custom.jar
(1347 KB at 1640.6 KB/sec)
2017-06-08\T\01:02:18.431 [INFO] Downloading: https://repo.maven.apache.org/maven2/io/netty/netty/3.8.0.Final/netty-3.8.0.Final.jar
2017-06-08\T\01:02:18.506 [INFO] Downloaded: https://repo.maven.apache.org/maven2/com/data-artisans/flakka-actor_2.10/2.3-custom/flakka-actor_2.10-2.3-custom.jar
(2754 KB at 3073.0 KB/sec)
2017-06-08\T\01:02:18.506 [INFO] Downloading: https://repo.maven.apache.org/maven2/org/uncommons/maths/uncommons-maths/1.2.2a/uncommons-maths-1.2.2a.jar
2017-06-08\T\01:02:18.536 [INFO] Downloaded: https://repo.maven.apache.org/maven2/org/uncommons/maths/uncommons-maths/1.2.2a/uncommons-maths-1.2.2a.jar
(48 KB at 51.7 KB/sec)
2017-06-08\T\01:02:18.536 [INFO] Downloading: https://repo.maven.apache.org/maven2/com/data-artisans/flakka-slf4j_2.10/2.3-custom/flakka-slf4j_2.10-2.3-custom.jar
2017-06-08\T\01:02:18.568 [INFO] Downloaded: https://repo.maven.apache.org/maven2/com/data-artisans/flakka-slf4j_2.10/2.3-custom/flakka-slf4j_2.10-2.3-custom.jar
(16 KB at 15.8 KB/sec)
2017-06-08\T\01:02:18.568 [INFO] Downloading: https://repo.maven.apache.org/maven2/org/clapper/grizzled-slf4j_2.10/1.0.2/grizzled-slf4j_2.10-1.0.2.jar
2017-06-08\T\01:02:18.579 [INFO] Downloaded: https://repo.maven.apache.org/maven2/io/netty/netty/3.8.0.Final/netty-3.8.0.Final.jar
(1202 KB at 1239.8 KB/sec)
2017-06-08\T\01:02:18.579 [INFO] Downloading: https://repo.maven.apache.org/maven2/com/github/scopt/scopt_2.10/3.5.0/scopt_2.10-3.5.0.jar
2017-06-08\T\01:02:18.601 [INFO] Downloaded: https://repo.maven.apache.org/maven2/org/clapper/grizzled-slf4j_2.10/1.0.2/grizzled-slf4j_2.10-1.0.2.jar
(7 KB at 6.3 KB/sec)
2017-06-08\T\01:02:18.601 [INFO] Downloading: https://repo.maven.apache.org/maven2/jline/jline/0.9.94/jline-0.9.94.jar
2017-06-08\T\01:02:18.634 [INFO] Downloaded: https://repo.maven.apache.org/maven2/com/github/scopt/scopt_2.10/3.5.0/scopt_2.10-3.5.0.jar
(140 KB at 136.4 KB/sec)
2017-06-08\T\01:02:18.634 [INFO] Downloading: https://repo.maven.apache.org/maven2/com/twitter/chill_2.10/0.7.4/chill_2.10-0.7.4.jar
2017-06-08\T\01:02:18.635 [INFO] Downloaded: https://repo.maven.apache.org/maven2/jline/jline/0.9.94/jline-0.9.94.jar
(86 KB at 83.2 KB/sec)
2017-06-08\T\01:02:18.635 [INFO] Downloading: https://repo.maven.apache.org/maven2/com/twitter/chill-java/0.7.4/chill-java-0.7.4.jar
2017-06-08\T\01:02:18.664 [INFO] Downloaded: https://repo.maven.apache.org/maven2/com/twitter/chill-java/0.7.4/chill-java-0.7.4.jar
(50 KB at 46.7 KB/sec)
2017-06-08\T\01:02:18.665 [INFO] Downloading: https://repo.maven.apache.org/maven2/org/apache/flink/flink-streaming-java_2.10/1.3.0/flink-streaming-java_2.10-1.3.0.jar
2017-06-08\T\01:02:18.665 [INFO] Downloaded: https://repo.maven.apache.org/maven2/org/apache/flink/flink-runtime_2.10/1.3.0/flink-runtime_2.10-1.3.0.jar
(9005 KB at 8534.7 KB/sec)
2017-06-08\T\01:02:18.666 [INFO] Downloading: https://repo.maven.apache.org/maven2/org/apache/sling/org.apache.sling.commons.json/2.0.6/org.apache.sling.commons.json-2.0.6.jar
2017-06-08\T\01:02:18.674 [INFO] Downloaded: https://repo.maven.apache.org/maven2/com/twitter/chill_2.10/0.7.4/chill_2.10-0.7.4.jar
(217 KB at 203.1 KB/sec)
2017-06-08\T\01:02:18.674 [INFO] Downloading: https://repo.maven.apache.org/maven2/org/apache/flink/flink-core/1.3.0/flink-core-1.3.0-tests.jar
2017-06-08\T\01:02:18.697 [INFO] Downloaded: https://repo.maven.apache.org/maven2/org/apache/sling/org.apache.sling.commons.json/2.0.6/org.apache.sling.commons.json-2.0.6.jar
(47 KB at 43.0 KB/sec)
2017-06-08\T\01:02:18.697 [INFO] Downloading: https://repo.maven.apache.org/maven2/org/apache/flink/flink-runtime_2.10/1.3.0/flink-runtime_2.10-1.3.0-tests.jar
2017-06-08\T\01:02:18.783 [INFO] Downloaded: https://repo.maven.apache.org/maven2/org/apache/flink/flink-core/1.3.0/flink-core-1.3.0-tests.jar
(753 KB at 641.2 KB/sec)
2017-06-08\T\01:02:18.783 [INFO] Downloading: https://repo.maven.apache.org/maven2/org/apache/flink/flink-streaming-java_2.10/1.3.0/flink-streaming-java_2.10-1.3.0-tests.jar
2017-06-08\T\01:02:18.836 [INFO] Downloaded: https://repo.maven.apache.org/maven2/org/scala-lang/scala-library/2.10.4/scala-library-2.10.4.jar
(6960 KB at 5676.5 KB/sec)
2017-06-08\T\01:02:18.836 [INFO] Downloading: https://repo.maven.apache.org/maven2/org/apache/flink/flink-test-utils_2.10/1.3.0/flink-test-utils_2.10-1.3.0.jar
2017-06-08\T\01:02:18.908 [INFO] Downloaded: https://repo.maven.apache.org/maven2/org/apache/flink/flink-streaming-java_2.10/1.3.0/flink-streaming-java_2.10-1.3.0-tests.jar
(1133 KB at 872.7 KB/sec)
2017-06-08\T\01:02:18.908 [INFO] Downloading: https://repo.maven.apache.org/maven2/org/apache/flink/flink-test-utils-junit/1.3.0/flink-test-utils-junit-1.3.0.jar
2017-06-08\T\01:02:18.938 [INFO] Downloaded: https://repo.maven.apache.org/maven2/org/apache/flink/flink-test-utils-junit/1.3.0/flink-test-utils-junit-1.3.0.jar
(26 KB at 19.1 KB/sec)
2017-06-08\T\01:02:18.938 [INFO] Downloading: https://repo.maven.apache.org/maven2/org/apache/curator/curator-test/2.12.0/curator-test-2.12.0.jar
2017-06-08\T\01:02:19.047 [INFO] Downloaded: https://repo.maven.apache.org/maven2/org/apache/flink/flink-runtime_2.10/1.3.0/flink-runtime_2.10-1.3.0-tests.jar
(2841 KB at 1976.7 KB/sec)
2017-06-08\T\01:02:19.101 [INFO] Downloaded: https://repo.maven.apache.org/maven2/org/apache/flink/flink-streaming-java_2.10/1.3.0/flink-streaming-java_2.10-1.3.0.jar
(3128 KB at 2097.5 KB/sec)
2017-06-08\T\01:02:19.146 [INFO] Downloaded: https://repo.maven.apache.org/maven2/org/apache/flink/flink-shaded-hadoop2/1.3.0/flink-shaded-hadoop2-1.3.0.jar
(16586 KB at 10797.7 KB/sec)
2017-06-08\T\01:02:19.183 [INFO] Downloaded: https://repo.maven.apache.org/maven2/org/apache/flink/flink-test-utils_2.10/1.3.0/flink-test-utils_2.10-1.3.0.jar
(2365 KB at 1503.1 KB/sec)
2017-06-08\T\01:02:19.224 [INFO] Downloaded: https://repo.maven.apache.org/maven2/org/apache/curator/curator-test/2.12.0/curator-test-2.12.0.jar
(2368 KB at 1466.9 KB/sec)
2017-06-08\T\01:02:19.238 [INFO] 
2017-06-08\T\01:02:19.238 [INFO] --- maven-clean-plugin:3.0.0:clean (default-clean) @ beam-runners-flink_2.10
---
2017-06-08\T\01:02:19.241 [INFO] Deleting <https://builds.apache.org/job/beam_PostCommit_Java_JDK_Versions_Test/jdk=OpenJDK%207%20(on%20Ubuntu%20only),label=beam/ws/runners/flink>
(includes = [**/*.pyc, **/*.egg-info/, **/sdks/python/LICENSE, **/sdks/python/NOTICE, **/sdks/python/README.md],
excludes = [])
2017-06-08\T\01:02:19.246 [INFO] 
2017-06-08\T\01:02:19.246 [INFO] --- maven-enforcer-plugin:1.4.1:enforce (enforce) @ beam-runners-flink_2.10
---
2017-06-08\T\01:02:21.593 [INFO] 
2017-06-08\T\01:02:21.593 [INFO] --- maven-enforcer-plugin:1.4.1:enforce (enforce-banned-dependencies)
@ beam-runners-flink_2.10 ---
2017-06-08\T\01:02:21.619 [INFO] 
2017-06-08\T\01:02:21.619 [INFO] --- maven-remote-resources-plugin:1.5:process (process-resource-bundles)
@ beam-runners-flink_2.10 ---
2017-06-08\T\01:02:23.002 [INFO] 
2017-06-08\T\01:02:23.003 [INFO] --- maven-resources-plugin:3.0.2:resources (default-resources)
@ beam-runners-flink_2.10 ---
2017-06-08\T\01:02:23.005 [INFO] Using 'UTF-8' encoding to copy filtered resources.
2017-06-08\T\01:02:23.005 [INFO] Copying 1 resource
2017-06-08\T\01:02:23.026 [INFO] Copying 3 resources
2017-06-08\T\01:02:23.027 [INFO] 
2017-06-08\T\01:02:23.027 [INFO] --- maven-compiler-plugin:3.6.1:compile (default-compile)
@ beam-runners-flink_2.10 ---
2017-06-08\T\01:02:23.049 [INFO] Changes detected - recompiling the module!
2017-06-08\T\01:02:23.049 [INFO] Compiling 65 source files to <https://builds.apache.org/job/beam_PostCommit_Java_JDK_Versions_Test/jdk=OpenJDK%207%20(on%20Ubuntu%20only),label=beam/ws/runners/flink/target/classes>
2017-06-08\T\01:02:24.698 [INFO] <https://builds.apache.org/job/beam_PostCommit_Java_JDK_Versions_Test/jdk=OpenJDK%207%20(on%20Ubuntu%20only),label=beam/ws/runners/flink/src/main/java/org/apache/beam/runners/flink/translation/wrappers/streaming/io/DedupingOperator.java>:
Some input files use or override a deprecated API.
2017-06-08\T\01:02:24.698 [INFO] <https://builds.apache.org/job/beam_PostCommit_Java_JDK_Versions_Test/jdk=OpenJDK%207%20(on%20Ubuntu%20only),label=beam/ws/runners/flink/src/main/java/org/apache/beam/runners/flink/translation/wrappers/streaming/io/DedupingOperator.java>:
Recompile with -Xlint:deprecation for details.
2017-06-08\T\01:02:24.698 [INFO] <https://builds.apache.org/job/beam_PostCommit_Java_JDK_Versions_Test/jdk=OpenJDK%207%20(on%20Ubuntu%20only),label=beam/ws/runners/flink/src/main/java/org/apache/beam/runners/flink/translation/wrappers/streaming/io/UnboundedSocketSource.java>:
Some input files use unchecked or unsafe operations.
2017-06-08\T\01:02:24.698 [INFO] <https://builds.apache.org/job/beam_PostCommit_Java_JDK_Versions_Test/jdk=OpenJDK%207%20(on%20Ubuntu%20only),label=beam/ws/runners/flink/src/main/java/org/apache/beam/runners/flink/translation/wrappers/streaming/io/UnboundedSocketSource.java>:
Recompile with -Xlint:unchecked for details.
2017-06-08\T\01:02:24.699 [INFO] -------------------------------------------------------------
2017-06-08\T\01:02:24.699 [ERROR] COMPILATION ERROR : 
2017-06-08\T\01:02:24.699 [INFO] -------------------------------------------------------------
2017-06-08\T\01:02:24.699 [ERROR] <https://builds.apache.org/job/beam_PostCommit_Java_JDK_Versions_Test/jdk=OpenJDK%207%20(on%20Ubuntu%20only),label=beam/ws/runners/flink/src/main/java/org/apache/beam/runners/flink/FlinkStreamingTransformTranslators.java>:[366,27]
method put in interface java.util.Map<K,V> cannot be applied to given types;
  required: org.apache.beam.sdk.values.TupleTag<?>,org.apache.flink.util.OutputTag<org.apache.beam.sdk.util.WindowedValue<?>>
  found: org.apache.beam.sdk.values.TupleTag<capture#1 of ?>,org.apache.flink.util.OutputTag<java.lang.Object>
  reason: actual argument org.apache.flink.util.OutputTag<java.lang.Object> cannot be
converted to org.apache.flink.util.OutputTag<org.apache.beam.sdk.util.WindowedValue<?>>
by method invocation conversion
2017-06-08\T\01:02:24.699 [INFO] 1 error
2017-06-08\T\01:02:24.699 [INFO] -------------------------------------------------------------
2017-06-08\T\01:02:24.700 [INFO] ------------------------------------------------------------------------
2017-06-08\T\01:02:24.700 [INFO] Reactor Summary:
2017-06-08\T\01:02:24.701 [INFO] 
2017-06-08\T\01:02:24.701 [INFO] Apache Beam :: Parent .............................. SUCCESS
[ 18.720 s]
2017-06-08\T\01:02:24.701 [INFO] Apache Beam :: SDKs :: Java :: Build Tools ......... SUCCESS
[  5.211 s]
2017-06-08\T\01:02:24.701 [INFO] Apache Beam :: SDKs ................................ SUCCESS
[  0.443 s]
2017-06-08\T\01:02:24.701 [INFO] Apache Beam :: SDKs :: Common ...................... SUCCESS
[  1.258 s]
2017-06-08\T\01:02:24.701 [INFO] Apache Beam :: SDKs :: Common :: Runner API ........ SUCCESS
[  8.830 s]
2017-06-08\T\01:02:24.701 [INFO] Apache Beam :: SDKs :: Common :: Fn API ............ SUCCESS
[  6.031 s]
2017-06-08\T\01:02:24.702 [INFO] Apache Beam :: SDKs :: Java ........................ SUCCESS
[  0.415 s]
2017-06-08\T\01:02:24.702 [INFO] Apache Beam :: SDKs :: Java :: Core ................ SUCCESS
[01:17 min]
2017-06-08\T\01:02:24.702 [INFO] Apache Beam :: Runners ............................. SUCCESS
[  0.390 s]
2017-06-08\T\01:02:24.702 [INFO] Apache Beam :: Runners :: Core Construction Java ... SUCCESS
[ 11.853 s]
2017-06-08\T\01:02:24.702 [INFO] Apache Beam :: Runners :: Core Java ................ SUCCESS
[ 26.023 s]
2017-06-08\T\01:02:24.702 [INFO] Apache Beam :: Runners :: Direct Java .............. SUCCESS
[02:46 min]
2017-06-08\T\01:02:24.702 [INFO] Apache Beam :: SDKs :: Java :: IO .................. SUCCESS
[  0.477 s]
2017-06-08\T\01:02:24.703 [INFO] Apache Beam :: SDKs :: Java :: IO :: Common ........ SUCCESS
[  3.852 s]
2017-06-08\T\01:02:24.703 [INFO] Apache Beam :: SDKs :: Java :: IO :: Cassandra ..... SUCCESS
[ 19.758 s]
2017-06-08\T\01:02:24.703 [INFO] Apache Beam :: SDKs :: Java :: IO :: Elasticsearch . SUCCESS
[ 30.376 s]
2017-06-08\T\01:02:24.703 [INFO] Apache Beam :: SDKs :: Java :: Extensions .......... SUCCESS
[  0.452 s]
2017-06-08\T\01:02:24.703 [INFO] Apache Beam :: SDKs :: Java :: Extensions :: Google Cloud
Platform Core SUCCESS [ 27.516 s]
2017-06-08\T\01:02:24.703 [INFO] Apache Beam :: SDKs :: Java :: Extensions :: Protobuf SUCCESS
[  8.346 s]
2017-06-08\T\01:02:24.703 [INFO] Apache Beam :: SDKs :: Java :: IO :: Google Cloud Platform
SUCCESS [ 53.829 s]
2017-06-08\T\01:02:24.703 [INFO] Apache Beam :: SDKs :: Java :: IO :: Hadoop Common . SUCCESS
[ 11.752 s]
2017-06-08\T\01:02:24.704 [INFO] Apache Beam :: SDKs :: Java :: IO :: Hadoop File System SUCCESS
[ 26.468 s]
2017-06-08\T\01:02:24.704 [INFO] Apache Beam :: SDKs :: Java :: IO :: Hadoop ........ SUCCESS
[  2.730 s]
2017-06-08\T\01:02:24.704 [INFO] Apache Beam :: SDKs :: Java :: IO :: Hadoop :: input-format
SUCCESS [  9.969 s]
2017-06-08\T\01:02:24.704 [INFO] Apache Beam :: SDKs :: Java :: IO :: HBase ......... SUCCESS
[ 51.487 s]
2017-06-08\T\01:02:24.704 [INFO] Apache Beam :: Runners :: Google Cloud Dataflow .... SUCCESS
[05:55 min]
2017-06-08\T\01:02:24.704 [INFO] Apache Beam :: SDKs :: Java :: IO :: JDBC .......... SUCCESS
[ 17.187 s]
2017-06-08\T\01:02:24.704 [INFO] Apache Beam :: SDKs :: Java :: IO :: JMS ........... SUCCESS
[  9.874 s]
2017-06-08\T\01:02:24.705 [INFO] Apache Beam :: SDKs :: Java :: IO :: Kafka ......... SUCCESS
[ 24.307 s]
2017-06-08\T\01:02:24.705 [INFO] Apache Beam :: SDKs :: Java :: IO :: Kinesis ....... SUCCESS
[ 11.181 s]
2017-06-08\T\01:02:24.705 [INFO] Apache Beam :: SDKs :: Java :: IO :: MongoDB ....... SUCCESS
[ 20.778 s]
2017-06-08\T\01:02:24.705 [INFO] Apache Beam :: SDKs :: Java :: IO :: MQTT .......... SUCCESS
[ 10.001 s]
2017-06-08\T\01:02:24.705 [INFO] Apache Beam :: SDKs :: Java :: IO :: XML ........... SUCCESS
[ 13.943 s]
2017-06-08\T\01:02:24.705 [INFO] Apache Beam :: SDKs :: Java :: Maven Archetypes .... SUCCESS
[  0.423 s]
2017-06-08\T\01:02:24.705 [INFO] Apache Beam :: SDKs :: Java :: Maven Archetypes :: Starter
SUCCESS [ 11.972 s]
2017-06-08\T\01:02:24.705 [INFO] Apache Beam :: Examples ............................ SUCCESS
[  0.510 s]
2017-06-08\T\01:02:24.706 [INFO] Apache Beam :: Examples :: Java .................... SUCCESS
[08:33 min]
2017-06-08\T\01:02:24.706 [INFO] Apache Beam :: SDKs :: Java :: Maven Archetypes :: Examples
SUCCESS [ 43.817 s]
2017-06-08\T\01:02:24.706 [INFO] Apache Beam :: SDKs :: Java :: Extensions :: Jackson SUCCESS
[ 11.742 s]
2017-06-08\T\01:02:24.706 [INFO] Apache Beam :: SDKs :: Java :: Extensions :: Join library
SUCCESS [ 15.594 s]
2017-06-08\T\01:02:24.706 [INFO] Apache Beam :: SDKs :: Java :: Extensions :: Sorter  SUCCESS
[ 36.013 s]
2017-06-08\T\01:02:24.706 [INFO] Apache Beam :: Runners :: Flink .................... FAILURE
[  8.979 s]
2017-06-08\T\01:02:24.706 [INFO] Apache Beam :: Runners :: Spark .................... SKIPPED
2017-06-08\T\01:02:24.706 [INFO] Apache Beam :: SDKs :: Java :: Aggregated Javadoc .. SKIPPED
2017-06-08\T\01:02:24.707 [INFO] ------------------------------------------------------------------------
2017-06-08\T\01:02:24.707 [INFO] BUILD FAILURE
2017-06-08\T\01:02:24.707 [INFO] ------------------------------------------------------------------------
2017-06-08\T\01:02:24.707 [INFO] Total time: 27:58 min
2017-06-08\T\01:02:24.707 [INFO] Finished at: 2017-06-08T01:02:24+00:00
2017-06-08\T\01:02:26.100 [INFO] Final Memory: 224M/1722M
2017-06-08\T\01:02:26.100 [INFO] ------------------------------------------------------------------------
2017-06-08\T\01:02:26.101 [ERROR] Failed to execute goal org.apache.maven.plugins:maven-compiler-plugin:3.6.1:compile
(default-compile) on project beam-runners-flink_2.10: Compilation failure
2017-06-08\T\01:02:26.101 [ERROR] <https://builds.apache.org/job/beam_PostCommit_Java_JDK_Versions_Test/jdk=OpenJDK%207%20(on%20Ubuntu%20only),label=beam/ws/runners/flink/src/main/java/org/apache/beam/runners/flink/FlinkStreamingTransformTranslators.java>:[366,27]
method put in interface java.util.Map<K,V> cannot be applied to given types;
2017-06-08\T\01:02:26.101 [ERROR] required: org.apache.beam.sdk.values.TupleTag<?>,org.apache.flink.util.OutputTag<org.apache.beam.sdk.util.WindowedValue<?>>
2017-06-08\T\01:02:26.102 [ERROR] found: org.apache.beam.sdk.values.TupleTag<capture#1
of ?>,org.apache.flink.util.OutputTag<java.lang.Object>
2017-06-08\T\01:02:26.102 [ERROR] reason: actual argument org.apache.flink.util.OutputTag<java.lang.Object>
cannot be converted to org.apache.flink.util.OutputTag<org.apache.beam.sdk.util.WindowedValue<?>>
by method invocation conversion
2017-06-08\T\01:02:26.102 [ERROR] -> [Help 1]
org.apache.maven.lifecycle.LifecycleExecutionException: Failed to execute goal org.apache.maven.plugins:maven-compiler-plugin:3.6.1:compile
(default-compile) on project beam-runners-flink_2.10: Compilation failure
<https://builds.apache.org/job/beam_PostCommit_Java_JDK_Versions_Test/jdk=OpenJDK%207%20(on%20Ubuntu%20only),label=beam/ws/runners/flink/src/main/java/org/apache/beam/runners/flink/FlinkStreamingTransformTranslators.java>:[366,27]
method put in interface java.util.Map<K,V> cannot be applied to given types;
  required: org.apache.beam.sdk.values.TupleTag<?>,org.apache.flink.util.OutputTag<org.apache.beam.sdk.util.WindowedValue<?>>
  found: org.apache.beam.sdk.values.TupleTag<capture#1 of ?>,org.apache.flink.util.OutputTag<java.lang.Object>
  reason: actual argument org.apache.flink.util.OutputTag<java.lang.Object> cannot be
converted to org.apache.flink.util.OutputTag<org.apache.beam.sdk.util.WindowedValue<?>>
by method invocation conversion

	at org.apache.maven.lifecycle.internal.MojoExecutor.execute(MojoExecutor.java:212)
	at org.apache.maven.lifecycle.internal.MojoExecutor.execute(MojoExecutor.java:153)
	at org.apache.maven.lifecycle.internal.MojoExecutor.execute(MojoExecutor.java:145)
	at org.apache.maven.lifecycle.internal.LifecycleModuleBuilder.buildProject(LifecycleModuleBuilder.java:116)
	at org.apache.maven.lifecycle.internal.LifecycleModuleBuilder.buildProject(LifecycleModuleBuilder.java:80)
	at org.apache.maven.lifecycle.internal.builder.singlethreaded.SingleThreadedBuilder.build(SingleThreadedBuilder.java:51)
	at org.apache.maven.lifecycle.internal.LifecycleStarter.execute(LifecycleStarter.java:128)
	at org.apache.maven.DefaultMaven.doExecute(DefaultMaven.java:307)
	at org.apache.maven.DefaultMaven.doExecute(DefaultMaven.java:193)
	at org.apache.maven.DefaultMaven.execute(DefaultMaven.java:106)
	at org.apache.maven.cli.MavenCli.execute(MavenCli.java:862)
	at org.apache.maven.cli.MavenCli.doMain(MavenCli.java:286)
	at org.apache.maven.cli.MavenCli.main(MavenCli.java:197)
	at sun.reflect.NativeMethodAccessorImpl.invoke0(Native Method)
	at sun.reflect.NativeMethodAccessorImpl.invoke(NativeMethodAccessorImpl.java:57)
	at sun.reflect.DelegatingMethodAccessorImpl.invoke(DelegatingMethodAccessorImpl.java:43)
	at java.lang.reflect.Method.invoke(Method.java:606)
	at org.codehaus.plexus.classworlds.launcher.Launcher.launchEnhanced(Launcher.java:289)
	at org.codehaus.plexus.classworlds.launcher.Launcher.launch(Launcher.java:229)
	at org.codehaus.plexus.classworlds.launcher.Launcher.mainWithExitCode(Launcher.java:415)
	at org.codehaus.plexus.classworlds.launcher.Launcher.main(Launcher.java:356)
Caused by: org.apache.maven.plugin.compiler.CompilationFailureException: Compilation failure
<https://builds.apache.org/job/beam_PostCommit_Java_JDK_Versions_Test/jdk=OpenJDK%207%20(on%20Ubuntu%20only),label=beam/ws/runners/flink/src/main/java/org/apache/beam/runners/flink/FlinkStreamingTransformTranslators.java>:[366,27]
method put in interface java.util.Map<K,V> cannot be applied to given types;
  required: org.apache.beam.sdk.values.TupleTag<?>,org.apache.flink.util.OutputTag<org.apache.beam.sdk.util.WindowedValue<?>>
  found: org.apache.beam.sdk.values.TupleTag<capture#1 of ?>,org.apache.flink.util.OutputTag<java.lang.Object>
  reason: actual argument org.apache.flink.util.OutputTag<java.lang.Object> cannot be
converted to org.apache.flink.util.OutputTag<org.apache.beam.sdk.util.WindowedValue<?>>
by method invocation conversion

	at org.apache.maven.plugin.compiler.AbstractCompilerMojo.execute(AbstractCompilerMojo.java:1029)
	at org.apache.maven.plugin.compiler.CompilerMojo.execute(CompilerMojo.java:137)
	at org.apache.maven.plugin.DefaultBuildPluginManager.executeMojo(DefaultBuildPluginManager.java:134)
	at org.apache.maven.lifecycle.internal.MojoExecutor.execute(MojoExecutor.java:208)
	... 20 more
2017-06-08\T\01:02:26.103 [ERROR] 
2017-06-08\T\01:02:26.103 [ERROR] Re-run Maven using the -X switch to enable full debug logging.
2017-06-08\T\01:02:26.103 [ERROR] 
2017-06-08\T\01:02:26.103 [ERROR] For more information about the errors and possible solutions,
please read the following articles:
2017-06-08\T\01:02:26.103 [ERROR] [Help 1] http://cwiki.apache.org/confluence/display/MAVEN/MojoFailureException
2017-06-08\T\01:02:26.103 [ERROR] 
2017-06-08\T\01:02:26.103 [ERROR] After correcting the problems, you can resume the build
with the command
2017-06-08\T\01:02:26.103 [ERROR]   mvn <goals> -rf :beam-runners-flink_2.10
Build step 'Invoke top-level Maven targets' marked build as failure

Mime
View raw message