beam-commits mailing list archives

Site index · List index
Message view « Date » · « Thread »
Top « Date » · « Thread »
From Apache Jenkins Server <jenk...@builds.apache.org>
Subject Build failed in Jenkins: beam_PostCommit_Java_MavenInstall_Windows #136
Date Thu, 15 Jun 2017 12:44:15 GMT
See <https://builds.apache.org/job/beam_PostCommit_Java_MavenInstall_Windows/136/display/redirect>

------------------------------------------
[...truncated 2.64 MB...]
2017-06-15T12:42:25.636 [INFO] Downloaded: https://repo.maven.apache.org/maven2/org/sonatype/gossip/gossip/1.8/gossip-1.8.pom
(12 KB at 1125.6 KB/sec)
2017-06-15T12:42:25.640 [INFO] Downloading: https://repo.maven.apache.org/maven2/org/sonatype/forge/forge-parent/9/forge-parent-9.pom
2017-06-15T12:42:25.651 [INFO] Downloaded: https://repo.maven.apache.org/maven2/org/sonatype/forge/forge-parent/9/forge-parent-9.pom
(13 KB at 1166.7 KB/sec)
2017-06-15T12:42:25.656 [INFO] Downloading: https://repo.maven.apache.org/maven2/org/sonatype/gossip/gossip-core/1.8/gossip-core-1.8.pom
2017-06-15T12:42:25.666 [INFO] Downloaded: https://repo.maven.apache.org/maven2/org/sonatype/gossip/gossip-core/1.8/gossip-core-1.8.pom
(3 KB at 217.3 KB/sec)
2017-06-15T12:42:25.670 [INFO] Downloading: https://repo.maven.apache.org/maven2/org/sonatype/gossip/gossip-bootstrap/1.8/gossip-bootstrap-1.8.pom
2017-06-15T12:42:25.678 [INFO] Downloaded: https://repo.maven.apache.org/maven2/org/sonatype/gossip/gossip-bootstrap/1.8/gossip-bootstrap-1.8.pom
(2 KB at 196.7 KB/sec)
2017-06-15T12:42:25.683 [INFO] Downloading: https://repo.maven.apache.org/maven2/com/google/guava/guava/14.0.1/guava-14.0.1.pom
2017-06-15T12:42:25.692 [INFO] Downloaded: https://repo.maven.apache.org/maven2/com/google/guava/guava/14.0.1/guava-14.0.1.pom
(6 KB at 583.3 KB/sec)
2017-06-15T12:42:25.696 [INFO] Downloading: https://repo.maven.apache.org/maven2/com/google/guava/guava-parent/14.0.1/guava-parent-14.0.1.pom
2017-06-15T12:42:25.705 [INFO] Downloaded: https://repo.maven.apache.org/maven2/com/google/guava/guava-parent/14.0.1/guava-parent-14.0.1.pom
(3 KB at 277.2 KB/sec)
2017-06-15T12:42:25.710 [INFO] Downloading: https://repo.maven.apache.org/maven2/org/codehaus/plexus/plexus-classworlds/2.4.2/plexus-classworlds-2.4.2.pom
2017-06-15T12:42:25.720 [INFO] Downloaded: https://repo.maven.apache.org/maven2/org/codehaus/plexus/plexus-classworlds/2.4.2/plexus-classworlds-2.4.2.pom
(4 KB at 342.7 KB/sec)
2017-06-15T12:42:25.725 [INFO] Downloading: https://repo.maven.apache.org/maven2/org/codehaus/plexus/plexus-interpolation/1.16/plexus-interpolation-1.16.pom
2017-06-15T12:42:25.734 [INFO] Downloaded: https://repo.maven.apache.org/maven2/org/codehaus/plexus/plexus-interpolation/1.16/plexus-interpolation-1.16.pom
(2 KB at 111.4 KB/sec)
2017-06-15T12:42:25.739 [INFO] Downloading: https://repo.maven.apache.org/maven2/org/eclipse/aether/aether-api/0.9.0.M2/aether-api-0.9.0.M2.pom
2017-06-15T12:42:25.750 [INFO] Downloaded: https://repo.maven.apache.org/maven2/org/eclipse/aether/aether-api/0.9.0.M2/aether-api-0.9.0.M2.pom
(2 KB at 154.2 KB/sec)
2017-06-15T12:42:25.755 [INFO] Downloading: https://repo.maven.apache.org/maven2/org/codehaus/gmaven/gmaven-adapter-api/2.0/gmaven-adapter-api-2.0.pom
2017-06-15T12:42:25.763 [INFO] Downloaded: https://repo.maven.apache.org/maven2/org/codehaus/gmaven/gmaven-adapter-api/2.0/gmaven-adapter-api-2.0.pom
(2 KB at 220.5 KB/sec)
2017-06-15T12:42:25.768 [INFO] Downloading: https://repo.maven.apache.org/maven2/org/codehaus/gmaven/gmaven-adapter-impl/2.0/gmaven-adapter-impl-2.0.pom
2017-06-15T12:42:25.778 [INFO] Downloaded: https://repo.maven.apache.org/maven2/org/codehaus/gmaven/gmaven-adapter-impl/2.0/gmaven-adapter-impl-2.0.pom
(3 KB at 265.4 KB/sec)
2017-06-15T12:42:25.783 [INFO] Downloading: https://repo.maven.apache.org/maven2/org/codehaus/groovy/groovy-all/2.1.5/groovy-all-2.1.5.pom
2017-06-15T12:42:25.794 [INFO] Downloaded: https://repo.maven.apache.org/maven2/org/codehaus/groovy/groovy-all/2.1.5/groovy-all-2.1.5.pom
(18 KB at 1957.4 KB/sec)
2017-06-15T12:42:25.797 [INFO] Downloading: https://repo.maven.apache.org/maven2/org/apache/ant/ant/1.8.4/ant-1.8.4.pom
2017-06-15T12:42:25.807 [INFO] Downloaded: https://repo.maven.apache.org/maven2/org/apache/ant/ant/1.8.4/ant-1.8.4.pom
(10 KB at 942.8 KB/sec)
2017-06-15T12:42:25.811 [INFO] Downloading: https://repo.maven.apache.org/maven2/org/apache/ant/ant-parent/1.8.4/ant-parent-1.8.4.pom
2017-06-15T12:42:25.823 [INFO] Downloaded: https://repo.maven.apache.org/maven2/org/apache/ant/ant-parent/1.8.4/ant-parent-1.8.4.pom
(5 KB at 404.9 KB/sec)
2017-06-15T12:42:25.827 [INFO] Downloading: https://repo.maven.apache.org/maven2/org/apache/ant/ant-launcher/1.8.4/ant-launcher-1.8.4.pom
2017-06-15T12:42:25.836 [INFO] Downloaded: https://repo.maven.apache.org/maven2/org/apache/ant/ant-launcher/1.8.4/ant-launcher-1.8.4.pom
(3 KB at 230.6 KB/sec)
2017-06-15T12:42:25.840 [INFO] Downloading: https://repo.maven.apache.org/maven2/org/fusesource/jansi/jansi/1.11/jansi-1.11.pom
2017-06-15T12:42:25.850 [INFO] Downloaded: https://repo.maven.apache.org/maven2/org/fusesource/jansi/jansi/1.11/jansi-1.11.pom
(4 KB at 351.7 KB/sec)
2017-06-15T12:42:25.854 [INFO] Downloading: https://repo.maven.apache.org/maven2/org/fusesource/jansi/jansi-project/1.11/jansi-project-1.11.pom
2017-06-15T12:42:25.864 [INFO] Downloaded: https://repo.maven.apache.org/maven2/org/fusesource/jansi/jansi-project/1.11/jansi-project-1.11.pom
(12 KB at 1117.9 KB/sec)
2017-06-15T12:42:25.868 [INFO] Downloading: https://repo.maven.apache.org/maven2/org/fusesource/fusesource-pom/1.8/fusesource-pom-1.8.pom
2017-06-15T12:42:25.878 [INFO] Downloaded: https://repo.maven.apache.org/maven2/org/fusesource/fusesource-pom/1.8/fusesource-pom-1.8.pom
(15 KB at 1431.2 KB/sec)
2017-06-15T12:42:25.894 [INFO] Downloading: https://repo.maven.apache.org/maven2/org/sonatype/gossip/gossip-bootstrap/1.8/gossip-bootstrap-1.8.jar
2017-06-15T12:42:25.894 [INFO] Downloading: https://repo.maven.apache.org/maven2/org/sonatype/gossip/gossip-slf4j/1.8/gossip-slf4j-1.8.jar
2017-06-15T12:42:25.894 [INFO] Downloading: https://repo.maven.apache.org/maven2/org/sonatype/gossip/gossip-core/1.8/gossip-core-1.8.jar
2017-06-15T12:42:25.895 [INFO] Downloading: https://repo.maven.apache.org/maven2/com/google/guava/guava/14.0.1/guava-14.0.1.jar
2017-06-15T12:42:25.895 [INFO] Downloading: https://repo.maven.apache.org/maven2/org/codehaus/plexus/plexus-classworlds/2.4.2/plexus-classworlds-2.4.2.jar
2017-06-15T12:42:25.910 [INFO] Downloaded: https://repo.maven.apache.org/maven2/org/sonatype/gossip/gossip-bootstrap/1.8/gossip-bootstrap-1.8.jar
(20 KB at 1135.0 KB/sec)
2017-06-15T12:42:25.910 [INFO] Downloading: https://repo.maven.apache.org/maven2/org/codehaus/plexus/plexus-interpolation/1.16/plexus-interpolation-1.16.jar
2017-06-15T12:42:25.913 [INFO] Downloaded: https://repo.maven.apache.org/maven2/org/sonatype/gossip/gossip-slf4j/1.8/gossip-slf4j-1.8.jar
(5 KB at 206.4 KB/sec)
2017-06-15T12:42:25.913 [INFO] Downloading: https://repo.maven.apache.org/maven2/org/eclipse/aether/aether-api/0.9.0.M2/aether-api-0.9.0.M2.jar
2017-06-15T12:42:25.915 [INFO] Downloaded: https://repo.maven.apache.org/maven2/org/codehaus/plexus/plexus-classworlds/2.4.2/plexus-classworlds-2.4.2.jar
(46 KB at 2184.2 KB/sec)
2017-06-15T12:42:25.915 [INFO] Downloading: https://repo.maven.apache.org/maven2/org/codehaus/gmaven/gmaven-adapter-api/2.0/gmaven-adapter-api-2.0.jar
2017-06-15T12:42:25.918 [INFO] Downloaded: https://repo.maven.apache.org/maven2/org/sonatype/gossip/gossip-core/1.8/gossip-core-1.8.jar
(57 KB at 2258.4 KB/sec)
2017-06-15T12:42:25.918 [INFO] Downloading: https://repo.maven.apache.org/maven2/org/codehaus/gmaven/gmaven-adapter-impl/2.0/gmaven-adapter-impl-2.0.jar
2017-06-15T12:42:25.926 [INFO] Downloaded: https://repo.maven.apache.org/maven2/org/codehaus/plexus/plexus-interpolation/1.16/plexus-interpolation-1.16.jar
(60 KB at 1871.0 KB/sec)
2017-06-15T12:42:25.926 [INFO] Downloading: https://repo.maven.apache.org/maven2/org/codehaus/groovy/groovy-all/2.1.5/groovy-all-2.1.5.jar
2017-06-15T12:42:25.934 [INFO] Downloaded: https://repo.maven.apache.org/maven2/org/codehaus/gmaven/gmaven-adapter-impl/2.0/gmaven-adapter-impl-2.0.jar
(16 KB at 394.8 KB/sec)
2017-06-15T12:42:25.934 [INFO] Downloading: https://repo.maven.apache.org/maven2/org/apache/ant/ant/1.8.4/ant-1.8.4.jar
2017-06-15T12:42:25.939 [INFO] Downloaded: https://repo.maven.apache.org/maven2/org/eclipse/aether/aether-api/0.9.0.M2/aether-api-0.9.0.M2.jar
(131 KB at 2907.1 KB/sec)
2017-06-15T12:42:25.940 [INFO] Downloading: https://repo.maven.apache.org/maven2/org/apache/ant/ant-launcher/1.8.4/ant-launcher-1.8.4.jar
2017-06-15T12:42:25.942 [INFO] Downloaded: https://repo.maven.apache.org/maven2/org/codehaus/gmaven/gmaven-adapter-api/2.0/gmaven-adapter-api-2.0.jar
(7 KB at 144.0 KB/sec)
2017-06-15T12:42:25.943 [INFO] Downloading: https://repo.maven.apache.org/maven2/org/fusesource/jansi/jansi/1.11/jansi-1.11.jar
2017-06-15T12:42:25.988 [INFO] Downloaded: https://repo.maven.apache.org/maven2/org/apache/ant/ant-launcher/1.8.4/ant-launcher-1.8.4.jar
(18 KB at 191.5 KB/sec)
2017-06-15T12:42:25.990 [INFO] Downloaded: https://repo.maven.apache.org/maven2/org/fusesource/jansi/jansi/1.11/jansi-1.11.jar
(112 KB at 1163.9 KB/sec)
2017-06-15T12:42:26.104 [INFO] Downloaded: https://repo.maven.apache.org/maven2/com/google/guava/guava/14.0.1/guava-14.0.1.jar
(2138 KB at 10180.0 KB/sec)
2017-06-15T12:42:26.135 [INFO] Downloaded: https://repo.maven.apache.org/maven2/org/apache/ant/ant/1.8.4/ant-1.8.4.jar
(1897 KB at 7868.1 KB/sec)
2017-06-15T12:42:26.499 [INFO] Downloaded: https://repo.maven.apache.org/maven2/org/codehaus/groovy/groovy-all/2.1.5/groovy-all-2.1.5.jar
(6219 KB at 10278.1 KB/sec)
[JENKINS] Archiving disabled
2017-06-15T12:42:30.218 [INFO]                                                           
             
2017-06-15T12:42:30.218 [INFO] ------------------------------------------------------------------------
2017-06-15T12:42:30.218 [INFO] Skipping Apache Beam :: Parent
2017-06-15T12:42:30.218 [INFO] This project has been banned from the build due to previous
failures.
2017-06-15T12:42:30.218 [INFO] ------------------------------------------------------------------------
[JENKINS] Archiving disabled
[JENKINS] Archiving disabled
[JENKINS] Archiving disabled
[JENKINS] Archiving disabled
[JENKINS] Archiving disabled
[JENKINS] Archiving disabled
[JENKINS] Archiving disabled
[JENKINS] Archiving disabled
[JENKINS] Archiving disabled
[JENKINS] Archiving disabled
[JENKINS] Archiving disabled
[JENKINS] Archiving disabled
[JENKINS] Archiving disabled
[JENKINS] Archiving disabled
[JENKINS] Archiving disabled
[JENKINS] Archiving disabled
[JENKINS] Archiving disabled
[JENKINS] Archiving disabled
[JENKINS] Archiving disabled
[JENKINS] Archiving disabled
[JENKINS] Archiving disabled
[JENKINS] Archiving disabled
[JENKINS] Archiving disabled
[JENKINS] Archiving disabled
[JENKINS] Archiving disabled
[JENKINS] Archiving disabled
[JENKINS] Archiving disabled
[JENKINS] Archiving disabled
[JENKINS] Archiving disabled
[JENKINS] Archiving disabled
[JENKINS] Archiving disabled
[JENKINS] Archiving disabled
[JENKINS] Archiving disabled
[JENKINS] Archiving disabled
[JENKINS] Archiving disabled
[JENKINS] Archiving disabled
[JENKINS] Archiving disabled
[JENKINS] Archiving disabled
[JENKINS] Archiving disabled
[JENKINS] Archiving disabled
[JENKINS] Archiving disabled
[JENKINS] Archiving disabled
[JENKINS] Archiving disabled
[JENKINS] Archiving disabled
[JENKINS] Archiving disabled
[JENKINS] Archiving disabled
[JENKINS] Archiving disabled
[JENKINS] Archiving disabled
[JENKINS] Archiving disabled
[JENKINS] Archiving disabled
2017-06-15T12:43:36.101 [INFO] ------------------------------------------------------------------------
2017-06-15T12:43:36.101 [INFO] Reactor Summary:
2017-06-15T12:43:36.101 [INFO] 
2017-06-15T12:43:36.102 [INFO] Apache Beam :: Parent .............................. SUCCESS
[ 34.206 s]
2017-06-15T12:43:36.102 [INFO] Apache Beam :: SDKs :: Java :: Build Tools ......... SUCCESS
[ 23.626 s]
2017-06-15T12:43:36.102 [INFO] Apache Beam :: SDKs ................................ SUCCESS
[ 11.981 s]
2017-06-15T12:43:36.102 [INFO] Apache Beam :: SDKs :: Common ...................... SUCCESS
[  9.199 s]
2017-06-15T12:43:36.102 [INFO] Apache Beam :: SDKs :: Common :: Runner API ........ SUCCESS
[ 36.998 s]
2017-06-15T12:43:36.102 [INFO] Apache Beam :: SDKs :: Common :: Fn API ............ SUCCESS
[ 40.185 s]
2017-06-15T12:43:36.102 [INFO] Apache Beam :: SDKs :: Java ........................ SUCCESS
[  9.070 s]
2017-06-15T12:43:36.103 [INFO] Apache Beam :: SDKs :: Java :: Core ................ SUCCESS
[04:51 min]
2017-06-15T12:43:36.103 [INFO] Apache Beam :: Runners ............................. SUCCESS
[  6.534 s]
2017-06-15T12:43:36.103 [INFO] Apache Beam :: Runners :: Core Construction Java ... SUCCESS
[01:00 min]
2017-06-15T12:43:36.103 [INFO] Apache Beam :: Runners :: Core Java ................ SUCCESS
[01:22 min]
2017-06-15T12:43:36.103 [INFO] Apache Beam :: Runners :: Direct Java .............. SUCCESS
[04:16 min]
2017-06-15T12:43:36.103 [INFO] Apache Beam :: SDKs :: Java :: IO .................. SUCCESS
[  9.985 s]
2017-06-15T12:43:36.103 [INFO] Apache Beam :: SDKs :: Java :: IO :: Common ........ SUCCESS
[ 15.903 s]
2017-06-15T12:43:36.103 [INFO] Apache Beam :: SDKs :: Java :: IO :: Cassandra ..... SUCCESS
[ 48.687 s]
2017-06-15T12:43:36.103 [INFO] Apache Beam :: SDKs :: Java :: IO :: Elasticsearch . SUCCESS
[01:10 min]
2017-06-15T12:43:36.103 [INFO] Apache Beam :: SDKs :: Java :: Extensions .......... SUCCESS
[  8.290 s]
2017-06-15T12:43:36.104 [INFO] Apache Beam :: SDKs :: Java :: Extensions :: Google Cloud Platform
Core SUCCESS [01:11 min]
2017-06-15T12:43:36.104 [INFO] Apache Beam :: SDKs :: Java :: Extensions :: Protobuf SUCCESS
[ 39.270 s]
2017-06-15T12:43:36.104 [INFO] Apache Beam :: SDKs :: Java :: IO :: Google Cloud Platform
SUCCESS [02:05 min]
2017-06-15T12:43:36.104 [INFO] Apache Beam :: SDKs :: Java :: IO :: Hadoop Common . SUCCESS
[ 40.481 s]
2017-06-15T12:43:36.104 [INFO] Apache Beam :: SDKs :: Java :: IO :: Hadoop File System SUCCESS
[ 50.015 s]
2017-06-15T12:43:36.104 [INFO] Apache Beam :: SDKs :: Java :: IO :: Hadoop ........ SUCCESS
[  9.577 s]
2017-06-15T12:43:36.104 [INFO] Apache Beam :: SDKs :: Java :: IO :: Hadoop :: input-format
SUCCESS [ 40.395 s]
2017-06-15T12:43:36.104 [INFO] Apache Beam :: SDKs :: Java :: IO :: Hadoop :: jdk1.8-tests
SUCCESS [02:00 min]
2017-06-15T12:43:36.106 [INFO] Apache Beam :: SDKs :: Java :: IO :: HBase ......... SUCCESS
[ 51.155 s]
2017-06-15T12:43:36.106 [INFO] Apache Beam :: SDKs :: Java :: IO :: HCatalog ...... SUCCESS
[01:17 min]
2017-06-15T12:43:36.106 [INFO] Apache Beam :: SDKs :: Java :: IO :: JDBC .......... SUCCESS
[ 46.682 s]
2017-06-15T12:43:36.106 [INFO] Apache Beam :: SDKs :: Java :: IO :: JMS ........... SUCCESS
[ 41.907 s]
2017-06-15T12:43:36.106 [INFO] Apache Beam :: SDKs :: Java :: IO :: Kafka ......... SUCCESS
[ 52.587 s]
2017-06-15T12:43:36.106 [INFO] Apache Beam :: SDKs :: Java :: IO :: Kinesis ....... SUCCESS
[ 45.349 s]
2017-06-15T12:43:36.106 [INFO] Apache Beam :: SDKs :: Java :: IO :: MongoDB ....... SUCCESS
[ 52.429 s]
2017-06-15T12:43:36.106 [INFO] Apache Beam :: SDKs :: Java :: IO :: MQTT .......... SUCCESS
[ 34.480 s]
2017-06-15T12:43:36.106 [INFO] Apache Beam :: SDKs :: Java :: IO :: XML ........... SUCCESS
[ 30.333 s]
2017-06-15T12:43:36.106 [INFO] Apache Beam :: SDKs :: Java :: Maven Archetypes .... SUCCESS
[  5.828 s]
2017-06-15T12:43:36.106 [INFO] Apache Beam :: SDKs :: Java :: Maven Archetypes :: Starter
SUCCESS [ 25.185 s]
2017-06-15T12:43:36.106 [INFO] Apache Beam :: SDKs :: Java :: Extensions :: Jackson SUCCESS
[ 31.390 s]
2017-06-15T12:43:36.106 [INFO] Apache Beam :: SDKs :: Java :: Extensions :: Join library SUCCESS
[ 40.873 s]
2017-06-15T12:43:36.106 [INFO] Apache Beam :: SDKs :: Java :: Extensions :: Sorter  SUCCESS
[ 44.369 s]
2017-06-15T12:43:36.106 [INFO] Apache Beam :: Runners :: Google Cloud Dataflow .... SUCCESS
[ 59.412 s]
2017-06-15T12:43:36.106 [INFO] Apache Beam :: SDKs :: Java :: Harness ............. SUCCESS
[01:03 min]
2017-06-15T12:43:36.106 [INFO] Apache Beam :: SDKs :: Java :: Java 8 Tests ........ SUCCESS
[ 27.334 s]
2017-06-15T12:43:36.106 [INFO] Apache Beam :: SDKs :: Python ...................... FAILURE
[  3.391 s]
2017-06-15T12:43:36.107 [INFO] Apache Beam :: Runners :: Flink .................... SKIPPED
2017-06-15T12:43:36.107 [INFO] Apache Beam :: Runners :: Spark .................... SKIPPED
2017-06-15T12:43:36.107 [INFO] Apache Beam :: Runners :: Apex ..................... SKIPPED
2017-06-15T12:43:36.107 [INFO] Apache Beam :: Examples ............................ SKIPPED
2017-06-15T12:43:36.107 [INFO] Apache Beam :: Examples :: Java .................... SKIPPED
2017-06-15T12:43:36.107 [INFO] Apache Beam :: Examples :: Java 8 .................. SKIPPED
2017-06-15T12:43:36.107 [INFO] Apache Beam :: SDKs :: Java :: Aggregated Javadoc .. SKIPPED
2017-06-15T12:43:36.107 [INFO] ------------------------------------------------------------------------
2017-06-15T12:43:36.107 [INFO] BUILD FAILURE
2017-06-15T12:43:36.107 [INFO] ------------------------------------------------------------------------
2017-06-15T12:43:36.108 [INFO] Total time: 41:20 min
2017-06-15T12:43:36.109 [INFO] Finished at: 2017-06-15T12:43:36+00:00
2017-06-15T12:43:37.990 [INFO] Final Memory: 407M/2709M
2017-06-15T12:43:37.990 [INFO] ------------------------------------------------------------------------
Waiting for Jenkins to finish collecting data
2017-06-15T12:43:48.535 [ERROR] Failed to execute goal org.codehaus.gmaven:groovy-maven-plugin:2.0:execute
(find-supported-python-for-clean) on project beam-sdks-python: Unable to find Python 2.7 in
path -> [Help 1]
org.apache.maven.lifecycle.LifecycleExecutionException: Failed to execute goal org.codehaus.gmaven:groovy-maven-plugin:2.0:execute
(find-supported-python-for-clean) on project beam-sdks-python: Unable to find Python 2.7 in
path
	at org.apache.maven.lifecycle.internal.MojoExecutor.execute(MojoExecutor.java:212)
	at org.apache.maven.lifecycle.internal.MojoExecutor.execute(MojoExecutor.java:153)
	at org.apache.maven.lifecycle.internal.MojoExecutor.execute(MojoExecutor.java:145)
	at org.apache.maven.lifecycle.internal.LifecycleModuleBuilder.buildProject(LifecycleModuleBuilder.java:116)
	at org.apache.maven.lifecycle.internal.LifecycleModuleBuilder.buildProject(LifecycleModuleBuilder.java:80)
	at org.apache.maven.lifecycle.internal.builder.singlethreaded.SingleThreadedBuilder.build(SingleThreadedBuilder.java:51)
	at org.apache.maven.lifecycle.internal.LifecycleStarter.execute(LifecycleStarter.java:128)
	at org.apache.maven.DefaultMaven.doExecute(DefaultMaven.java:307)
	at org.apache.maven.DefaultMaven.doExecute(DefaultMaven.java:193)
	at org.apache.maven.DefaultMaven.execute(DefaultMaven.java:106)
	at org.jvnet.hudson.maven3.launcher.Maven33Launcher.main(Maven33Launcher.java:129)
	at sun.reflect.NativeMethodAccessorImpl.invoke0(Native Method)
	at sun.reflect.NativeMethodAccessorImpl.invoke(NativeMethodAccessorImpl.java:62)
	at sun.reflect.DelegatingMethodAccessorImpl.invoke(DelegatingMethodAccessorImpl.java:43)
	at java.lang.reflect.Method.invoke(Method.java:498)
	at org.codehaus.plexus.classworlds.launcher.Launcher.launchStandard(Launcher.java:330)
	at org.codehaus.plexus.classworlds.launcher.Launcher.launch(Launcher.java:238)
	at jenkins.maven3.agent.Maven33Main.launch(Maven33Main.java:176)
	at sun.reflect.NativeMethodAccessorImpl.invoke0(Native Method)
	at sun.reflect.NativeMethodAccessorImpl.invoke(NativeMethodAccessorImpl.java:62)
	at sun.reflect.DelegatingMethodAccessorImpl.invoke(DelegatingMethodAccessorImpl.java:43)
	at java.lang.reflect.Method.invoke(Method.java:498)
	at hudson.maven.Maven3Builder.call(Maven3Builder.java:139)
	at hudson.maven.Maven3Builder.call(Maven3Builder.java:70)
	at hudson.remoting.UserRequest.perform(UserRequest.java:120)
	at hudson.remoting.UserRequest.perform(UserRequest.java:48)
	at hudson.remoting.Request$2.run(Request.java:326)
	at hudson.remoting.InterceptingExecutorService$1.call(InterceptingExecutorService.java:68)
	at java.util.concurrent.FutureTask.run(FutureTask.java:266)
	at java.util.concurrent.ThreadPoolExecutor.runWorker(ThreadPoolExecutor.java:1142)
	at java.util.concurrent.ThreadPoolExecutor$Worker.run(ThreadPoolExecutor.java:617)
	at java.lang.Thread.run(Thread.java:745)
Caused by: org.apache.maven.plugin.MojoFailureException: Unable to find Python 2.7 in path
	at sun.reflect.NativeConstructorAccessorImpl.newInstance0(Native Method)
	at sun.reflect.NativeConstructorAccessorImpl.newInstance(NativeConstructorAccessorImpl.java:62)
	at sun.reflect.DelegatingConstructorAccessorImpl.newInstance(DelegatingConstructorAccessorImpl.java:45)
	at java.lang.reflect.Constructor.newInstance(Constructor.java:423)
	at org.codehaus.groovy.reflection.CachedConstructor.invoke(CachedConstructor.java:77)
	at org.codehaus.groovy.runtime.callsite.ConstructorSite$ConstructorSiteNoUnwrapNoCoerce.callConstructor(ConstructorSite.java:102)
	at org.codehaus.groovy.runtime.callsite.CallSiteArray.defaultCallConstructor(CallSiteArray.java:57)
	at org.codehaus.groovy.runtime.callsite.AbstractCallSite.callConstructor(AbstractCallSite.java:182)
	at org.codehaus.groovy.runtime.callsite.AbstractCallSite.callConstructor(AbstractCallSite.java:190)
	at findSupportedPython.run(findSupportedPython.groovy:70)
	at groovy.lang.GroovyShell.evaluate(GroovyShell.java:518)
	at org.codehaus.gmaven.adapter.impl.ScriptExecutorImpl.execute(ScriptExecutorImpl.java:80)
	at org.codehaus.gmaven.plugin.ExecuteMojo$1.run(ExecuteMojo.java:100)
	at org.codehaus.gmaven.plugin.util.SystemNoExitGuard.run(SystemNoExitGuard.java:45)
	at org.codehaus.gmaven.plugin.ExecuteMojo.run(ExecuteMojo.java:96)
	at org.codehaus.gmaven.plugin.MojoSupport.execute(MojoSupport.java:45)
	at org.apache.maven.plugin.DefaultBuildPluginManager.executeMojo(DefaultBuildPluginManager.java:134)
	at org.apache.maven.lifecycle.internal.MojoExecutor.execute(MojoExecutor.java:208)
	... 31 more
2017-06-15T12:43:48.539 [ERROR] 
2017-06-15T12:43:48.539 [ERROR] Re-run Maven using the -X switch to enable full debug logging.
2017-06-15T12:43:48.539 [ERROR] 
2017-06-15T12:43:48.539 [ERROR] For more information about the errors and possible solutions,
please read the following articles:
2017-06-15T12:43:48.539 [ERROR] [Help 1] http://cwiki.apache.org/confluence/display/MAVEN/MojoFailureException
2017-06-15T12:43:48.540 [ERROR] 
2017-06-15T12:43:48.540 [ERROR] After correcting the problems, you can resume the build with
the command
2017-06-15T12:43:48.540 [ERROR]   mvn <goals> -rf :beam-sdks-python
channel stopped
Not sending mail to unregistered user aljoscha.krettek@gmail.com
Not sending mail to unregistered user github@nakomis.com
Not sending mail to unregistered user hepei.hp@alibaba-inc.com
Not sending mail to unregistered user sourabhbajaj@google.com
Not sending mail to unregistered user klk@google.com
Not sending mail to unregistered user ccy@google.com
Not sending mail to unregistered user kirpichov@google.com
Not sending mail to unregistered user mingmxu@ebay.com

Mime
View raw message