beam-commits mailing list archives

Site index · List index
Message view « Date » · « Thread »
Top « Date » · « Thread »
From Apache Jenkins Server <jenk...@builds.apache.org>
Subject Build failed in Jenkins: beam_PostCommit_Java_MavenInstall_Windows #103
Date Wed, 07 Jun 2017 06:56:10 GMT
See <https://builds.apache.org/job/beam_PostCommit_Java_MavenInstall_Windows/103/display/redirect?page=changes>

Changes:

[bchambers] Increase visibility of some Metrics methods

[chamikara] [BEAM-2405] Override to sink interface in the batch dataflow BQ

------------------------------------------
[...truncated 2.53 MB...]
2017-06-07T06:49:35.963 [INFO] 
2017-06-07T06:49:35.963 [INFO] --- groovy-maven-plugin:2.0:execute (find-supported-python-for-clean)
@ beam-sdks-python ---
2017-06-07T06:49:35.967 [INFO] Downloading: https://repo.maven.apache.org/maven2/org/sonatype/gossip/gossip-slf4j/1.8/gossip-slf4j-1.8.pom
2017-06-07T06:49:35.979 [INFO] Downloaded: https://repo.maven.apache.org/maven2/org/sonatype/gossip/gossip-slf4j/1.8/gossip-slf4j-1.8.pom
(2 KB at 120.6 KB/sec)
2017-06-07T06:49:35.984 [INFO] Downloading: https://repo.maven.apache.org/maven2/org/sonatype/gossip/gossip/1.8/gossip-1.8.pom
2017-06-07T06:49:36.001 [INFO] Downloaded: https://repo.maven.apache.org/maven2/org/sonatype/gossip/gossip/1.8/gossip-1.8.pom
(12 KB at 662.1 KB/sec)
2017-06-07T06:49:36.004 [INFO] Downloading: https://repo.maven.apache.org/maven2/org/sonatype/forge/forge-parent/9/forge-parent-9.pom
2017-06-07T06:49:36.024 [INFO] Downloaded: https://repo.maven.apache.org/maven2/org/sonatype/forge/forge-parent/9/forge-parent-9.pom
(13 KB at 641.7 KB/sec)
2017-06-07T06:49:36.028 [INFO] Downloading: https://repo.maven.apache.org/maven2/org/sonatype/gossip/gossip-core/1.8/gossip-core-1.8.pom
2017-06-07T06:49:36.038 [INFO] Downloaded: https://repo.maven.apache.org/maven2/org/sonatype/gossip/gossip-core/1.8/gossip-core-1.8.pom
(3 KB at 217.3 KB/sec)
2017-06-07T06:49:36.042 [INFO] Downloading: https://repo.maven.apache.org/maven2/org/sonatype/gossip/gossip-bootstrap/1.8/gossip-bootstrap-1.8.pom
2017-06-07T06:49:36.051 [INFO] Downloaded: https://repo.maven.apache.org/maven2/org/sonatype/gossip/gossip-bootstrap/1.8/gossip-bootstrap-1.8.pom
(2 KB at 174.8 KB/sec)
2017-06-07T06:49:36.055 [INFO] Downloading: https://repo.maven.apache.org/maven2/com/google/guava/guava/14.0.1/guava-14.0.1.pom
2017-06-07T06:49:36.064 [INFO] Downloaded: https://repo.maven.apache.org/maven2/com/google/guava/guava/14.0.1/guava-14.0.1.pom
(6 KB at 583.3 KB/sec)
2017-06-07T06:49:36.068 [INFO] Downloading: https://repo.maven.apache.org/maven2/com/google/guava/guava-parent/14.0.1/guava-parent-14.0.1.pom
2017-06-07T06:49:36.077 [INFO] Downloaded: https://repo.maven.apache.org/maven2/com/google/guava/guava-parent/14.0.1/guava-parent-14.0.1.pom
(3 KB at 277.2 KB/sec)
2017-06-07T06:49:36.081 [INFO] Downloading: https://repo.maven.apache.org/maven2/org/codehaus/plexus/plexus-classworlds/2.4.2/plexus-classworlds-2.4.2.pom
2017-06-07T06:49:36.091 [INFO] Downloaded: https://repo.maven.apache.org/maven2/org/codehaus/plexus/plexus-classworlds/2.4.2/plexus-classworlds-2.4.2.pom
(4 KB at 342.7 KB/sec)
2017-06-07T06:49:36.095 [INFO] Downloading: https://repo.maven.apache.org/maven2/org/codehaus/plexus/plexus-interpolation/1.16/plexus-interpolation-1.16.pom
2017-06-07T06:49:36.105 [INFO] Downloaded: https://repo.maven.apache.org/maven2/org/codehaus/plexus/plexus-interpolation/1.16/plexus-interpolation-1.16.pom
(2 KB at 100.3 KB/sec)
2017-06-07T06:49:36.109 [INFO] Downloading: https://repo.maven.apache.org/maven2/org/eclipse/aether/aether-api/0.9.0.M2/aether-api-0.9.0.M2.pom
2017-06-07T06:49:36.122 [INFO] Downloaded: https://repo.maven.apache.org/maven2/org/eclipse/aether/aether-api/0.9.0.M2/aether-api-0.9.0.M2.pom
(2 KB at 130.5 KB/sec)
2017-06-07T06:49:36.128 [INFO] Downloading: https://repo.maven.apache.org/maven2/org/codehaus/gmaven/gmaven-adapter-api/2.0/gmaven-adapter-api-2.0.pom
2017-06-07T06:49:36.137 [INFO] Downloaded: https://repo.maven.apache.org/maven2/org/codehaus/gmaven/gmaven-adapter-api/2.0/gmaven-adapter-api-2.0.pom
(2 KB at 196.0 KB/sec)
2017-06-07T06:49:36.142 [INFO] Downloading: https://repo.maven.apache.org/maven2/org/codehaus/gmaven/gmaven-adapter-impl/2.0/gmaven-adapter-impl-2.0.pom
2017-06-07T06:49:36.155 [INFO] Downloaded: https://repo.maven.apache.org/maven2/org/codehaus/gmaven/gmaven-adapter-impl/2.0/gmaven-adapter-impl-2.0.pom
(3 KB at 204.2 KB/sec)
2017-06-07T06:49:36.160 [INFO] Downloading: https://repo.maven.apache.org/maven2/org/codehaus/groovy/groovy-all/2.1.5/groovy-all-2.1.5.pom
2017-06-07T06:49:36.172 [INFO] Downloaded: https://repo.maven.apache.org/maven2/org/codehaus/groovy/groovy-all/2.1.5/groovy-all-2.1.5.pom
(18 KB at 1468.0 KB/sec)
2017-06-07T06:49:36.175 [INFO] Downloading: https://repo.maven.apache.org/maven2/org/apache/ant/ant/1.8.4/ant-1.8.4.pom
2017-06-07T06:49:36.186 [INFO] Downloaded: https://repo.maven.apache.org/maven2/org/apache/ant/ant/1.8.4/ant-1.8.4.pom
(10 KB at 857.1 KB/sec)
2017-06-07T06:49:36.189 [INFO] Downloading: https://repo.maven.apache.org/maven2/org/apache/ant/ant-parent/1.8.4/ant-parent-1.8.4.pom
2017-06-07T06:49:36.200 [INFO] Downloaded: https://repo.maven.apache.org/maven2/org/apache/ant/ant-parent/1.8.4/ant-parent-1.8.4.pom
(5 KB at 445.4 KB/sec)
2017-06-07T06:49:36.203 [INFO] Downloading: https://repo.maven.apache.org/maven2/org/apache/ant/ant-launcher/1.8.4/ant-launcher-1.8.4.pom
2017-06-07T06:49:36.215 [INFO] Downloaded: https://repo.maven.apache.org/maven2/org/apache/ant/ant-launcher/1.8.4/ant-launcher-1.8.4.pom
(3 KB at 192.1 KB/sec)
2017-06-07T06:49:36.219 [INFO] Downloading: https://repo.maven.apache.org/maven2/org/fusesource/jansi/jansi/1.11/jansi-1.11.pom
2017-06-07T06:49:36.232 [INFO] Downloaded: https://repo.maven.apache.org/maven2/org/fusesource/jansi/jansi/1.11/jansi-1.11.pom
(4 KB at 270.5 KB/sec)
2017-06-07T06:49:36.237 [INFO] Downloading: https://repo.maven.apache.org/maven2/org/fusesource/jansi/jansi-project/1.11/jansi-project-1.11.pom
2017-06-07T06:49:36.248 [INFO] Downloaded: https://repo.maven.apache.org/maven2/org/fusesource/jansi/jansi-project/1.11/jansi-project-1.11.pom
(12 KB at 1016.2 KB/sec)
2017-06-07T06:49:36.251 [INFO] Downloading: https://repo.maven.apache.org/maven2/org/fusesource/fusesource-pom/1.8/fusesource-pom-1.8.pom
2017-06-07T06:49:36.262 [INFO] Downloaded: https://repo.maven.apache.org/maven2/org/fusesource/fusesource-pom/1.8/fusesource-pom-1.8.pom
(15 KB at 1301.0 KB/sec)
2017-06-07T06:49:36.277 [INFO] Downloading: https://repo.maven.apache.org/maven2/org/sonatype/gossip/gossip-slf4j/1.8/gossip-slf4j-1.8.jar
2017-06-07T06:49:36.277 [INFO] Downloading: https://repo.maven.apache.org/maven2/org/sonatype/gossip/gossip-core/1.8/gossip-core-1.8.jar
2017-06-07T06:49:36.279 [INFO] Downloading: https://repo.maven.apache.org/maven2/org/sonatype/gossip/gossip-bootstrap/1.8/gossip-bootstrap-1.8.jar
2017-06-07T06:49:36.280 [INFO] Downloading: https://repo.maven.apache.org/maven2/com/google/guava/guava/14.0.1/guava-14.0.1.jar
2017-06-07T06:49:36.280 [INFO] Downloading: https://repo.maven.apache.org/maven2/org/codehaus/plexus/plexus-classworlds/2.4.2/plexus-classworlds-2.4.2.jar
2017-06-07T06:49:36.291 [INFO] Downloaded: https://repo.maven.apache.org/maven2/org/sonatype/gossip/gossip-slf4j/1.8/gossip-slf4j-1.8.jar
(5 KB at 275.2 KB/sec)
2017-06-07T06:49:36.292 [INFO] Downloading: https://repo.maven.apache.org/maven2/org/codehaus/plexus/plexus-interpolation/1.16/plexus-interpolation-1.16.jar
2017-06-07T06:49:36.299 [INFO] Downloaded: https://repo.maven.apache.org/maven2/org/codehaus/plexus/plexus-classworlds/2.4.2/plexus-classworlds-2.4.2.jar
(46 KB at 2084.9 KB/sec)
2017-06-07T06:49:36.299 [INFO] Downloading: https://repo.maven.apache.org/maven2/org/eclipse/aether/aether-api/0.9.0.M2/aether-api-0.9.0.M2.jar
2017-06-07T06:49:36.301 [INFO] Downloaded: https://repo.maven.apache.org/maven2/org/sonatype/gossip/gossip-core/1.8/gossip-core-1.8.jar
(57 KB at 2258.4 KB/sec)
2017-06-07T06:49:36.302 [INFO] Downloading: https://repo.maven.apache.org/maven2/org/codehaus/gmaven/gmaven-adapter-api/2.0/gmaven-adapter-api-2.0.jar
2017-06-07T06:49:36.303 [INFO] Downloaded: https://repo.maven.apache.org/maven2/org/sonatype/gossip/gossip-bootstrap/1.8/gossip-bootstrap-1.8.jar
(20 KB at 742.1 KB/sec)
2017-06-07T06:49:36.303 [INFO] Downloading: https://repo.maven.apache.org/maven2/org/codehaus/gmaven/gmaven-adapter-impl/2.0/gmaven-adapter-impl-2.0.jar
2017-06-07T06:49:36.315 [INFO] Downloaded: https://repo.maven.apache.org/maven2/org/codehaus/plexus/plexus-interpolation/1.16/plexus-interpolation-1.16.jar
(60 KB at 1575.6 KB/sec)
2017-06-07T06:49:36.315 [INFO] Downloading: https://repo.maven.apache.org/maven2/org/codehaus/groovy/groovy-all/2.1.5/groovy-all-2.1.5.jar
2017-06-07T06:49:36.319 [INFO] Downloaded: https://repo.maven.apache.org/maven2/org/codehaus/gmaven/gmaven-adapter-impl/2.0/gmaven-adapter-impl-2.0.jar
(16 KB at 376.0 KB/sec)
2017-06-07T06:49:36.319 [INFO] Downloading: https://repo.maven.apache.org/maven2/org/apache/ant/ant/1.8.4/ant-1.8.4.jar
2017-06-07T06:49:36.328 [INFO] Downloaded: https://repo.maven.apache.org/maven2/org/codehaus/gmaven/gmaven-adapter-api/2.0/gmaven-adapter-api-2.0.jar
(7 KB at 135.6 KB/sec)
2017-06-07T06:49:36.328 [INFO] Downloading: https://repo.maven.apache.org/maven2/org/apache/ant/ant-launcher/1.8.4/ant-launcher-1.8.4.jar
2017-06-07T06:49:36.329 [INFO] Downloaded: https://repo.maven.apache.org/maven2/org/eclipse/aether/aether-api/0.9.0.M2/aether-api-0.9.0.M2.jar
(131 KB at 2515.7 KB/sec)
2017-06-07T06:49:36.331 [INFO] Downloading: https://repo.maven.apache.org/maven2/org/fusesource/jansi/jansi/1.11/jansi-1.11.jar
2017-06-07T06:49:36.350 [INFO] Downloaded: https://repo.maven.apache.org/maven2/org/apache/ant/ant-launcher/1.8.4/ant-launcher-1.8.4.jar
(18 KB at 246.5 KB/sec)
2017-06-07T06:49:36.353 [INFO] Downloaded: https://repo.maven.apache.org/maven2/org/fusesource/jansi/jansi/1.11/jansi-1.11.jar
(112 KB at 1470.2 KB/sec)
2017-06-07T06:49:36.526 [INFO] Downloaded: https://repo.maven.apache.org/maven2/com/google/guava/guava/14.0.1/guava-14.0.1.jar
(2138 KB at 8585.6 KB/sec)
2017-06-07T06:49:36.537 [INFO] Downloaded: https://repo.maven.apache.org/maven2/org/apache/ant/ant/1.8.4/ant-1.8.4.jar
(1897 KB at 7293.2 KB/sec)
2017-06-07T06:49:36.910 [INFO] Downloaded: https://repo.maven.apache.org/maven2/org/codehaus/groovy/groovy-all/2.1.5/groovy-all-2.1.5.jar
(6219 KB at 9823.5 KB/sec)
[JENKINS] Archiving disabled
2017-06-07T06:49:44.464 [INFO]                                                           
             
2017-06-07T06:49:44.464 [INFO] ------------------------------------------------------------------------
2017-06-07T06:49:44.464 [INFO] Skipping Apache Beam :: Parent
2017-06-07T06:49:44.464 [INFO] This project has been banned from the build due to previous
failures.
2017-06-07T06:49:44.464 [INFO] ------------------------------------------------------------------------
[JENKINS] Archiving disabled
[JENKINS] Archiving disabled
[JENKINS] Archiving disabled
[JENKINS] Archiving disabled
[JENKINS] Archiving disabled
[JENKINS] Archiving disabled
[JENKINS] Archiving disabled
[JENKINS] Archiving disabled
[JENKINS] Archiving disabled
[JENKINS] Archiving disabled
[JENKINS] Archiving disabled
[JENKINS] Archiving disabled
[JENKINS] Archiving disabled
[JENKINS] Archiving disabled
[JENKINS] Archiving disabled
[JENKINS] Archiving disabled
[JENKINS] Archiving disabled
[JENKINS] Archiving disabled
[JENKINS] Archiving disabled
[JENKINS] Archiving disabled
[JENKINS] Archiving disabled
[JENKINS] Archiving disabled
[JENKINS] Archiving disabled
[JENKINS] Archiving disabled
[JENKINS] Archiving disabled
[JENKINS] Archiving disabled
[JENKINS] Archiving disabled
[JENKINS] Archiving disabled
[JENKINS] Archiving disabled
[JENKINS] Archiving disabled
[JENKINS] Archiving disabled
[JENKINS] Archiving disabled
[JENKINS] Archiving disabled
[JENKINS] Archiving disabled
[JENKINS] Archiving disabled
[JENKINS] Archiving disabled
[JENKINS] Archiving disabled
[JENKINS] Archiving disabled
[JENKINS] Archiving disabled
[JENKINS] Archiving disabled
[JENKINS] Archiving disabled
[JENKINS] Archiving disabled
[JENKINS] Archiving disabled
[JENKINS] Archiving disabled
[JENKINS] Archiving disabled
[JENKINS] Archiving disabled
[JENKINS] Archiving disabled
[JENKINS] Archiving disabled
2017-06-07T06:50:57.067 [INFO] ------------------------------------------------------------------------
2017-06-07T06:50:57.067 [INFO] Reactor Summary:
2017-06-07T06:50:57.067 [INFO] 
2017-06-07T06:50:57.067 [INFO] Apache Beam :: Parent .............................. SUCCESS
[ 40.114 s]
2017-06-07T06:50:57.067 [INFO] Apache Beam :: SDKs :: Java :: Build Tools ......... SUCCESS
[ 23.188 s]
2017-06-07T06:50:57.067 [INFO] Apache Beam :: SDKs ................................ SUCCESS
[ 13.959 s]
2017-06-07T06:50:57.067 [INFO] Apache Beam :: SDKs :: Common ...................... SUCCESS
[  9.807 s]
2017-06-07T06:50:57.068 [INFO] Apache Beam :: SDKs :: Common :: Runner API ........ SUCCESS
[ 29.225 s]
2017-06-07T06:50:57.068 [INFO] Apache Beam :: SDKs :: Common :: Fn API ............ SUCCESS
[ 29.491 s]
2017-06-07T06:50:57.068 [INFO] Apache Beam :: SDKs :: Java ........................ SUCCESS
[  7.556 s]
2017-06-07T06:50:57.068 [INFO] Apache Beam :: SDKs :: Java :: Core ................ SUCCESS
[04:56 min]
2017-06-07T06:50:57.068 [INFO] Apache Beam :: SDKs :: Java :: IO .................. SUCCESS
[  7.141 s]
2017-06-07T06:50:57.068 [INFO] Apache Beam :: SDKs :: Java :: IO :: Common ........ SUCCESS
[ 11.625 s]
2017-06-07T06:50:57.068 [INFO] Apache Beam :: Runners ............................. SUCCESS
[  6.281 s]
2017-06-07T06:50:57.068 [INFO] Apache Beam :: Runners :: Core Construction Java ... SUCCESS
[ 57.281 s]
2017-06-07T06:50:57.068 [INFO] Apache Beam :: Runners :: Core Java ................ SUCCESS
[01:20 min]
2017-06-07T06:50:57.068 [INFO] Apache Beam :: Runners :: Direct Java .............. SUCCESS
[03:48 min]
2017-06-07T06:50:57.068 [INFO] Apache Beam :: SDKs :: Java :: IO :: Elasticsearch . SUCCESS
[01:03 min]
2017-06-07T06:50:57.068 [INFO] Apache Beam :: SDKs :: Java :: Extensions .......... SUCCESS
[ 14.285 s]
2017-06-07T06:50:57.068 [INFO] Apache Beam :: SDKs :: Java :: Extensions :: Google Cloud Platform
Core SUCCESS [01:19 min]
2017-06-07T06:50:57.068 [INFO] Apache Beam :: SDKs :: Java :: Extensions :: Protobuf SUCCESS
[ 49.483 s]
2017-06-07T06:50:57.068 [INFO] Apache Beam :: SDKs :: Java :: IO :: Google Cloud Platform
SUCCESS [01:53 min]
2017-06-07T06:50:57.068 [INFO] Apache Beam :: SDKs :: Java :: IO :: Hadoop Common . SUCCESS
[ 54.265 s]
2017-06-07T06:50:57.068 [INFO] Apache Beam :: SDKs :: Java :: IO :: Hadoop File System SUCCESS
[ 56.516 s]
2017-06-07T06:50:57.068 [INFO] Apache Beam :: SDKs :: Java :: IO :: Hadoop ........ SUCCESS
[ 24.281 s]
2017-06-07T06:50:57.069 [INFO] Apache Beam :: SDKs :: Java :: IO :: Hadoop :: input-format
SUCCESS [ 50.881 s]
2017-06-07T06:50:57.069 [INFO] Apache Beam :: SDKs :: Java :: IO :: Hadoop :: jdk1.8-tests
SUCCESS [02:20 min]
2017-06-07T06:50:57.069 [INFO] Apache Beam :: SDKs :: Java :: IO :: HBase ......... SUCCESS
[01:02 min]
2017-06-07T06:50:57.069 [INFO] Apache Beam :: SDKs :: Java :: IO :: JDBC .......... SUCCESS
[01:03 min]
2017-06-07T06:50:57.069 [INFO] Apache Beam :: SDKs :: Java :: IO :: JMS ........... SUCCESS
[01:00 min]
2017-06-07T06:50:57.069 [INFO] Apache Beam :: SDKs :: Java :: IO :: Kafka ......... SUCCESS
[01:18 min]
2017-06-07T06:50:57.069 [INFO] Apache Beam :: SDKs :: Java :: IO :: Kinesis ....... SUCCESS
[01:09 min]
2017-06-07T06:50:57.069 [INFO] Apache Beam :: SDKs :: Java :: IO :: MongoDB ....... SUCCESS
[01:18 min]
2017-06-07T06:50:57.069 [INFO] Apache Beam :: SDKs :: Java :: IO :: MQTT .......... SUCCESS
[01:12 min]
2017-06-07T06:50:57.069 [INFO] Apache Beam :: SDKs :: Java :: IO :: XML ........... SUCCESS
[01:11 min]
2017-06-07T06:50:57.069 [INFO] Apache Beam :: SDKs :: Java :: Maven Archetypes .... SUCCESS
[ 13.316 s]
2017-06-07T06:50:57.069 [INFO] Apache Beam :: SDKs :: Java :: Maven Archetypes :: Starter
SUCCESS [ 40.852 s]
2017-06-07T06:50:57.069 [INFO] Apache Beam :: SDKs :: Java :: Extensions :: Jackson SUCCESS
[ 33.793 s]
2017-06-07T06:50:57.069 [INFO] Apache Beam :: SDKs :: Java :: Extensions :: Join library SUCCESS
[ 37.972 s]
2017-06-07T06:50:57.069 [INFO] Apache Beam :: SDKs :: Java :: Extensions :: Sorter  SUCCESS
[ 59.503 s]
2017-06-07T06:50:57.070 [INFO] Apache Beam :: Runners :: Google Cloud Dataflow .... SUCCESS
[01:07 min]
2017-06-07T06:50:57.070 [INFO] Apache Beam :: SDKs :: Java :: Harness ............. SUCCESS
[01:26 min]
2017-06-07T06:50:57.070 [INFO] Apache Beam :: SDKs :: Java :: Java 8 Tests ........ SUCCESS
[ 33.216 s]
2017-06-07T06:50:57.070 [INFO] Apache Beam :: SDKs :: Python ...................... FAILURE
[  6.576 s]
2017-06-07T06:50:57.070 [INFO] Apache Beam :: Runners :: Flink .................... SKIPPED
2017-06-07T06:50:57.070 [INFO] Apache Beam :: Runners :: Spark .................... SKIPPED
2017-06-07T06:50:57.070 [INFO] Apache Beam :: Runners :: Apex ..................... SKIPPED
2017-06-07T06:50:57.070 [INFO] Apache Beam :: Examples ............................ SKIPPED
2017-06-07T06:50:57.070 [INFO] Apache Beam :: Examples :: Java .................... SKIPPED
2017-06-07T06:50:57.070 [INFO] Apache Beam :: Examples :: Java 8 .................. SKIPPED
2017-06-07T06:50:57.070 [INFO] Apache Beam :: SDKs :: Java :: Aggregated Javadoc .. SKIPPED
2017-06-07T06:50:57.070 [INFO] ------------------------------------------------------------------------
2017-06-07T06:50:57.070 [INFO] BUILD FAILURE
2017-06-07T06:50:57.070 [INFO] ------------------------------------------------------------------------
2017-06-07T06:50:57.070 [INFO] Total time: 50:01 min
2017-06-07T06:50:57.071 [INFO] Finished at: 2017-06-07T06:50:57+00:00
2017-06-07T06:50:58.432 [INFO] Final Memory: 370M/2104M
2017-06-07T06:50:58.432 [INFO] ------------------------------------------------------------------------
Waiting for Jenkins to finish collecting data
2017-06-07T06:54:45.097 [ERROR] Failed to execute goal org.codehaus.gmaven:groovy-maven-plugin:2.0:execute
(find-supported-python-for-clean) on project beam-sdks-python: Unable to find Python 2.7 in
path -> [Help 1]
org.apache.maven.lifecycle.LifecycleExecutionException: Failed to execute goal org.codehaus.gmaven:groovy-maven-plugin:2.0:execute
(find-supported-python-for-clean) on project beam-sdks-python: Unable to find Python 2.7 in
path
	at org.apache.maven.lifecycle.internal.MojoExecutor.execute(MojoExecutor.java:212)
	at org.apache.maven.lifecycle.internal.MojoExecutor.execute(MojoExecutor.java:153)
	at org.apache.maven.lifecycle.internal.MojoExecutor.execute(MojoExecutor.java:145)
	at org.apache.maven.lifecycle.internal.LifecycleModuleBuilder.buildProject(LifecycleModuleBuilder.java:116)
	at org.apache.maven.lifecycle.internal.LifecycleModuleBuilder.buildProject(LifecycleModuleBuilder.java:80)
	at org.apache.maven.lifecycle.internal.builder.singlethreaded.SingleThreadedBuilder.build(SingleThreadedBuilder.java:51)
	at org.apache.maven.lifecycle.internal.LifecycleStarter.execute(LifecycleStarter.java:128)
	at org.apache.maven.DefaultMaven.doExecute(DefaultMaven.java:307)
	at org.apache.maven.DefaultMaven.doExecute(DefaultMaven.java:193)
	at org.apache.maven.DefaultMaven.execute(DefaultMaven.java:106)
	at org.jvnet.hudson.maven3.launcher.Maven33Launcher.main(Maven33Launcher.java:129)
	at sun.reflect.NativeMethodAccessorImpl.invoke0(Native Method)
	at sun.reflect.NativeMethodAccessorImpl.invoke(NativeMethodAccessorImpl.java:62)
	at sun.reflect.DelegatingMethodAccessorImpl.invoke(DelegatingMethodAccessorImpl.java:43)
	at java.lang.reflect.Method.invoke(Method.java:498)
	at org.codehaus.plexus.classworlds.launcher.Launcher.launchStandard(Launcher.java:330)
	at org.codehaus.plexus.classworlds.launcher.Launcher.launch(Launcher.java:238)
	at jenkins.maven3.agent.Maven33Main.launch(Maven33Main.java:176)
	at sun.reflect.NativeMethodAccessorImpl.invoke0(Native Method)
	at sun.reflect.NativeMethodAccessorImpl.invoke(NativeMethodAccessorImpl.java:62)
	at sun.reflect.DelegatingMethodAccessorImpl.invoke(DelegatingMethodAccessorImpl.java:43)
	at java.lang.reflect.Method.invoke(Method.java:498)
	at hudson.maven.Maven3Builder.call(Maven3Builder.java:139)
	at hudson.maven.Maven3Builder.call(Maven3Builder.java:70)
	at hudson.remoting.UserRequest.perform(UserRequest.java:120)
	at hudson.remoting.UserRequest.perform(UserRequest.java:48)
	at hudson.remoting.Request$2.run(Request.java:326)
	at hudson.remoting.InterceptingExecutorService$1.call(InterceptingExecutorService.java:68)
	at java.util.concurrent.FutureTask.run(FutureTask.java:266)
	at java.util.concurrent.ThreadPoolExecutor.runWorker(ThreadPoolExecutor.java:1142)
	at java.util.concurrent.ThreadPoolExecutor$Worker.run(ThreadPoolExecutor.java:617)
	at java.lang.Thread.run(Thread.java:745)
Caused by: org.apache.maven.plugin.MojoFailureException: Unable to find Python 2.7 in path
	at sun.reflect.NativeConstructorAccessorImpl.newInstance0(Native Method)
	at sun.reflect.NativeConstructorAccessorImpl.newInstance(NativeConstructorAccessorImpl.java:62)
	at sun.reflect.DelegatingConstructorAccessorImpl.newInstance(DelegatingConstructorAccessorImpl.java:45)
	at java.lang.reflect.Constructor.newInstance(Constructor.java:423)
	at org.codehaus.groovy.reflection.CachedConstructor.invoke(CachedConstructor.java:77)
	at org.codehaus.groovy.runtime.callsite.ConstructorSite$ConstructorSiteNoUnwrapNoCoerce.callConstructor(ConstructorSite.java:102)
	at org.codehaus.groovy.runtime.callsite.CallSiteArray.defaultCallConstructor(CallSiteArray.java:57)
	at org.codehaus.groovy.runtime.callsite.AbstractCallSite.callConstructor(AbstractCallSite.java:182)
	at org.codehaus.groovy.runtime.callsite.AbstractCallSite.callConstructor(AbstractCallSite.java:190)
	at findSupportedPython.run(findSupportedPython.groovy:70)
	at groovy.lang.GroovyShell.evaluate(GroovyShell.java:518)
	at org.codehaus.gmaven.adapter.impl.ScriptExecutorImpl.execute(ScriptExecutorImpl.java:80)
	at org.codehaus.gmaven.plugin.ExecuteMojo$1.run(ExecuteMojo.java:100)
	at org.codehaus.gmaven.plugin.util.SystemNoExitGuard.run(SystemNoExitGuard.java:45)
	at org.codehaus.gmaven.plugin.ExecuteMojo.run(ExecuteMojo.java:96)
	at org.codehaus.gmaven.plugin.MojoSupport.execute(MojoSupport.java:45)
	at org.apache.maven.plugin.DefaultBuildPluginManager.executeMojo(DefaultBuildPluginManager.java:134)
	at org.apache.maven.lifecycle.internal.MojoExecutor.execute(MojoExecutor.java:208)
	... 31 more
2017-06-07T06:54:45.101 [ERROR] 
2017-06-07T06:54:45.101 [ERROR] Re-run Maven using the -X switch to enable full debug logging.
2017-06-07T06:54:45.101 [ERROR] 
2017-06-07T06:54:45.101 [ERROR] For more information about the errors and possible solutions,
please read the following articles:
2017-06-07T06:54:45.101 [ERROR] [Help 1] http://cwiki.apache.org/confluence/display/MAVEN/MojoFailureException
2017-06-07T06:54:45.102 [ERROR] 
2017-06-07T06:54:45.102 [ERROR] After correcting the problems, you can resume the build with
the command
2017-06-07T06:54:45.102 [ERROR]   mvn <goals> -rf :beam-sdks-python
channel stopped
Not sending mail to unregistered user github@nakomis.com
Not sending mail to unregistered user mingmxu@ebay.com
Not sending mail to unregistered user kirpichov@google.com
Not sending mail to unregistered user aljoscha.krettek@gmail.com
Not sending mail to unregistered user klk@google.com
Not sending mail to unregistered user sourabhbajaj@google.com
Not sending mail to unregistered user hepei.hp@alibaba-inc.com

Mime
View raw message