beam-commits mailing list archives

Site index · List index
Message view « Date » · « Thread »
Top « Date » · « Thread »
From Apache Jenkins Server <jenk...@builds.apache.org>
Subject Build failed in Jenkins: beam_PostCommit_Java_MavenInstall_Windows #129
Date Tue, 13 Jun 2017 18:35:59 GMT
See <https://builds.apache.org/job/beam_PostCommit_Java_MavenInstall_Windows/129/display/redirect?page=changes>

Changes:

[robertwb] Actually test the fn_api_runner.

[altay] Make unique test names for value-provider arguments

[altay] Fix WindowValueCoder for large timestamps

------------------------------------------
[...truncated 2.65 MB...]
2017-06-13T18:34:23.413 [INFO] Downloaded: https://repo.maven.apache.org/maven2/org/sonatype/gossip/gossip/1.8/gossip-1.8.pom
(12 KB at 1125.6 KB/sec)
2017-06-13T18:34:23.417 [INFO] Downloading: https://repo.maven.apache.org/maven2/org/sonatype/forge/forge-parent/9/forge-parent-9.pom
2017-06-13T18:34:23.427 [INFO] Downloaded: https://repo.maven.apache.org/maven2/org/sonatype/forge/forge-parent/9/forge-parent-9.pom
(13 KB at 1283.4 KB/sec)
2017-06-13T18:34:23.431 [INFO] Downloading: https://repo.maven.apache.org/maven2/org/sonatype/gossip/gossip-core/1.8/gossip-core-1.8.pom
2017-06-13T18:34:23.441 [INFO] Downloaded: https://repo.maven.apache.org/maven2/org/sonatype/gossip/gossip-core/1.8/gossip-core-1.8.pom
(3 KB at 217.3 KB/sec)
2017-06-13T18:34:23.445 [INFO] Downloading: https://repo.maven.apache.org/maven2/org/sonatype/gossip/gossip-bootstrap/1.8/gossip-bootstrap-1.8.pom
2017-06-13T18:34:23.456 [INFO] Downloaded: https://repo.maven.apache.org/maven2/org/sonatype/gossip/gossip-bootstrap/1.8/gossip-bootstrap-1.8.pom
(2 KB at 143.0 KB/sec)
2017-06-13T18:34:23.459 [INFO] Downloading: https://repo.maven.apache.org/maven2/com/google/guava/guava/14.0.1/guava-14.0.1.pom
2017-06-13T18:34:23.470 [INFO] Downloaded: https://repo.maven.apache.org/maven2/com/google/guava/guava/14.0.1/guava-14.0.1.pom
(6 KB at 477.3 KB/sec)
2017-06-13T18:34:23.473 [INFO] Downloading: https://repo.maven.apache.org/maven2/com/google/guava/guava-parent/14.0.1/guava-parent-14.0.1.pom
2017-06-13T18:34:23.480 [INFO] Downloaded: https://repo.maven.apache.org/maven2/com/google/guava/guava-parent/14.0.1/guava-parent-14.0.1.pom
(3 KB at 356.4 KB/sec)
2017-06-13T18:34:23.484 [INFO] Downloading: https://repo.maven.apache.org/maven2/org/codehaus/plexus/plexus-classworlds/2.4.2/plexus-classworlds-2.4.2.pom
2017-06-13T18:34:23.492 [INFO] Downloaded: https://repo.maven.apache.org/maven2/org/codehaus/plexus/plexus-classworlds/2.4.2/plexus-classworlds-2.4.2.pom
(4 KB at 428.3 KB/sec)
2017-06-13T18:34:23.496 [INFO] Downloading: https://repo.maven.apache.org/maven2/org/codehaus/plexus/plexus-interpolation/1.16/plexus-interpolation-1.16.pom
2017-06-13T18:34:23.503 [INFO] Downloaded: https://repo.maven.apache.org/maven2/org/codehaus/plexus/plexus-interpolation/1.16/plexus-interpolation-1.16.pom
(2 KB at 143.3 KB/sec)
2017-06-13T18:34:23.508 [INFO] Downloading: https://repo.maven.apache.org/maven2/org/eclipse/aether/aether-api/0.9.0.M2/aether-api-0.9.0.M2.pom
2017-06-13T18:34:23.517 [INFO] Downloaded: https://repo.maven.apache.org/maven2/org/eclipse/aether/aether-api/0.9.0.M2/aether-api-0.9.0.M2.pom
(2 KB at 188.5 KB/sec)
2017-06-13T18:34:23.521 [INFO] Downloading: https://repo.maven.apache.org/maven2/org/codehaus/gmaven/gmaven-adapter-api/2.0/gmaven-adapter-api-2.0.pom
2017-06-13T18:34:23.532 [INFO] Downloaded: https://repo.maven.apache.org/maven2/org/codehaus/gmaven/gmaven-adapter-api/2.0/gmaven-adapter-api-2.0.pom
(2 KB at 160.3 KB/sec)
2017-06-13T18:34:23.536 [INFO] Downloading: https://repo.maven.apache.org/maven2/org/codehaus/gmaven/gmaven-adapter-impl/2.0/gmaven-adapter-impl-2.0.pom
2017-06-13T18:34:23.557 [INFO] Downloaded: https://repo.maven.apache.org/maven2/org/codehaus/gmaven/gmaven-adapter-impl/2.0/gmaven-adapter-impl-2.0.pom
(3 KB at 126.4 KB/sec)
2017-06-13T18:34:23.562 [INFO] Downloading: https://repo.maven.apache.org/maven2/org/codehaus/groovy/groovy-all/2.1.5/groovy-all-2.1.5.pom
2017-06-13T18:34:23.571 [INFO] Downloaded: https://repo.maven.apache.org/maven2/org/codehaus/groovy/groovy-all/2.1.5/groovy-all-2.1.5.pom
(18 KB at 1957.4 KB/sec)
2017-06-13T18:34:23.575 [INFO] Downloading: https://repo.maven.apache.org/maven2/org/apache/ant/ant/1.8.4/ant-1.8.4.pom
2017-06-13T18:34:23.587 [INFO] Downloaded: https://repo.maven.apache.org/maven2/org/apache/ant/ant/1.8.4/ant-1.8.4.pom
(10 KB at 785.6 KB/sec)
2017-06-13T18:34:23.591 [INFO] Downloading: https://repo.maven.apache.org/maven2/org/apache/ant/ant-parent/1.8.4/ant-parent-1.8.4.pom
2017-06-13T18:34:23.598 [INFO] Downloaded: https://repo.maven.apache.org/maven2/org/apache/ant/ant-parent/1.8.4/ant-parent-1.8.4.pom
(5 KB at 636.3 KB/sec)
2017-06-13T18:34:23.602 [INFO] Downloading: https://repo.maven.apache.org/maven2/org/apache/ant/ant-launcher/1.8.4/ant-launcher-1.8.4.pom
2017-06-13T18:34:23.611 [INFO] Downloaded: https://repo.maven.apache.org/maven2/org/apache/ant/ant-launcher/1.8.4/ant-launcher-1.8.4.pom
(3 KB at 256.2 KB/sec)
2017-06-13T18:34:23.615 [INFO] Downloading: https://repo.maven.apache.org/maven2/org/fusesource/jansi/jansi/1.11/jansi-1.11.pom
2017-06-13T18:34:23.624 [INFO] Downloaded: https://repo.maven.apache.org/maven2/org/fusesource/jansi/jansi/1.11/jansi-1.11.pom
(4 KB at 390.7 KB/sec)
2017-06-13T18:34:23.627 [INFO] Downloading: https://repo.maven.apache.org/maven2/org/fusesource/jansi/jansi-project/1.11/jansi-project-1.11.pom
2017-06-13T18:34:23.636 [INFO] Downloaded: https://repo.maven.apache.org/maven2/org/fusesource/jansi/jansi-project/1.11/jansi-project-1.11.pom
(12 KB at 1242.1 KB/sec)
2017-06-13T18:34:23.640 [INFO] Downloading: https://repo.maven.apache.org/maven2/org/fusesource/fusesource-pom/1.8/fusesource-pom-1.8.pom
2017-06-13T18:34:23.650 [INFO] Downloaded: https://repo.maven.apache.org/maven2/org/fusesource/fusesource-pom/1.8/fusesource-pom-1.8.pom
(15 KB at 1301.0 KB/sec)
2017-06-13T18:34:23.663 [INFO] Downloading: https://repo.maven.apache.org/maven2/org/sonatype/gossip/gossip-slf4j/1.8/gossip-slf4j-1.8.jar
2017-06-13T18:34:23.663 [INFO] Downloading: https://repo.maven.apache.org/maven2/org/sonatype/gossip/gossip-core/1.8/gossip-core-1.8.jar
2017-06-13T18:34:23.663 [INFO] Downloading: https://repo.maven.apache.org/maven2/org/sonatype/gossip/gossip-bootstrap/1.8/gossip-bootstrap-1.8.jar
2017-06-13T18:34:23.663 [INFO] Downloading: https://repo.maven.apache.org/maven2/com/google/guava/guava/14.0.1/guava-14.0.1.jar
2017-06-13T18:34:23.664 [INFO] Downloading: https://repo.maven.apache.org/maven2/org/codehaus/plexus/plexus-classworlds/2.4.2/plexus-classworlds-2.4.2.jar
2017-06-13T18:34:23.678 [INFO] Downloaded: https://repo.maven.apache.org/maven2/org/sonatype/gossip/gossip-slf4j/1.8/gossip-slf4j-1.8.jar
(5 KB at 258.0 KB/sec)
2017-06-13T18:34:23.678 [INFO] Downloading: https://repo.maven.apache.org/maven2/org/codehaus/plexus/plexus-interpolation/1.16/plexus-interpolation-1.16.jar
2017-06-13T18:34:23.680 [INFO] Downloaded: https://repo.maven.apache.org/maven2/org/sonatype/gossip/gossip-bootstrap/1.8/gossip-bootstrap-1.8.jar
(20 KB at 1071.9 KB/sec)
2017-06-13T18:34:23.680 [INFO] Downloading: https://repo.maven.apache.org/maven2/org/eclipse/aether/aether-api/0.9.0.M2/aether-api-0.9.0.M2.jar
2017-06-13T18:34:23.680 [INFO] Downloaded: https://repo.maven.apache.org/maven2/org/codehaus/plexus/plexus-classworlds/2.4.2/plexus-classworlds-2.4.2.jar
(46 KB at 2698.1 KB/sec)
2017-06-13T18:34:23.681 [INFO] Downloading: https://repo.maven.apache.org/maven2/org/codehaus/gmaven/gmaven-adapter-api/2.0/gmaven-adapter-api-2.0.jar
2017-06-13T18:34:23.682 [INFO] Downloaded: https://repo.maven.apache.org/maven2/org/sonatype/gossip/gossip-core/1.8/gossip-core-1.8.jar
(57 KB at 2822.9 KB/sec)
2017-06-13T18:34:23.682 [INFO] Downloading: https://repo.maven.apache.org/maven2/org/codehaus/gmaven/gmaven-adapter-impl/2.0/gmaven-adapter-impl-2.0.jar
2017-06-13T18:34:23.695 [INFO] Downloaded: https://repo.maven.apache.org/maven2/org/codehaus/plexus/plexus-interpolation/1.16/plexus-interpolation-1.16.jar
(60 KB at 1871.0 KB/sec)
2017-06-13T18:34:23.695 [INFO] Downloading: https://repo.maven.apache.org/maven2/org/codehaus/groovy/groovy-all/2.1.5/groovy-all-2.1.5.jar
2017-06-13T18:34:23.695 [INFO] Downloaded: https://repo.maven.apache.org/maven2/org/codehaus/gmaven/gmaven-adapter-api/2.0/gmaven-adapter-api-2.0.jar
(7 KB at 216.0 KB/sec)
2017-06-13T18:34:23.695 [INFO] Downloading: https://repo.maven.apache.org/maven2/org/apache/ant/ant/1.8.4/ant-1.8.4.jar
2017-06-13T18:34:23.697 [INFO] Downloaded: https://repo.maven.apache.org/maven2/org/codehaus/gmaven/gmaven-adapter-impl/2.0/gmaven-adapter-impl-2.0.jar
(16 KB at 464.5 KB/sec)
2017-06-13T18:34:23.697 [INFO] Downloading: https://repo.maven.apache.org/maven2/org/apache/ant/ant-launcher/1.8.4/ant-launcher-1.8.4.jar
2017-06-13T18:34:23.704 [INFO] Downloaded: https://repo.maven.apache.org/maven2/org/eclipse/aether/aether-api/0.9.0.M2/aether-api-0.9.0.M2.jar
(131 KB at 3190.7 KB/sec)
2017-06-13T18:34:23.704 [INFO] Downloading: https://repo.maven.apache.org/maven2/org/fusesource/jansi/jansi/1.11/jansi-1.11.jar
2017-06-13T18:34:23.711 [INFO] Downloaded: https://repo.maven.apache.org/maven2/org/apache/ant/ant-launcher/1.8.4/ant-launcher-1.8.4.jar
(18 KB at 374.9 KB/sec)
2017-06-13T18:34:23.727 [INFO] Downloaded: https://repo.maven.apache.org/maven2/org/fusesource/jansi/jansi/1.11/jansi-1.11.jar
(112 KB at 1745.8 KB/sec)
2017-06-13T18:34:24.012 [INFO] Downloaded: https://repo.maven.apache.org/maven2/com/google/guava/guava/14.0.1/guava-14.0.1.jar
(2138 KB at 6125.5 KB/sec)
2017-06-13T18:34:24.015 [INFO] Downloaded: https://repo.maven.apache.org/maven2/org/apache/ant/ant/1.8.4/ant-1.8.4.jar
(1897 KB at 5387.0 KB/sec)
2017-06-13T18:34:24.339 [INFO] Downloaded: https://repo.maven.apache.org/maven2/org/codehaus/groovy/groovy-all/2.1.5/groovy-all-2.1.5.jar
(6219 KB at 9212.2 KB/sec)
[JENKINS] Archiving disabled
2017-06-13T18:34:27.461 [INFO]                                                           
             
2017-06-13T18:34:27.461 [INFO] ------------------------------------------------------------------------
2017-06-13T18:34:27.461 [INFO] Skipping Apache Beam :: Parent
2017-06-13T18:34:27.461 [INFO] This project has been banned from the build due to previous
failures.
2017-06-13T18:34:27.461 [INFO] ------------------------------------------------------------------------
[JENKINS] Archiving disabled
[JENKINS] Archiving disabled
[JENKINS] Archiving disabled
[JENKINS] Archiving disabled
[JENKINS] Archiving disabled
[JENKINS] Archiving disabled
[JENKINS] Archiving disabled
[JENKINS] Archiving disabled
[JENKINS] Archiving disabled
[JENKINS] Archiving disabled
[JENKINS] Archiving disabled
[JENKINS] Archiving disabled
[JENKINS] Archiving disabled
[JENKINS] Archiving disabled
[JENKINS] Archiving disabled
[JENKINS] Archiving disabled
[JENKINS] Archiving disabled
[JENKINS] Archiving disabled
[JENKINS] Archiving disabled
[JENKINS] Archiving disabled
[JENKINS] Archiving disabled
[JENKINS] Archiving disabled
[JENKINS] Archiving disabled
[JENKINS] Archiving disabled
[JENKINS] Archiving disabled
[JENKINS] Archiving disabled
[JENKINS] Archiving disabled
[JENKINS] Archiving disabled
[JENKINS] Archiving disabled
[JENKINS] Archiving disabled
[JENKINS] Archiving disabled
[JENKINS] Archiving disabled
[JENKINS] Archiving disabled
[JENKINS] Archiving disabled
[JENKINS] Archiving disabled
[JENKINS] Archiving disabled
[JENKINS] Archiving disabled
[JENKINS] Archiving disabled
[JENKINS] Archiving disabled
[JENKINS] Archiving disabled
[JENKINS] Archiving disabled
[JENKINS] Archiving disabled
[JENKINS] Archiving disabled
[JENKINS] Archiving disabled
[JENKINS] Archiving disabled
[JENKINS] Archiving disabled
[JENKINS] Archiving disabled
[JENKINS] Archiving disabled
[JENKINS] Archiving disabled
[JENKINS] Archiving disabled
2017-06-13T18:35:27.870 [INFO] ------------------------------------------------------------------------
2017-06-13T18:35:27.870 [INFO] Reactor Summary:
2017-06-13T18:35:27.870 [INFO] 
2017-06-13T18:35:27.871 [INFO] Apache Beam :: Parent .............................. SUCCESS
[ 25.078 s]
2017-06-13T18:35:27.871 [INFO] Apache Beam :: SDKs :: Java :: Build Tools ......... SUCCESS
[ 19.051 s]
2017-06-13T18:35:27.871 [INFO] Apache Beam :: SDKs ................................ SUCCESS
[  8.375 s]
2017-06-13T18:35:27.871 [INFO] Apache Beam :: SDKs :: Common ...................... SUCCESS
[  5.362 s]
2017-06-13T18:35:27.871 [INFO] Apache Beam :: SDKs :: Common :: Runner API ........ SUCCESS
[ 24.354 s]
2017-06-13T18:35:27.871 [INFO] Apache Beam :: SDKs :: Common :: Fn API ............ SUCCESS
[ 22.059 s]
2017-06-13T18:35:27.871 [INFO] Apache Beam :: SDKs :: Java ........................ SUCCESS
[  7.662 s]
2017-06-13T18:35:27.871 [INFO] Apache Beam :: SDKs :: Java :: Core ................ SUCCESS
[04:13 min]
2017-06-13T18:35:27.871 [INFO] Apache Beam :: Runners ............................. SUCCESS
[  6.343 s]
2017-06-13T18:35:27.872 [INFO] Apache Beam :: Runners :: Core Construction Java ... SUCCESS
[ 51.725 s]
2017-06-13T18:35:27.872 [INFO] Apache Beam :: Runners :: Core Java ................ SUCCESS
[01:10 min]
2017-06-13T18:35:27.872 [INFO] Apache Beam :: Runners :: Direct Java .............. SUCCESS
[03:34 min]
2017-06-13T18:35:27.872 [INFO] Apache Beam :: SDKs :: Java :: IO .................. SUCCESS
[  6.769 s]
2017-06-13T18:35:27.872 [INFO] Apache Beam :: SDKs :: Java :: IO :: Common ........ SUCCESS
[ 11.438 s]
2017-06-13T18:35:27.872 [INFO] Apache Beam :: SDKs :: Java :: IO :: Cassandra ..... SUCCESS
[ 35.864 s]
2017-06-13T18:35:27.872 [INFO] Apache Beam :: SDKs :: Java :: IO :: Elasticsearch . SUCCESS
[ 53.228 s]
2017-06-13T18:35:27.872 [INFO] Apache Beam :: SDKs :: Java :: Extensions .......... SUCCESS
[  6.637 s]
2017-06-13T18:35:27.872 [INFO] Apache Beam :: SDKs :: Java :: Extensions :: Google Cloud Platform
Core SUCCESS [ 57.423 s]
2017-06-13T18:35:27.872 [INFO] Apache Beam :: SDKs :: Java :: Extensions :: Protobuf SUCCESS
[ 30.002 s]
2017-06-13T18:35:27.872 [INFO] Apache Beam :: SDKs :: Java :: IO :: Google Cloud Platform
SUCCESS [01:32 min]
2017-06-13T18:35:27.872 [INFO] Apache Beam :: SDKs :: Java :: IO :: Hadoop Common . SUCCESS
[ 34.637 s]
2017-06-13T18:35:27.872 [INFO] Apache Beam :: SDKs :: Java :: IO :: Hadoop File System SUCCESS
[ 42.229 s]
2017-06-13T18:35:27.872 [INFO] Apache Beam :: SDKs :: Java :: IO :: Hadoop ........ SUCCESS
[ 18.469 s]
2017-06-13T18:35:27.872 [INFO] Apache Beam :: SDKs :: Java :: IO :: Hadoop :: input-format
SUCCESS [ 40.795 s]
2017-06-13T18:35:27.873 [INFO] Apache Beam :: SDKs :: Java :: IO :: Hadoop :: jdk1.8-tests
SUCCESS [02:25 min]
2017-06-13T18:35:27.873 [INFO] Apache Beam :: SDKs :: Java :: IO :: HBase ......... SUCCESS
[ 43.036 s]
2017-06-13T18:35:27.873 [INFO] Apache Beam :: SDKs :: Java :: IO :: HCatalog ...... SUCCESS
[01:02 min]
2017-06-13T18:35:27.873 [INFO] Apache Beam :: SDKs :: Java :: IO :: JDBC .......... SUCCESS
[ 36.270 s]
2017-06-13T18:35:27.873 [INFO] Apache Beam :: SDKs :: Java :: IO :: JMS ........... SUCCESS
[ 31.381 s]
2017-06-13T18:35:27.873 [INFO] Apache Beam :: SDKs :: Java :: IO :: Kafka ......... SUCCESS
[ 43.754 s]
2017-06-13T18:35:27.873 [INFO] Apache Beam :: SDKs :: Java :: IO :: Kinesis ....... SUCCESS
[ 34.656 s]
2017-06-13T18:35:27.873 [INFO] Apache Beam :: SDKs :: Java :: IO :: MongoDB ....... SUCCESS
[ 44.523 s]
2017-06-13T18:35:27.873 [INFO] Apache Beam :: SDKs :: Java :: IO :: MQTT .......... SUCCESS
[ 31.442 s]
2017-06-13T18:35:27.873 [INFO] Apache Beam :: SDKs :: Java :: IO :: XML ........... SUCCESS
[ 30.260 s]
2017-06-13T18:35:27.873 [INFO] Apache Beam :: SDKs :: Java :: Maven Archetypes .... SUCCESS
[  6.342 s]
2017-06-13T18:35:27.873 [INFO] Apache Beam :: SDKs :: Java :: Maven Archetypes :: Starter
SUCCESS [ 25.177 s]
2017-06-13T18:35:27.873 [INFO] Apache Beam :: SDKs :: Java :: Extensions :: Jackson SUCCESS
[ 25.528 s]
2017-06-13T18:35:27.873 [INFO] Apache Beam :: SDKs :: Java :: Extensions :: Join library SUCCESS
[ 27.406 s]
2017-06-13T18:35:27.873 [INFO] Apache Beam :: SDKs :: Java :: Extensions :: Sorter  SUCCESS
[ 35.887 s]
2017-06-13T18:35:27.873 [INFO] Apache Beam :: Runners :: Google Cloud Dataflow .... SUCCESS
[ 50.498 s]
2017-06-13T18:35:27.873 [INFO] Apache Beam :: SDKs :: Java :: Harness ............. SUCCESS
[ 53.877 s]
2017-06-13T18:35:27.874 [INFO] Apache Beam :: SDKs :: Java :: Java 8 Tests ........ SUCCESS
[ 22.867 s]
2017-06-13T18:35:27.874 [INFO] Apache Beam :: SDKs :: Python ...................... FAILURE
[  3.603 s]
2017-06-13T18:35:27.874 [INFO] Apache Beam :: Runners :: Flink .................... SKIPPED
2017-06-13T18:35:27.874 [INFO] Apache Beam :: Runners :: Spark .................... SKIPPED
2017-06-13T18:35:27.874 [INFO] Apache Beam :: Runners :: Apex ..................... SKIPPED
2017-06-13T18:35:27.874 [INFO] Apache Beam :: Examples ............................ SKIPPED
2017-06-13T18:35:27.874 [INFO] Apache Beam :: Examples :: Java .................... SKIPPED
2017-06-13T18:35:27.874 [INFO] Apache Beam :: Examples :: Java 8 .................. SKIPPED
2017-06-13T18:35:27.874 [INFO] Apache Beam :: SDKs :: Java :: Aggregated Javadoc .. SKIPPED
2017-06-13T18:35:27.874 [INFO] ------------------------------------------------------------------------
2017-06-13T18:35:27.874 [INFO] BUILD FAILURE
2017-06-13T18:35:27.874 [INFO] ------------------------------------------------------------------------
2017-06-13T18:35:27.874 [INFO] Total time: 34:40 min
2017-06-13T18:35:27.875 [INFO] Finished at: 2017-06-13T18:35:27+00:00
2017-06-13T18:35:29.140 [INFO] Final Memory: 325M/3230M
2017-06-13T18:35:29.140 [INFO] ------------------------------------------------------------------------
Waiting for Jenkins to finish collecting data
2017-06-13T18:35:35.480 [ERROR] Failed to execute goal org.codehaus.gmaven:groovy-maven-plugin:2.0:execute
(find-supported-python-for-clean) on project beam-sdks-python: Unable to find Python 2.7 in
path -> [Help 1]
org.apache.maven.lifecycle.LifecycleExecutionException: Failed to execute goal org.codehaus.gmaven:groovy-maven-plugin:2.0:execute
(find-supported-python-for-clean) on project beam-sdks-python: Unable to find Python 2.7 in
path
	at org.apache.maven.lifecycle.internal.MojoExecutor.execute(MojoExecutor.java:212)
	at org.apache.maven.lifecycle.internal.MojoExecutor.execute(MojoExecutor.java:153)
	at org.apache.maven.lifecycle.internal.MojoExecutor.execute(MojoExecutor.java:145)
	at org.apache.maven.lifecycle.internal.LifecycleModuleBuilder.buildProject(LifecycleModuleBuilder.java:116)
	at org.apache.maven.lifecycle.internal.LifecycleModuleBuilder.buildProject(LifecycleModuleBuilder.java:80)
	at org.apache.maven.lifecycle.internal.builder.singlethreaded.SingleThreadedBuilder.build(SingleThreadedBuilder.java:51)
	at org.apache.maven.lifecycle.internal.LifecycleStarter.execute(LifecycleStarter.java:128)
	at org.apache.maven.DefaultMaven.doExecute(DefaultMaven.java:307)
	at org.apache.maven.DefaultMaven.doExecute(DefaultMaven.java:193)
	at org.apache.maven.DefaultMaven.execute(DefaultMaven.java:106)
	at org.jvnet.hudson.maven3.launcher.Maven33Launcher.main(Maven33Launcher.java:129)
	at sun.reflect.NativeMethodAccessorImpl.invoke0(Native Method)
	at sun.reflect.NativeMethodAccessorImpl.invoke(NativeMethodAccessorImpl.java:62)
	at sun.reflect.DelegatingMethodAccessorImpl.invoke(DelegatingMethodAccessorImpl.java:43)
	at java.lang.reflect.Method.invoke(Method.java:498)
	at org.codehaus.plexus.classworlds.launcher.Launcher.launchStandard(Launcher.java:330)
	at org.codehaus.plexus.classworlds.launcher.Launcher.launch(Launcher.java:238)
	at jenkins.maven3.agent.Maven33Main.launch(Maven33Main.java:176)
	at sun.reflect.NativeMethodAccessorImpl.invoke0(Native Method)
	at sun.reflect.NativeMethodAccessorImpl.invoke(NativeMethodAccessorImpl.java:62)
	at sun.reflect.DelegatingMethodAccessorImpl.invoke(DelegatingMethodAccessorImpl.java:43)
	at java.lang.reflect.Method.invoke(Method.java:498)
	at hudson.maven.Maven3Builder.call(Maven3Builder.java:139)
	at hudson.maven.Maven3Builder.call(Maven3Builder.java:70)
	at hudson.remoting.UserRequest.perform(UserRequest.java:120)
	at hudson.remoting.UserRequest.perform(UserRequest.java:48)
	at hudson.remoting.Request$2.run(Request.java:326)
	at hudson.remoting.InterceptingExecutorService$1.call(InterceptingExecutorService.java:68)
	at java.util.concurrent.FutureTask.run(FutureTask.java:266)
	at java.util.concurrent.ThreadPoolExecutor.runWorker(ThreadPoolExecutor.java:1142)
	at java.util.concurrent.ThreadPoolExecutor$Worker.run(ThreadPoolExecutor.java:617)
	at java.lang.Thread.run(Thread.java:745)
Caused by: org.apache.maven.plugin.MojoFailureException: Unable to find Python 2.7 in path
	at sun.reflect.NativeConstructorAccessorImpl.newInstance0(Native Method)
	at sun.reflect.NativeConstructorAccessorImpl.newInstance(NativeConstructorAccessorImpl.java:62)
	at sun.reflect.DelegatingConstructorAccessorImpl.newInstance(DelegatingConstructorAccessorImpl.java:45)
	at java.lang.reflect.Constructor.newInstance(Constructor.java:423)
	at org.codehaus.groovy.reflection.CachedConstructor.invoke(CachedConstructor.java:77)
	at org.codehaus.groovy.runtime.callsite.ConstructorSite$ConstructorSiteNoUnwrapNoCoerce.callConstructor(ConstructorSite.java:102)
	at org.codehaus.groovy.runtime.callsite.CallSiteArray.defaultCallConstructor(CallSiteArray.java:57)
	at org.codehaus.groovy.runtime.callsite.AbstractCallSite.callConstructor(AbstractCallSite.java:182)
	at org.codehaus.groovy.runtime.callsite.AbstractCallSite.callConstructor(AbstractCallSite.java:190)
	at findSupportedPython.run(findSupportedPython.groovy:70)
	at groovy.lang.GroovyShell.evaluate(GroovyShell.java:518)
	at org.codehaus.gmaven.adapter.impl.ScriptExecutorImpl.execute(ScriptExecutorImpl.java:80)
	at org.codehaus.gmaven.plugin.ExecuteMojo$1.run(ExecuteMojo.java:100)
	at org.codehaus.gmaven.plugin.util.SystemNoExitGuard.run(SystemNoExitGuard.java:45)
	at org.codehaus.gmaven.plugin.ExecuteMojo.run(ExecuteMojo.java:96)
	at org.codehaus.gmaven.plugin.MojoSupport.execute(MojoSupport.java:45)
	at org.apache.maven.plugin.DefaultBuildPluginManager.executeMojo(DefaultBuildPluginManager.java:134)
	at org.apache.maven.lifecycle.internal.MojoExecutor.execute(MojoExecutor.java:208)
	... 31 more
2017-06-13T18:35:35.483 [ERROR] 
2017-06-13T18:35:35.483 [ERROR] Re-run Maven using the -X switch to enable full debug logging.
2017-06-13T18:35:35.483 [ERROR] 
2017-06-13T18:35:35.483 [ERROR] For more information about the errors and possible solutions,
please read the following articles:
2017-06-13T18:35:35.483 [ERROR] [Help 1] http://cwiki.apache.org/confluence/display/MAVEN/MojoFailureException
2017-06-13T18:35:35.484 [ERROR] 
2017-06-13T18:35:35.484 [ERROR] After correcting the problems, you can resume the build with
the command
2017-06-13T18:35:35.484 [ERROR]   mvn <goals> -rf :beam-sdks-python
channel stopped
Not sending mail to unregistered user github@nakomis.com
Not sending mail to unregistered user ccy@google.com
Not sending mail to unregistered user mingmxu@ebay.com
Not sending mail to unregistered user kirpichov@google.com
Not sending mail to unregistered user aljoscha.krettek@gmail.com
Not sending mail to unregistered user klk@google.com
Not sending mail to unregistered user sourabhbajaj@google.com
Not sending mail to unregistered user hepei.hp@alibaba-inc.com

Mime
View raw message