beam-commits mailing list archives

Site index · List index
Message view « Date » · « Thread »
Top « Date » · « Thread »
From Apache Jenkins Server <jenk...@builds.apache.org>
Subject Build failed in Jenkins: beam_PostCommit_Java_JDK_Versions_Test » JDK 1.7 (latest),beam #94
Date Sat, 17 Jun 2017 00:32:53 GMT
See <https://builds.apache.org/job/beam_PostCommit_Java_JDK_Versions_Test/jdk=JDK%201.7%20(latest),label=beam/94/display/redirect?page=changes>

Changes:

[lcwik] [BEAM-1347] Break apart ProcessBundleHandler to use service locator

[kirpichov] Tests for reading windowed side input from resumed SDF call

[robertwb] Populate PBegin input when decoding from Runner API

------------------------------------------
[...truncated 1.51 MB...]
2017-06-17\T\00:32:23.283 [INFO] Downloading: https://repo.maven.apache.org/maven2/org/apache/spark/spark-unsafe_2.10/1.6.2/spark-unsafe_2.10-1.6.2.pom
2017-06-17\T\00:32:23.309 [INFO] Downloaded: https://repo.maven.apache.org/maven2/org/apache/spark/spark-unsafe_2.10/1.6.2/spark-unsafe_2.10-1.6.2.pom
(5 KB at 178.9 KB/sec)
2017-06-17\T\00:32:23.315 [INFO] Downloading: https://repo.maven.apache.org/maven2/com/fasterxml/jackson/module/jackson-module-scala_2.10/2.8.8/jackson-module-scala_2.10-2.8.8.pom
2017-06-17\T\00:32:23.342 [INFO] Downloaded: https://repo.maven.apache.org/maven2/com/fasterxml/jackson/module/jackson-module-scala_2.10/2.8.8/jackson-module-scala_2.10-2.8.8.pom
(5 KB at 153.4 KB/sec)
2017-06-17\T\00:32:23.343 [INFO] Downloading: https://repo.maven.apache.org/maven2/org/scala-lang/scala-library/2.10.6/scala-library-2.10.6.pom
2017-06-17\T\00:32:23.370 [INFO] Downloaded: https://repo.maven.apache.org/maven2/org/scala-lang/scala-library/2.10.6/scala-library-2.10.6.pom
(2 KB at 76.8 KB/sec)
2017-06-17\T\00:32:23.371 [INFO] Downloading: https://repo.maven.apache.org/maven2/org/scala-lang/scala-reflect/2.10.6/scala-reflect-2.10.6.pom
2017-06-17\T\00:32:23.397 [INFO] Downloaded: https://repo.maven.apache.org/maven2/org/scala-lang/scala-reflect/2.10.6/scala-reflect-2.10.6.pom
(2 KB at 72.9 KB/sec)
2017-06-17\T\00:32:23.398 [INFO] Downloading: https://repo.maven.apache.org/maven2/com/fasterxml/jackson/module/jackson-module-paranamer/2.8.8/jackson-module-paranamer-2.8.8.pom
2017-06-17\T\00:32:23.425 [INFO] Downloaded: https://repo.maven.apache.org/maven2/com/fasterxml/jackson/module/jackson-module-paranamer/2.8.8/jackson-module-paranamer-2.8.8.pom
(4 KB at 141.1 KB/sec)
2017-06-17\T\00:32:23.427 [INFO] Downloading: https://repo.maven.apache.org/maven2/com/fasterxml/jackson/module/jackson-modules-base/2.8.8/jackson-modules-base-2.8.8.pom
2017-06-17\T\00:32:23.453 [INFO] Downloaded: https://repo.maven.apache.org/maven2/com/fasterxml/jackson/module/jackson-modules-base/2.8.8/jackson-modules-base-2.8.8.pom
(3 KB at 96.1 KB/sec)
2017-06-17\T\00:32:23.454 [INFO] Downloading: https://repo.maven.apache.org/maven2/com/fasterxml/jackson/jackson-bom/2.8.8/jackson-bom-2.8.8.pom
2017-06-17\T\00:32:23.480 [INFO] Downloaded: https://repo.maven.apache.org/maven2/com/fasterxml/jackson/jackson-bom/2.8.8/jackson-bom-2.8.8.pom
(11 KB at 391.0 KB/sec)
2017-06-17\T\00:32:23.483 [INFO] Downloading: https://repo.maven.apache.org/maven2/com/thoughtworks/paranamer/paranamer/2.8/paranamer-2.8.pom
2017-06-17\T\00:32:23.509 [INFO] Downloaded: https://repo.maven.apache.org/maven2/com/thoughtworks/paranamer/paranamer/2.8/paranamer-2.8.pom
(6 KB at 198.1 KB/sec)
2017-06-17\T\00:32:23.510 [INFO] Downloading: https://repo.maven.apache.org/maven2/com/thoughtworks/paranamer/paranamer-parent/2.8/paranamer-parent-2.8.pom
2017-06-17\T\00:32:23.536 [INFO] Downloaded: https://repo.maven.apache.org/maven2/com/thoughtworks/paranamer/paranamer-parent/2.8/paranamer-parent-2.8.pom
(12 KB at 433.4 KB/sec)
2017-06-17\T\00:32:23.539 [INFO] Downloading: https://repo.maven.apache.org/maven2/org/apache/spark/spark-streaming_2.10/1.6.2/spark-streaming_2.10-1.6.2.pom
2017-06-17\T\00:32:23.565 [INFO] Downloaded: https://repo.maven.apache.org/maven2/org/apache/spark/spark-streaming_2.10/1.6.2/spark-streaming_2.10-1.6.2.pom
(8 KB at 298.3 KB/sec)
2017-06-17\T\00:32:23.640 [INFO] Downloading: http://repository.apache.org/snapshots/org/apache/beam/beam-runners-apex/2.1.0-SNAPSHOT/beam-runners-apex-2.1.0-20170616.081739-37.jar
2017-06-17\T\00:32:23.641 [INFO] Downloading: http://repository.apache.org/snapshots/org/apache/beam/beam-sdks-java-harness/2.1.0-SNAPSHOT/beam-sdks-java-harness-2.1.0-20170616.074213-41.jar
2017-06-17\T\00:32:24.061 [INFO] Downloaded: http://repository.apache.org/snapshots/org/apache/beam/beam-sdks-java-harness/2.1.0-SNAPSHOT/beam-sdks-java-harness-2.1.0-20170616.074213-41.jar
(2698 KB at 6408.4 KB/sec)
2017-06-17\T\00:32:24.061 [INFO] Downloaded: http://repository.apache.org/snapshots/org/apache/beam/beam-runners-apex/2.1.0-SNAPSHOT/beam-runners-apex-2.1.0-20170616.081739-37.jar
(2754 KB at 6539.8 KB/sec)
2017-06-17\T\00:32:24.070 [INFO] Downloading: https://repo.maven.apache.org/maven2/org/apache/apex/apex-common/3.6.0/apex-common-3.6.0.jar
2017-06-17\T\00:32:24.071 [INFO] Downloading: https://repo.maven.apache.org/maven2/com/datatorrent/netlet/1.3.0/netlet-1.3.0.jar
2017-06-17\T\00:32:24.071 [INFO] Downloading: https://repo.maven.apache.org/maven2/org/apache/apex/apex-api/3.6.0/apex-api-3.6.0.jar
2017-06-17\T\00:32:24.071 [INFO] Downloading: https://repo.maven.apache.org/maven2/javax/validation/validation-api/1.1.0.Final/validation-api-1.1.0.Final.jar
2017-06-17\T\00:32:24.071 [INFO] Downloading: https://repo.maven.apache.org/maven2/org/apache/apex/malhar-library/3.4.0/malhar-library-3.4.0.jar
2017-06-17\T\00:32:24.099 [INFO] Downloaded: https://repo.maven.apache.org/maven2/org/apache/apex/apex-common/3.6.0/apex-common-3.6.0.jar
(67 KB at 2284.9 KB/sec)
2017-06-17\T\00:32:24.099 [INFO] Downloading: https://repo.maven.apache.org/maven2/org/eclipse/jetty/jetty-servlet/8.1.10.v20130312/jetty-servlet-8.1.10.v20130312.jar
2017-06-17\T\00:32:24.100 [INFO] Downloaded: https://repo.maven.apache.org/maven2/javax/validation/validation-api/1.1.0.Final/validation-api-1.1.0.Final.jar
(63 KB at 2147.7 KB/sec)
2017-06-17\T\00:32:24.100 [INFO] Downloaded: https://repo.maven.apache.org/maven2/com/datatorrent/netlet/1.3.0/netlet-1.3.0.jar
(76 KB at 2512.2 KB/sec)
2017-06-17\T\00:32:24.100 [INFO] Downloading: https://repo.maven.apache.org/maven2/org/eclipse/jetty/jetty-security/8.1.10.v20130312/jetty-security-8.1.10.v20130312.jar
2017-06-17\T\00:32:24.100 [INFO] Downloading: https://repo.maven.apache.org/maven2/org/eclipse/jetty/jetty-server/8.1.10.v20130312/jetty-server-8.1.10.v20130312.jar
2017-06-17\T\00:32:24.101 [INFO] Downloaded: https://repo.maven.apache.org/maven2/org/apache/apex/apex-api/3.6.0/apex-api-3.6.0.jar
(100 KB at 3225.8 KB/sec)
2017-06-17\T\00:32:24.101 [INFO] Downloading: https://repo.maven.apache.org/maven2/org/eclipse/jetty/jetty-continuation/8.1.10.v20130312/jetty-continuation-8.1.10.v20130312.jar
2017-06-17\T\00:32:24.128 [INFO] Downloaded: https://repo.maven.apache.org/maven2/org/eclipse/jetty/jetty-continuation/8.1.10.v20130312/jetty-continuation-8.1.10.v20130312.jar
(21 KB at 362.3 KB/sec)
2017-06-17\T\00:32:24.128 [INFO] Downloading: https://repo.maven.apache.org/maven2/com/sun/mail/javax.mail/1.5.0/javax.mail-1.5.0.jar
2017-06-17\T\00:32:24.129 [INFO] Downloaded: https://repo.maven.apache.org/maven2/org/eclipse/jetty/jetty-servlet/8.1.10.v20130312/jetty-servlet-8.1.10.v20130312.jar
(99 KB at 1701.4 KB/sec)
2017-06-17\T\00:32:24.129 [INFO] Downloading: https://repo.maven.apache.org/maven2/javax/jms/jms-api/1.1-rev-1/jms-api-1.1-rev-1.jar
2017-06-17\T\00:32:24.130 [INFO] Downloaded: https://repo.maven.apache.org/maven2/org/eclipse/jetty/jetty-security/8.1.10.v20130312/jetty-security-8.1.10.v20130312.jar
(88 KB at 1484.6 KB/sec)
2017-06-17\T\00:32:24.130 [INFO] Downloading: https://repo.maven.apache.org/maven2/org/apache/activemq/activemq-client/5.8.0/activemq-client-5.8.0.jar
2017-06-17\T\00:32:24.141 [INFO] Downloaded: https://repo.maven.apache.org/maven2/org/eclipse/jetty/jetty-server/8.1.10.v20130312/jetty-server-8.1.10.v20130312.jar
(339 KB at 4841.2 KB/sec)
2017-06-17\T\00:32:24.141 [INFO] Downloading: https://repo.maven.apache.org/maven2/com/github/tony19/named-regexp/0.2.3/named-regexp-0.2.3.jar
2017-06-17\T\00:32:24.158 [INFO] Downloaded: https://repo.maven.apache.org/maven2/javax/jms/jms-api/1.1-rev-1/jms-api-1.1-rev-1.jar
(39 KB at 439.1 KB/sec)
2017-06-17\T\00:32:24.158 [INFO] Downloading: https://repo.maven.apache.org/maven2/org/codehaus/janino/commons-compiler/2.7.8/commons-compiler-2.7.8.jar
2017-06-17\T\00:32:24.176 [INFO] Downloaded: https://repo.maven.apache.org/maven2/com/sun/mail/javax.mail/1.5.0/javax.mail-1.5.0.jar
(510 KB at 4854.8 KB/sec)
2017-06-17\T\00:32:24.176 [INFO] Downloading: https://repo.maven.apache.org/maven2/org/eclipse/jetty/jetty-websocket/8.1.10.v20130312/jetty-websocket-8.1.10.v20130312.jar
2017-06-17\T\00:32:24.180 [INFO] Downloaded: https://repo.maven.apache.org/maven2/com/github/tony19/named-regexp/0.2.3/named-regexp-0.2.3.jar
(9 KB at 78.8 KB/sec)
2017-06-17\T\00:32:24.180 [INFO] Downloading: https://repo.maven.apache.org/maven2/org/eclipse/jetty/jetty-util/8.1.10.v20130312/jetty-util-8.1.10.v20130312.jar
2017-06-17\T\00:32:24.186 [INFO] Downloaded: https://repo.maven.apache.org/maven2/org/codehaus/janino/commons-compiler/2.7.8/commons-compiler-2.7.8.jar
(30 KB at 259.8 KB/sec)
2017-06-17\T\00:32:24.186 [INFO] Downloading: https://repo.maven.apache.org/maven2/org/eclipse/jetty/jetty-io/8.1.10.v20130312/jetty-io-8.1.10.v20130312.jar
2017-06-17\T\00:32:24.203 [INFO] Downloaded: https://repo.maven.apache.org/maven2/org/apache/activemq/activemq-client/5.8.0/activemq-client-5.8.0.jar
(1117 KB at 8457.9 KB/sec)
2017-06-17\T\00:32:24.203 [INFO] Downloading: https://repo.maven.apache.org/maven2/org/eclipse/jetty/jetty-http/8.1.10.v20130312/jetty-http-8.1.10.v20130312.jar
2017-06-17\T\00:32:24.206 [INFO] Downloaded: https://repo.maven.apache.org/maven2/org/eclipse/jetty/jetty-websocket/8.1.10.v20130312/jetty-websocket-8.1.10.v20130312.jar
(123 KB at 910.9 KB/sec)
2017-06-17\T\00:32:24.207 [INFO] Downloading: https://repo.maven.apache.org/maven2/it/unimi/dsi/fastutil/7.0.6/fastutil-7.0.6.jar
2017-06-17\T\00:32:24.217 [INFO] Downloaded: https://repo.maven.apache.org/maven2/org/eclipse/jetty/jetty-io/8.1.10.v20130312/jetty-io-8.1.10.v20130312.jar
(102 KB at 693.1 KB/sec)
2017-06-17\T\00:32:24.217 [INFO] Downloaded: https://repo.maven.apache.org/maven2/org/eclipse/jetty/jetty-util/8.1.10.v20130312/jetty-util-8.1.10.v20130312.jar
(279 KB at 1905.7 KB/sec)
2017-06-17\T\00:32:24.218 [INFO] Downloading: https://repo.maven.apache.org/maven2/org/apache/apex/apex-shaded-ning19/1.0.0/apex-shaded-ning19-1.0.0.jar
2017-06-17\T\00:32:24.218 [INFO] Downloading: https://repo.maven.apache.org/maven2/org/apache/apex/apex-engine/3.6.0/apex-engine-3.6.0.jar
2017-06-17\T\00:32:24.233 [INFO] Downloaded: https://repo.maven.apache.org/maven2/org/eclipse/jetty/jetty-http/8.1.10.v20130312/jetty-http-8.1.10.v20130312.jar
(94 KB at 576.9 KB/sec)
2017-06-17\T\00:32:24.233 [INFO] Downloading: https://repo.maven.apache.org/maven2/org/apache/bval/bval-jsr303/0.5/bval-jsr303-0.5.jar
2017-06-17\T\00:32:24.271 [INFO] Downloaded: https://repo.maven.apache.org/maven2/org/apache/bval/bval-jsr303/0.5/bval-jsr303-0.5.jar
(242 KB at 1206.3 KB/sec)
2017-06-17\T\00:32:24.272 [INFO] Downloading: https://repo.maven.apache.org/maven2/org/apache/bval/bval-core/0.5/bval-core-0.5.jar
2017-06-17\T\00:32:24.298 [INFO] Downloaded: https://repo.maven.apache.org/maven2/org/apache/apex/apex-engine/3.6.0/apex-engine-3.6.0.jar
(1168 KB at 5141.8 KB/sec)
2017-06-17\T\00:32:24.298 [INFO] Downloading: https://repo.maven.apache.org/maven2/org/apache/apex/apex-bufferserver/3.6.0/apex-bufferserver-3.6.0.jar
2017-06-17\T\00:32:24.300 [INFO] Downloaded: https://repo.maven.apache.org/maven2/org/apache/bval/bval-core/0.5/bval-core-0.5.jar
(61 KB at 264.2 KB/sec)
2017-06-17\T\00:32:24.301 [INFO] Downloading: https://repo.maven.apache.org/maven2/com/sun/jersey/contribs/jersey-apache-client4/1.9/jersey-apache-client4-1.9.jar
2017-06-17\T\00:32:24.305 [INFO] Downloaded: https://repo.maven.apache.org/maven2/org/apache/apex/malhar-library/3.4.0/malhar-library-3.4.0.jar
(1508 KB at 6441.3 KB/sec)
2017-06-17\T\00:32:24.305 [INFO] Downloading: https://repo.maven.apache.org/maven2/org/apache/hadoop/hadoop-yarn-client/2.6.0/hadoop-yarn-client-2.6.0.jar
2017-06-17\T\00:32:24.327 [INFO] Downloaded: https://repo.maven.apache.org/maven2/com/sun/jersey/contribs/jersey-apache-client4/1.9/jersey-apache-client4-1.9.jar
(15 KB at 57.2 KB/sec)
2017-06-17\T\00:32:24.327 [INFO] Downloading: https://repo.maven.apache.org/maven2/org/apache/hadoop/hadoop-yarn-common/2.6.0/hadoop-yarn-common-2.6.0.jar
2017-06-17\T\00:32:24.329 [INFO] Downloaded: https://repo.maven.apache.org/maven2/org/apache/apex/apex-bufferserver/3.6.0/apex-bufferserver-3.6.0.jar
(104 KB at 402.1 KB/sec)
2017-06-17\T\00:32:24.329 [INFO] Downloading: https://repo.maven.apache.org/maven2/jline/jline/2.11/jline-2.11.jar
2017-06-17\T\00:32:24.340 [INFO] Downloaded: https://repo.maven.apache.org/maven2/org/apache/hadoop/hadoop-yarn-client/2.6.0/hadoop-yarn-client-2.6.0.jar
(125 KB at 464.6 KB/sec)
2017-06-17\T\00:32:24.340 [INFO] Downloading: https://repo.maven.apache.org/maven2/org/apache/ant/ant/1.9.2/ant-1.9.2.jar
2017-06-17\T\00:32:24.341 [INFO] Downloaded: https://repo.maven.apache.org/maven2/org/apache/apex/apex-shaded-ning19/1.0.0/apex-shaded-ning19-1.0.0.jar
(2164 KB at 8014.6 KB/sec)
2017-06-17\T\00:32:24.341 [INFO] Downloading: https://repo.maven.apache.org/maven2/org/apache/ant/ant-launcher/1.9.2/ant-launcher-1.9.2.jar
2017-06-17\T\00:32:24.363 [INFO] Downloaded: https://repo.maven.apache.org/maven2/jline/jline/2.11/jline-2.11.jar
(204 KB at 698.2 KB/sec)
2017-06-17\T\00:32:24.363 [INFO] Downloading: https://repo.maven.apache.org/maven2/net/engio/mbassador/1.1.9/mbassador-1.1.9.jar
2017-06-17\T\00:32:24.366 [INFO] Downloaded: https://repo.maven.apache.org/maven2/org/apache/ant/ant-launcher/1.9.2/ant-launcher-1.9.2.jar
(18 KB at 60.7 KB/sec)
2017-06-17\T\00:32:24.367 [INFO] Downloading: https://repo.maven.apache.org/maven2/net/lingala/zip4j/zip4j/1.3.2/zip4j-1.3.2.jar
2017-06-17\T\00:32:24.395 [INFO] Downloaded: https://repo.maven.apache.org/maven2/net/engio/mbassador/1.1.9/mbassador-1.1.9.jar
(77 KB at 236.2 KB/sec)
2017-06-17\T\00:32:24.395 [INFO] Downloading: https://repo.maven.apache.org/maven2/org/jctools/jctools-core/1.1/jctools-core-1.1.jar
2017-06-17\T\00:32:24.399 [INFO] Downloaded: https://repo.maven.apache.org/maven2/net/lingala/zip4j/zip4j/1.3.2/zip4j-1.3.2.jar
(129 KB at 391.2 KB/sec)
2017-06-17\T\00:32:24.399 [INFO] Downloading: https://repo.maven.apache.org/maven2/io/netty/netty-transport-native-epoll/4.1.8.Final/netty-transport-native-epoll-4.1.8.Final-linux-x86_64.jar
2017-06-17\T\00:32:24.426 [INFO] Downloaded: https://repo.maven.apache.org/maven2/org/jctools/jctools-core/1.1/jctools-core-1.1.jar
(98 KB at 275.3 KB/sec)
2017-06-17\T\00:32:24.426 [INFO] Downloading: https://repo.maven.apache.org/maven2/org/apache/spark/spark-core_2.10/1.6.2/spark-core_2.10-1.6.2.jar
2017-06-17\T\00:32:24.426 [INFO] Downloaded: https://repo.maven.apache.org/maven2/org/apache/hadoop/hadoop-yarn-common/2.6.0/hadoop-yarn-common-2.6.0.jar
(1565 KB at 4407.1 KB/sec)
2017-06-17\T\00:32:24.426 [INFO] Downloading: https://repo.maven.apache.org/maven2/org/apache/spark/spark-launcher_2.10/1.6.2/spark-launcher_2.10-1.6.2.jar
2017-06-17\T\00:32:24.431 [INFO] Downloaded: https://repo.maven.apache.org/maven2/io/netty/netty-transport-native-epoll/4.1.8.Final/netty-transport-native-epoll-4.1.8.Final-linux-x86_64.jar
(153 KB at 424.7 KB/sec)
2017-06-17\T\00:32:24.431 [INFO] Downloading: https://repo.maven.apache.org/maven2/org/apache/spark/spark-network-common_2.10/1.6.2/spark-network-common_2.10-1.6.2.jar
2017-06-17\T\00:32:24.455 [INFO] Downloaded: https://repo.maven.apache.org/maven2/org/apache/spark/spark-launcher_2.10/1.6.2/spark-launcher_2.10-1.6.2.jar
(64 KB at 165.9 KB/sec)
2017-06-17\T\00:32:24.455 [INFO] Downloading: https://repo.maven.apache.org/maven2/org/apache/spark/spark-network-shuffle_2.10/1.6.2/spark-network-shuffle_2.10-1.6.2.jar
2017-06-17\T\00:32:24.481 [INFO] Downloaded: https://repo.maven.apache.org/maven2/org/apache/ant/ant/1.9.2/ant-1.9.2.jar
(1954 KB at 4765.0 KB/sec)
2017-06-17\T\00:32:24.481 [INFO] Downloading: https://repo.maven.apache.org/maven2/org/apache/spark/spark-unsafe_2.10/1.6.2/spark-unsafe_2.10-1.6.2.jar
2017-06-17\T\00:32:24.482 [INFO] Downloaded: https://repo.maven.apache.org/maven2/org/apache/spark/spark-network-shuffle_2.10/1.6.2/spark-network-shuffle_2.10-1.6.2.jar
(54 KB at 130.7 KB/sec)
2017-06-17\T\00:32:24.482 [INFO] Downloading: https://repo.maven.apache.org/maven2/com/fasterxml/jackson/module/jackson-module-scala_2.10/2.8.8/jackson-module-scala_2.10-2.8.8.jar
2017-06-17\T\00:32:24.508 [INFO] Downloaded: https://repo.maven.apache.org/maven2/org/apache/spark/spark-unsafe_2.10/1.6.2/spark-unsafe_2.10-1.6.2.jar
(38 KB at 86.3 KB/sec)
2017-06-17\T\00:32:24.508 [INFO] Downloading: https://repo.maven.apache.org/maven2/org/scala-lang/scala-reflect/2.10.6/scala-reflect-2.10.6.jar
2017-06-17\T\00:32:24.532 [INFO] Downloaded: https://repo.maven.apache.org/maven2/com/fasterxml/jackson/module/jackson-module-scala_2.10/2.8.8/jackson-module-scala_2.10-2.8.8.jar
(494 KB at 1070.7 KB/sec)
2017-06-17\T\00:32:24.533 [INFO] Downloading: https://repo.maven.apache.org/maven2/com/fasterxml/jackson/module/jackson-module-paranamer/2.8.8/jackson-module-paranamer-2.8.8.jar
2017-06-17\T\00:32:24.560 [INFO] Downloaded: https://repo.maven.apache.org/maven2/com/fasterxml/jackson/module/jackson-module-paranamer/2.8.8/jackson-module-paranamer-2.8.8.jar
(42 KB at 85.8 KB/sec)
2017-06-17\T\00:32:24.560 [INFO] Downloading: https://repo.maven.apache.org/maven2/org/apache/spark/spark-streaming_2.10/1.6.2/spark-streaming_2.10-1.6.2.jar
2017-06-17\T\00:32:24.568 [INFO] Downloaded: https://repo.maven.apache.org/maven2/org/apache/spark/spark-network-common_2.10/1.6.2/spark-network-common_2.10-1.6.2.jar
(2298 KB at 4622.8 KB/sec)
2017-06-17\T\00:32:24.667 [INFO] Downloaded: https://repo.maven.apache.org/maven2/org/apache/spark/spark-streaming_2.10/1.6.2/spark-streaming_2.10-1.6.2.jar
(2005 KB at 3368.8 KB/sec)
2017-06-17\T\00:32:24.684 [INFO] Downloaded: https://repo.maven.apache.org/maven2/org/scala-lang/scala-reflect/2.10.6/scala-reflect-2.10.6.jar
(3132 KB at 5116.1 KB/sec)
2017-06-17\T\00:32:24.867 [INFO] Downloaded: https://repo.maven.apache.org/maven2/org/apache/spark/spark-core_2.10/1.6.2/spark-core_2.10-1.6.2.jar
(10957 KB at 13764.2 KB/sec)
2017-06-17\T\00:32:24.887 [INFO] Downloaded: https://repo.maven.apache.org/maven2/it/unimi/dsi/fastutil/7.0.6/fastutil-7.0.6.jar
(16937 KB at 20755.6 KB/sec)
2017-06-17\T\00:32:24.901 [INFO] 
2017-06-17\T\00:32:24.901 [INFO] --- maven-clean-plugin:3.0.0:clean (default-clean) @ beam-sdks-java-javadoc
---
2017-06-17\T\00:32:24.903 [INFO] Deleting <https://builds.apache.org/job/beam_PostCommit_Java_JDK_Versions_Test/jdk=JDK%201.7%20(latest),label=beam/ws/sdks/java/javadoc>
(includes = [**/*.pyc, **/*.egg-info/, **/sdks/python/LICENSE, **/sdks/python/NOTICE, **/sdks/python/README.md],
excludes = [])
2017-06-17\T\00:32:24.903 [INFO] 
2017-06-17\T\00:32:24.903 [INFO] --- maven-enforcer-plugin:1.4.1:enforce (enforce) @ beam-sdks-java-javadoc
---
2017-06-17\T\00:32:24.904 [INFO] Skipping Rule Enforcement.
2017-06-17\T\00:32:24.904 [INFO] 
2017-06-17\T\00:32:24.904 [INFO] --- maven-enforcer-plugin:1.4.1:enforce (enforce-banned-dependencies)
@ beam-sdks-java-javadoc ---
2017-06-17\T\00:32:25.005 [INFO] 
2017-06-17\T\00:32:25.005 [INFO] --- maven-remote-resources-plugin:1.5:process (process-resource-bundles)
@ beam-sdks-java-javadoc ---
2017-06-17\T\00:32:29.991 [INFO] 
2017-06-17\T\00:32:29.991 [INFO] --- maven-compiler-plugin:3.6.1:compile (default-compile)
@ beam-sdks-java-javadoc ---
2017-06-17\T\00:32:29.993 [INFO] No sources to compile
2017-06-17\T\00:32:29.993 [INFO] 
2017-06-17\T\00:32:29.993 [INFO] --- maven-compiler-plugin:3.6.1:compile (compile-package-info)
@ beam-sdks-java-javadoc ---
2017-06-17\T\00:32:29.995 [INFO] No sources to compile
2017-06-17\T\00:32:29.995 [INFO] 
2017-06-17\T\00:32:29.995 [INFO] --- build-helper-maven-plugin:3.0.0:regex-properties (render-artifact-id)
@ beam-sdks-java-javadoc ---
2017-06-17\T\00:32:29.995 [INFO] 
2017-06-17\T\00:32:29.995 [INFO] --- maven-site-plugin:3.5.1:attach-descriptor (attach-descriptor)
@ beam-sdks-java-javadoc ---
2017-06-17\T\00:32:29.996 [INFO] 
2017-06-17\T\00:32:29.996 [INFO] --- maven-antrun-plugin:1.8:run (document) @ beam-sdks-java-javadoc
---
2017-06-17\T\00:32:30.730 [INFO] Executing tasks

main:

javadoc:
     [copy] Copying 588 files to <https://builds.apache.org/job/beam_PostCommit_Java_JDK_Versions_Test/jdk=JDK%201.7%20(latest),label=beam/ws/sdks/java/javadoc/target/collected>
     [copy] Copying 446 files to <https://builds.apache.org/job/beam_PostCommit_Java_JDK_Versions_Test/jdk=JDK%201.7%20(latest),label=beam/ws/sdks/java/javadoc/target/collected>
  [javadoc] Generating Javadoc
  [javadoc] Javadoc execution
2017-06-17\T\00:32:37.164 [INFO] ------------------------------------------------------------------------
2017-06-17\T\00:32:37.164 [INFO] Reactor Summary:
2017-06-17\T\00:32:37.164 [INFO] 
2017-06-17\T\00:32:37.164 [INFO] Apache Beam :: Parent .............................. SUCCESS
[ 17.632 s]
2017-06-17\T\00:32:37.164 [INFO] Apache Beam :: SDKs :: Java :: Build Tools ......... SUCCESS
[  5.119 s]
2017-06-17\T\00:32:37.164 [INFO] Apache Beam :: SDKs ................................ SUCCESS
[  0.452 s]
2017-06-17\T\00:32:37.164 [INFO] Apache Beam :: SDKs :: Common ...................... SUCCESS
[  0.402 s]
2017-06-17\T\00:32:37.164 [INFO] Apache Beam :: SDKs :: Common :: Runner API ........ SUCCESS
[  6.293 s]
2017-06-17\T\00:32:37.164 [INFO] Apache Beam :: SDKs :: Common :: Fn API ............ SUCCESS
[  4.626 s]
2017-06-17\T\00:32:37.164 [INFO] Apache Beam :: SDKs :: Java ........................ SUCCESS
[  0.617 s]
2017-06-17\T\00:32:37.164 [INFO] Apache Beam :: SDKs :: Java :: Core ................ SUCCESS
[01:16 min]
2017-06-17\T\00:32:37.164 [INFO] Apache Beam :: Runners ............................. SUCCESS
[  0.431 s]
2017-06-17\T\00:32:37.164 [INFO] Apache Beam :: Runners :: Core Construction Java ... SUCCESS
[ 11.209 s]
2017-06-17\T\00:32:37.164 [INFO] Apache Beam :: Runners :: Core Java ................ SUCCESS
[ 24.718 s]
2017-06-17\T\00:32:37.164 [INFO] Apache Beam :: Runners :: Direct Java .............. SUCCESS
[03:00 min]
2017-06-17\T\00:32:37.164 [INFO] Apache Beam :: SDKs :: Java :: IO .................. SUCCESS
[  0.435 s]
2017-06-17\T\00:32:37.164 [INFO] Apache Beam :: SDKs :: Java :: IO :: Common ........ SUCCESS
[  2.659 s]
2017-06-17\T\00:32:37.164 [INFO] Apache Beam :: SDKs :: Java :: IO :: Cassandra ..... SUCCESS
[ 14.928 s]
2017-06-17\T\00:32:37.164 [INFO] Apache Beam :: SDKs :: Java :: IO :: Elasticsearch . SUCCESS
[ 23.279 s]
2017-06-17\T\00:32:37.164 [INFO] Apache Beam :: SDKs :: Java :: Extensions .......... SUCCESS
[  0.417 s]
2017-06-17\T\00:32:37.164 [INFO] Apache Beam :: SDKs :: Java :: Extensions :: Google Cloud
Platform Core SUCCESS [ 20.052 s]
2017-06-17\T\00:32:37.164 [INFO] Apache Beam :: SDKs :: Java :: Extensions :: Protobuf SUCCESS
[  8.010 s]
2017-06-17\T\00:32:37.164 [INFO] Apache Beam :: SDKs :: Java :: IO :: Google Cloud Platform
SUCCESS [ 51.027 s]
2017-06-17\T\00:32:37.164 [INFO] Apache Beam :: SDKs :: Java :: IO :: Hadoop Common . SUCCESS
[ 11.103 s]
2017-06-17\T\00:32:37.164 [INFO] Apache Beam :: SDKs :: Java :: IO :: Hadoop File System SUCCESS
[ 21.526 s]
2017-06-17\T\00:32:37.164 [INFO] Apache Beam :: SDKs :: Java :: IO :: Hadoop ........ SUCCESS
[  2.700 s]
2017-06-17\T\00:32:37.165 [INFO] Apache Beam :: SDKs :: Java :: IO :: Hadoop :: input-format
SUCCESS [  9.611 s]
2017-06-17\T\00:32:37.165 [INFO] Apache Beam :: SDKs :: Java :: IO :: HBase ......... SUCCESS
[ 50.807 s]
2017-06-17\T\00:32:37.165 [INFO] Apache Beam :: SDKs :: Java :: IO :: HCatalog ...... SUCCESS
[01:00 min]
2017-06-17\T\00:32:37.165 [INFO] Apache Beam :: Runners :: Google Cloud Dataflow .... SUCCESS
[05:42 min]
2017-06-17\T\00:32:37.165 [INFO] Apache Beam :: SDKs :: Java :: IO :: JDBC .......... SUCCESS
[ 21.537 s]
2017-06-17\T\00:32:37.165 [INFO] Apache Beam :: SDKs :: Java :: IO :: JMS ........... SUCCESS
[ 13.608 s]
2017-06-17\T\00:32:37.165 [INFO] Apache Beam :: SDKs :: Java :: IO :: Kafka ......... SUCCESS
[ 31.929 s]
2017-06-17\T\00:32:37.165 [INFO] Apache Beam :: SDKs :: Java :: IO :: Kinesis ....... SUCCESS
[ 14.553 s]
2017-06-17\T\00:32:37.165 [INFO] Apache Beam :: SDKs :: Java :: IO :: MongoDB ....... SUCCESS
[ 31.665 s]
2017-06-17\T\00:32:37.165 [INFO] Apache Beam :: SDKs :: Java :: IO :: MQTT .......... SUCCESS
[ 14.918 s]
2017-06-17\T\00:32:37.165 [INFO] Apache Beam :: SDKs :: Java :: IO :: XML ........... SUCCESS
[ 17.091 s]
2017-06-17\T\00:32:37.165 [INFO] Apache Beam :: SDKs :: Java :: Maven Archetypes .... SUCCESS
[  0.408 s]
2017-06-17\T\00:32:37.165 [INFO] Apache Beam :: SDKs :: Java :: Maven Archetypes :: Starter
SUCCESS [ 14.926 s]
2017-06-17\T\00:32:37.165 [INFO] Apache Beam :: Examples ............................ SUCCESS
[  0.414 s]
2017-06-17\T\00:32:37.165 [INFO] Apache Beam :: Examples :: Java .................... SUCCESS
[06:01 min]
2017-06-17\T\00:32:37.165 [INFO] Apache Beam :: SDKs :: Java :: Maven Archetypes :: Examples
SUCCESS [ 39.886 s]
2017-06-17\T\00:32:37.165 [INFO] Apache Beam :: SDKs :: Java :: Extensions :: Jackson SUCCESS
[  9.905 s]
2017-06-17\T\00:32:37.165 [INFO] Apache Beam :: SDKs :: Java :: Extensions :: Join library
SUCCESS [ 14.901 s]
2017-06-17\T\00:32:37.165 [INFO] Apache Beam :: SDKs :: Java :: Extensions :: Sorter  SUCCESS
[ 38.058 s]
2017-06-17\T\00:32:37.165 [INFO] Apache Beam :: Runners :: Flink .................... SUCCESS
[ 31.990 s]
2017-06-17\T\00:32:37.165 [INFO] Apache Beam :: Runners :: Spark .................... SUCCESS
[04:09 min]
2017-06-17\T\00:32:37.165 [INFO] Apache Beam :: SDKs :: Java :: Aggregated Javadoc .. FAILURE
[ 16.185 s]
2017-06-17\T\00:32:37.165 [INFO] ------------------------------------------------------------------------
2017-06-17\T\00:32:37.165 [INFO] BUILD FAILURE
2017-06-17\T\00:32:37.165 [INFO] ------------------------------------------------------------------------
2017-06-17\T\00:32:37.165 [INFO] Total time: 31:15 min
2017-06-17\T\00:32:37.165 [INFO] Finished at: 2017-06-17T00:32:37+00:00
2017-06-17\T\00:32:37.762 [INFO] Final Memory: 199M/2794M
2017-06-17\T\00:32:37.762 [INFO] ------------------------------------------------------------------------
2017-06-17\T\00:32:37.763 [ERROR] PermGen space -> [Help 1]
---------------------------------------------------
constituent[0]: file:/home/jenkins/tools/maven/apache-maven-3.3.3/lib/commons-lang-2.6.jar
constituent[1]: file:/home/jenkins/tools/maven/apache-maven-3.3.3/lib/plexus-interpolation-1.21.jar
constituent[2]: file:/home/jenkins/tools/maven/apache-maven-3.3.3/lib/org.eclipse.sisu.plexus-0.3.0.jar
constituent[3]: file:/home/jenkins/tools/maven/apache-maven-3.3.3/lib/plexus-utils-3.0.20.jar
constituent[4]: file:/home/jenkins/tools/maven/apache-maven-3.3.3/lib/wagon-file-2.9.jar
constituent[5]: file:/home/jenkins/tools/maven/apache-maven-3.3.3/lib/cdi-api-1.0.jar
constituent[6]: file:/home/jenkins/tools/maven/apache-maven-3.3.3/lib/wagon-http-shared-2.9.jar
constituent[7]: file:/home/jenkins/tools/maven/apache-maven-3.3.3/lib/aether-api-1.0.2.v20150114.jar
constituent[8]: file:/home/jenkins/tools/maven/apache-maven-3.3.3/lib/plexus-component-annotations-1.5.5.jar
constituent[9]: file:/home/jenkins/tools/maven/apache-maven-3.3.3/lib/jsoup-1.7.2.jar
constituent[10]: file:/home/jenkins/tools/maven/apache-maven-3.3.3/lib/wagon-http-2.9-shaded.jar
constituent[11]: file:/home/jenkins/tools/maven/apache-maven-3.3.3/lib/plexus-cipher-1.7.jar
constituent[12]: file:/home/jenkins/tools/maven/apache-maven-3.3.3/lib/org.eclipse.sisu.inject-0.3.0.jar
constituent[13]: file:/home/jenkins/tools/maven/apache-maven-3.3.3/lib/aether-spi-1.0.2.v20150114.jar
constituent[14]: file:/home/jenkins/tools/maven/apache-maven-3.3.3/lib/commons-cli-1.2.jar
constituent[15]: file:/home/jenkins/tools/maven/apache-maven-3.3.3/lib/aether-transport-wagon-1.0.2.v20150114.jar
constituent[16]: file:/home/jenkins/tools/maven/apache-maven-3.3.3/lib/javax.inject-1.jar
constituent[17]: file:/home/jenkins/tools/maven/apache-maven-3.3.3/lib/maven-compat-3.3.3.jar
constituent[18]: file:/home/jenkins/tools/maven/apache-maven-3.3.3/lib/maven-model-builder-3.3.3.jar
constituent[19]: file:/home/jenkins/tools/maven/apache-maven-3.3.3/lib/maven-settings-builder-3.3.3.jar
constituent[20]: file:/home/jenkins/tools/maven/apache-maven-3.3.3/lib/jsr250-api-1.0.jar
constituent[21]: file:/home/jenkins/tools/maven/apache-maven-3.3.3/lib/maven-model-3.3.3.jar
constituent[22]: file:/home/jenkins/tools/maven/apache-maven-3.3.3/lib/slf4j-simple-1.7.5.jar
constituent[23]: file:/home/jenkins/tools/maven/apache-maven-3.3.3/lib/wagon-provider-api-2.9.jar
constituent[24]: file:/home/jenkins/tools/maven/apache-maven-3.3.3/lib/maven-plugin-api-3.3.3.jar
constituent[25]: file:/home/jenkins/tools/maven/apache-maven-3.3.3/lib/commons-io-2.2.jar
constituent[26]: file:/home/jenkins/tools/maven/apache-maven-3.3.3/lib/maven-repository-metadata-3.3.3.jar
constituent[27]: file:/home/jenkins/tools/maven/apache-maven-3.3.3/lib/maven-core-3.3.3.jar
constituent[28]: file:/home/jenkins/tools/maven/apache-maven-3.3.3/lib/aether-connector-basic-1.0.2.v20150114.jar
constituent[29]: file:/home/jenkins/tools/maven/apache-maven-3.3.3/lib/sisu-guice-3.2.5-no_aop.jar
constituent[30]: file:/home/jenkins/tools/maven/apache-maven-3.3.3/lib/maven-artifact-3.3.3.jar
constituent[31]: file:/home/jenkins/tools/maven/apache-maven-3.3.3/lib/maven-builder-support-3.3.3.jar
constituent[32]: file:/home/jenkins/tools/maven/apache-maven-3.3.3/lib/aopalliance-1.0.jar
constituent[33]: file:/home/jenkins/tools/maven/apache-maven-3.3.3/lib/aether-impl-1.0.2.v20150114.jar
constituent[34]: file:/home/jenkins/tools/maven/apache-maven-3.3.3/lib/plexus-sec-dispatcher-1.3.jar
constituent[35]: file:/home/jenkins/tools/maven/apache-maven-3.3.3/lib/maven-settings-3.3.3.jar
constituent[36]: file:/home/jenkins/tools/maven/apache-maven-3.3.3/lib/aether-util-1.0.2.v20150114.jar
constituent[37]: file:/home/jenkins/tools/maven/apache-maven-3.3.3/lib/maven-embedder-3.3.3.jar
constituent[38]: file:/home/jenkins/tools/maven/apache-maven-3.3.3/lib/guava-18.0.jar
constituent[39]: file:/home/jenkins/tools/maven/apache-maven-3.3.3/lib/slf4j-api-1.7.5.jar
constituent[40]: file:/home/jenkins/tools/maven/apache-maven-3.3.3/lib/maven-aether-provider-3.3.3.jar
constituent[41]: file:/home/jenkins/tools/maven/apache-maven-3.3.3/conf/logging/
---------------------------------------------------
Exception in thread "main" 
Exception: java.lang.OutOfMemoryError thrown from the UncaughtExceptionHandler in thread "main"
Build step 'Invoke top-level Maven targets' marked build as failure
Not sending mail to unregistered user aljoscha.krettek@gmail.com
Not sending mail to unregistered user hepei.hp@alibaba-inc.com
Not sending mail to unregistered user klk@google.com
Not sending mail to unregistered user ccy@google.com
Not sending mail to unregistered user kirpichov@google.com

Mime
View raw message