beam-commits mailing list archives

Site index · List index
Message view « Date » · « Thread »
Top « Date » · « Thread »
From Apache Jenkins Server <jenk...@builds.apache.org>
Subject Build failed in Jenkins: beam_PostCommit_Java_JDK_Versions_Test » OpenJDK 8 (on Ubuntu only),beam #65
Date Fri, 09 Jun 2017 18:29:07 GMT
See <https://builds.apache.org/job/beam_PostCommit_Java_JDK_Versions_Test/jdk=OpenJDK%208%20(on%20Ubuntu%20only),label=beam/65/display/redirect>

------------------------------------------
[...truncated 1.37 MB...]
2017-06-09\T\18:28:52.183 [INFO] Downloaded: https://repo.maven.apache.org/maven2/org/scala-lang/scala-library/2.10.3/scala-library-2.10.3.pom
(2 KB at 76.8 KB/sec)
2017-06-09\T\18:28:52.185 [INFO] Downloading: https://repo.maven.apache.org/maven2/com/github/scopt/scopt_2.10/3.5.0/scopt_2.10-3.5.0.pom
2017-06-09\T\18:28:52.211 [INFO] Downloaded: https://repo.maven.apache.org/maven2/com/github/scopt/scopt_2.10/3.5.0/scopt_2.10-3.5.0.pom
(2 KB at 62.9 KB/sec)
2017-06-09\T\18:28:52.213 [INFO] Downloading: https://repo.maven.apache.org/maven2/com/twitter/chill_2.10/0.7.4/chill_2.10-0.7.4.pom
2017-06-09\T\18:28:52.241 [INFO] Downloaded: https://repo.maven.apache.org/maven2/com/twitter/chill_2.10/0.7.4/chill_2.10-0.7.4.pom
(3 KB at 82.8 KB/sec)
2017-06-09\T\18:28:52.243 [INFO] Downloading: https://repo.maven.apache.org/maven2/org/scala-lang/scala-library/2.10.5/scala-library-2.10.5.pom
2017-06-09\T\18:28:52.269 [INFO] Downloaded: https://repo.maven.apache.org/maven2/org/scala-lang/scala-library/2.10.5/scala-library-2.10.5.pom
(2 KB at 76.8 KB/sec)
2017-06-09\T\18:28:52.271 [INFO] Downloading: https://repo.maven.apache.org/maven2/com/twitter/chill-java/0.7.4/chill-java-0.7.4.pom
2017-06-09\T\18:28:52.297 [INFO] Downloaded: https://repo.maven.apache.org/maven2/com/twitter/chill-java/0.7.4/chill-java-0.7.4.pom
(2 KB at 76.4 KB/sec)
2017-06-09\T\18:28:52.299 [INFO] Downloading: https://repo.maven.apache.org/maven2/org/apache/flink/flink-optimizer_2.10/1.3.0/flink-optimizer_2.10-1.3.0.pom
2017-06-09\T\18:28:52.326 [INFO] Downloaded: https://repo.maven.apache.org/maven2/org/apache/flink/flink-optimizer_2.10/1.3.0/flink-optimizer_2.10-1.3.0.pom
(5 KB at 156.2 KB/sec)
2017-06-09\T\18:28:52.332 [INFO] Downloading: https://repo.maven.apache.org/maven2/org/apache/flink/flink-streaming-java_2.10/1.3.0/flink-streaming-java_2.10-1.3.0.pom
2017-06-09\T\18:28:52.358 [INFO] Downloaded: https://repo.maven.apache.org/maven2/org/apache/flink/flink-streaming-java_2.10/1.3.0/flink-streaming-java_2.10-1.3.0.pom
(7 KB at 231.9 KB/sec)
2017-06-09\T\18:28:52.362 [INFO] Downloading: https://repo.maven.apache.org/maven2/org/apache/sling/org.apache.sling.commons.json/2.0.6/org.apache.sling.commons.json-2.0.6.pom
2017-06-09\T\18:28:52.389 [INFO] Downloaded: https://repo.maven.apache.org/maven2/org/apache/sling/org.apache.sling.commons.json/2.0.6/org.apache.sling.commons.json-2.0.6.pom
(4 KB at 117.2 KB/sec)
2017-06-09\T\18:28:52.390 [INFO] Downloading: https://repo.maven.apache.org/maven2/org/apache/sling/sling/10/sling-10.pom
2017-06-09\T\18:28:52.419 [INFO] Downloaded: https://repo.maven.apache.org/maven2/org/apache/sling/sling/10/sling-10.pom
(26 KB at 864.3 KB/sec)
2017-06-09\T\18:28:52.421 [INFO] Downloading: https://repo.maven.apache.org/maven2/org/apache/apache/8/apache-8.pom
2017-06-09\T\18:28:52.448 [INFO] Downloaded: https://repo.maven.apache.org/maven2/org/apache/apache/8/apache-8.pom
(14 KB at 508.3 KB/sec)
2017-06-09\T\18:28:52.461 [INFO] Downloading: https://repo.maven.apache.org/maven2/org/apache/flink/flink-test-utils_2.10/1.3.0/flink-test-utils_2.10-1.3.0.pom
2017-06-09\T\18:28:52.487 [INFO] Downloaded: https://repo.maven.apache.org/maven2/org/apache/flink/flink-test-utils_2.10/1.3.0/flink-test-utils_2.10-1.3.0.pom
(5 KB at 178.1 KB/sec)
2017-06-09\T\18:28:52.489 [INFO] Downloading: https://repo.maven.apache.org/maven2/org/apache/flink/flink-test-utils-parent/1.3.0/flink-test-utils-parent-1.3.0.pom
2017-06-09\T\18:28:52.517 [INFO] Downloaded: https://repo.maven.apache.org/maven2/org/apache/flink/flink-test-utils-parent/1.3.0/flink-test-utils-parent-1.3.0.pom
(2 KB at 50.3 KB/sec)
2017-06-09\T\18:28:52.521 [INFO] Downloading: https://repo.maven.apache.org/maven2/org/apache/flink/flink-test-utils-junit/1.3.0/flink-test-utils-junit-1.3.0.pom
2017-06-09\T\18:28:52.549 [INFO] Downloaded: https://repo.maven.apache.org/maven2/org/apache/flink/flink-test-utils-junit/1.3.0/flink-test-utils-junit-1.3.0.pom
(4 KB at 114.6 KB/sec)
2017-06-09\T\18:28:52.554 [INFO] Downloading: https://repo.maven.apache.org/maven2/org/apache/curator/curator-test/2.12.0/curator-test-2.12.0.pom
2017-06-09\T\18:28:52.583 [INFO] Downloaded: https://repo.maven.apache.org/maven2/org/apache/curator/curator-test/2.12.0/curator-test-2.12.0.pom
(5 KB at 139.6 KB/sec)
2017-06-09\T\18:28:52.584 [INFO] Downloading: https://repo.maven.apache.org/maven2/org/apache/curator/apache-curator/2.12.0/apache-curator-2.12.0.pom
2017-06-09\T\18:28:52.613 [INFO] Downloaded: https://repo.maven.apache.org/maven2/org/apache/curator/apache-curator/2.12.0/apache-curator-2.12.0.pom
(32 KB at 1088.7 KB/sec)
2017-06-09\T\18:28:52.617 [INFO] Downloading: https://repo.maven.apache.org/maven2/org/apache/zookeeper/zookeeper/3.4.8/zookeeper-3.4.8.pom
2017-06-09\T\18:28:52.644 [INFO] Downloaded: https://repo.maven.apache.org/maven2/org/apache/zookeeper/zookeeper/3.4.8/zookeeper-3.4.8.pom
(4 KB at 145.6 KB/sec)
2017-06-09\T\18:28:52.646 [INFO] Downloading: https://repo.maven.apache.org/maven2/org/javassist/javassist/3.18.1-GA/javassist-3.18.1-GA.pom
2017-06-09\T\18:28:52.672 [INFO] Downloaded: https://repo.maven.apache.org/maven2/org/javassist/javassist/3.18.1-GA/javassist-3.18.1-GA.pom
(10 KB at 357.6 KB/sec)
2017-06-09\T\18:28:52.687 [INFO] Downloading: https://repo.maven.apache.org/maven2/org/apache/flink/flink-clients_2.10/1.3.0/flink-clients_2.10-1.3.0.jar
2017-06-09\T\18:28:52.687 [INFO] Downloading: https://repo.maven.apache.org/maven2/org/apache/flink/flink-optimizer_2.10/1.3.0/flink-optimizer_2.10-1.3.0.jar
2017-06-09\T\18:28:52.687 [INFO] Downloading: https://repo.maven.apache.org/maven2/org/apache/flink/force-shading/1.3.0/force-shading-1.3.0.jar
2017-06-09\T\18:28:52.687 [INFO] Downloading: https://repo.maven.apache.org/maven2/org/apache/flink/flink-core/1.3.0/flink-core-1.3.0.jar
2017-06-09\T\18:28:52.688 [INFO] Downloading: https://repo.maven.apache.org/maven2/org/apache/flink/flink-annotations/1.3.0/flink-annotations-1.3.0.jar
2017-06-09\T\18:28:52.716 [INFO] Downloaded: https://repo.maven.apache.org/maven2/org/apache/flink/force-shading/1.3.0/force-shading-1.3.0.jar
(8 KB at 245.2 KB/sec)
2017-06-09\T\18:28:52.716 [INFO] Downloading: https://repo.maven.apache.org/maven2/com/esotericsoftware/kryo/kryo/2.24.0/kryo-2.24.0.jar
2017-06-09\T\18:28:52.717 [INFO] Downloaded: https://repo.maven.apache.org/maven2/org/apache/flink/flink-annotations/1.3.0/flink-annotations-1.3.0.jar
(8 KB at 240.4 KB/sec)
2017-06-09\T\18:28:52.717 [INFO] Downloading: https://repo.maven.apache.org/maven2/org/objenesis/objenesis/2.1/objenesis-2.1.jar
2017-06-09\T\18:28:52.720 [INFO] Downloaded: https://repo.maven.apache.org/maven2/org/apache/flink/flink-clients_2.10/1.3.0/flink-clients_2.10-1.3.0.jar
(89 KB at 2609.1 KB/sec)
2017-06-09\T\18:28:52.720 [INFO] Downloading: https://repo.maven.apache.org/maven2/org/apache/flink/flink-metrics-core/1.3.0/flink-metrics-core-1.3.0.jar
2017-06-09\T\18:28:52.745 [INFO] Downloaded: https://repo.maven.apache.org/maven2/org/objenesis/objenesis/2.1/objenesis-2.1.jar
(41 KB at 715.4 KB/sec)
2017-06-09\T\18:28:52.745 [INFO] Downloading: https://repo.maven.apache.org/maven2/org/apache/flink/flink-java/1.3.0/flink-java-1.3.0.jar
2017-06-09\T\18:28:52.747 [INFO] Downloaded: https://repo.maven.apache.org/maven2/org/apache/flink/flink-metrics-core/1.3.0/flink-metrics-core-1.3.0.jar
(16 KB at 264.7 KB/sec)
2017-06-09\T\18:28:52.747 [INFO] Downloading: https://repo.maven.apache.org/maven2/org/apache/flink/flink-shaded-hadoop2/1.3.0/flink-shaded-hadoop2-1.3.0.jar
2017-06-09\T\18:28:52.762 [INFO] Downloaded: https://repo.maven.apache.org/maven2/com/esotericsoftware/kryo/kryo/2.24.0/kryo-2.24.0.jar
(332 KB at 4417.7 KB/sec)
2017-06-09\T\18:28:52.762 [INFO] Downloading: https://repo.maven.apache.org/maven2/commons-configuration/commons-configuration/1.7/commons-configuration-1.7.jar
2017-06-09\T\18:28:52.817 [INFO] Downloaded: https://repo.maven.apache.org/maven2/org/apache/flink/flink-core/1.3.0/flink-core-1.3.0.jar
(1362 KB at 10473.1 KB/sec)
2017-06-09\T\18:28:52.817 [INFO] Downloading: https://repo.maven.apache.org/maven2/commons-digester/commons-digester/1.8.1/commons-digester-1.8.1.jar
2017-06-09\T\18:28:52.825 [INFO] Downloaded: https://repo.maven.apache.org/maven2/commons-configuration/commons-configuration/1.7/commons-configuration-1.7.jar
(343 KB at 2497.2 KB/sec)
2017-06-09\T\18:28:52.825 [INFO] Downloading: https://repo.maven.apache.org/maven2/commons-beanutils/commons-beanutils-bean-collections/1.8.3/commons-beanutils-bean-collections-1.8.3.jar
2017-06-09\T\18:28:52.835 [INFO] Downloaded: https://repo.maven.apache.org/maven2/org/apache/flink/flink-java/1.3.0/flink-java-1.3.0.jar
(752 KB at 5114.8 KB/sec)
2017-06-09\T\18:28:52.835 [INFO] Downloading: https://repo.maven.apache.org/maven2/org/apache/commons/commons-math3/3.5/commons-math3-3.5.jar
2017-06-09\T\18:28:52.850 [INFO] Downloaded: https://repo.maven.apache.org/maven2/commons-digester/commons-digester/1.8.1/commons-digester-1.8.1.jar
(143 KB at 880.8 KB/sec)
2017-06-09\T\18:28:52.850 [INFO] Downloading: https://repo.maven.apache.org/maven2/org/apache/flink/flink-runtime_2.10/1.3.0/flink-runtime_2.10-1.3.0.jar
2017-06-09\T\18:28:52.855 [INFO] Downloaded: https://repo.maven.apache.org/maven2/commons-beanutils/commons-beanutils-bean-collections/1.8.3/commons-beanutils-bean-collections-1.8.3.jar
(26 KB at 155.4 KB/sec)
2017-06-09\T\18:28:52.855 [INFO] Downloading: https://repo.maven.apache.org/maven2/io/netty/netty-all/4.0.27.Final/netty-all-4.0.27.Final.jar
2017-06-09\T\18:28:52.977 [INFO] Downloaded: https://repo.maven.apache.org/maven2/org/apache/flink/flink-optimizer_2.10/1.3.0/flink-optimizer_2.10-1.3.0.jar
(2679 KB at 9237.7 KB/sec)
2017-06-09\T\18:28:52.977 [INFO] Downloading: https://repo.maven.apache.org/maven2/org/javassist/javassist/3.18.2-GA/javassist-3.18.2-GA.jar
2017-06-09\T\18:28:53.041 [INFO] Downloaded: https://repo.maven.apache.org/maven2/io/netty/netty-all/4.0.27.Final/netty-all-4.0.27.Final.jar
(1894 KB at 5365.3 KB/sec)
2017-06-09\T\18:28:53.041 [INFO] Downloading: https://repo.maven.apache.org/maven2/org/scala-lang/scala-library/2.10.4/scala-library-2.10.4.jar
2017-06-09\T\18:28:53.085 [INFO] Downloaded: https://repo.maven.apache.org/maven2/org/apache/commons/commons-math3/3.5/commons-math3-3.5.jar
(1991 KB at 5014.4 KB/sec)
2017-06-09\T\18:28:53.085 [INFO] Downloading: https://repo.maven.apache.org/maven2/com/data-artisans/flakka-actor_2.10/2.3-custom/flakka-actor_2.10-2.3-custom.jar
2017-06-09\T\18:28:53.092 [INFO] Downloaded: https://repo.maven.apache.org/maven2/org/javassist/javassist/3.18.2-GA/javassist-3.18.2-GA.jar
(698 KB at 1727.2 KB/sec)
2017-06-09\T\18:28:53.092 [INFO] Downloading: https://repo.maven.apache.org/maven2/com/typesafe/config/1.2.1/config-1.2.1.jar
2017-06-09\T\18:28:53.140 [INFO] Downloaded: https://repo.maven.apache.org/maven2/com/typesafe/config/1.2.1/config-1.2.1.jar
(215 KB at 474.4 KB/sec)
2017-06-09\T\18:28:53.140 [INFO] Downloading: https://repo.maven.apache.org/maven2/com/data-artisans/flakka-remote_2.10/2.3-custom/flakka-remote_2.10-2.3-custom.jar
2017-06-09\T\18:28:53.393 [INFO] Downloaded: https://repo.maven.apache.org/maven2/com/data-artisans/flakka-remote_2.10/2.3-custom/flakka-remote_2.10-2.3-custom.jar
(1347 KB at 1910.6 KB/sec)
2017-06-09\T\18:28:53.393 [INFO] Downloading: https://repo.maven.apache.org/maven2/io/netty/netty/3.8.0.Final/netty-3.8.0.Final.jar
2017-06-09\T\18:28:53.457 [INFO] Downloaded: https://repo.maven.apache.org/maven2/com/data-artisans/flakka-actor_2.10/2.3-custom/flakka-actor_2.10-2.3-custom.jar
(2754 KB at 3580.6 KB/sec)
2017-06-09\T\18:28:53.457 [INFO] Downloading: https://repo.maven.apache.org/maven2/org/uncommons/maths/uncommons-maths/1.2.2a/uncommons-maths-1.2.2a.jar
2017-06-09\T\18:28:53.490 [INFO] Downloaded: https://repo.maven.apache.org/maven2/org/uncommons/maths/uncommons-maths/1.2.2a/uncommons-maths-1.2.2a.jar
(48 KB at 59.7 KB/sec)
2017-06-09\T\18:28:53.490 [INFO] Downloading: https://repo.maven.apache.org/maven2/com/data-artisans/flakka-slf4j_2.10/2.3-custom/flakka-slf4j_2.10-2.3-custom.jar
2017-06-09\T\18:28:53.520 [INFO] Downloaded: https://repo.maven.apache.org/maven2/com/data-artisans/flakka-slf4j_2.10/2.3-custom/flakka-slf4j_2.10-2.3-custom.jar
(16 KB at 18.2 KB/sec)
2017-06-09\T\18:28:53.520 [INFO] Downloading: https://repo.maven.apache.org/maven2/org/clapper/grizzled-slf4j_2.10/1.0.2/grizzled-slf4j_2.10-1.0.2.jar
2017-06-09\T\18:28:53.548 [INFO] Downloaded: https://repo.maven.apache.org/maven2/org/clapper/grizzled-slf4j_2.10/1.0.2/grizzled-slf4j_2.10-1.0.2.jar
(7 KB at 7.3 KB/sec)
2017-06-09\T\18:28:53.548 [INFO] Downloading: https://repo.maven.apache.org/maven2/com/github/scopt/scopt_2.10/3.5.0/scopt_2.10-3.5.0.jar
2017-06-09\T\18:28:53.552 [INFO] Downloaded: https://repo.maven.apache.org/maven2/io/netty/netty/3.8.0.Final/netty-3.8.0.Final.jar
(1202 KB at 1390.5 KB/sec)
2017-06-09\T\18:28:53.552 [INFO] Downloading: https://repo.maven.apache.org/maven2/jline/jline/0.9.94/jline-0.9.94.jar
2017-06-09\T\18:28:53.588 [INFO] Downloaded: https://repo.maven.apache.org/maven2/jline/jline/0.9.94/jline-0.9.94.jar
(86 KB at 94.8 KB/sec)
2017-06-09\T\18:28:53.589 [INFO] Downloading: https://repo.maven.apache.org/maven2/com/twitter/chill_2.10/0.7.4/chill_2.10-0.7.4.jar
2017-06-09\T\18:28:53.592 [INFO] Downloaded: https://repo.maven.apache.org/maven2/com/github/scopt/scopt_2.10/3.5.0/scopt_2.10-3.5.0.jar
(140 KB at 154.6 KB/sec)
2017-06-09\T\18:28:53.592 [INFO] Downloading: https://repo.maven.apache.org/maven2/com/twitter/chill-java/0.7.4/chill-java-0.7.4.jar
2017-06-09\T\18:28:53.602 [INFO] Downloaded: https://repo.maven.apache.org/maven2/org/scala-lang/scala-library/2.10.4/scala-library-2.10.4.jar
(6960 KB at 7614.2 KB/sec)
2017-06-09\T\18:28:53.602 [INFO] Downloading: https://repo.maven.apache.org/maven2/org/apache/flink/flink-streaming-java_2.10/1.3.0/flink-streaming-java_2.10-1.3.0.jar
2017-06-09\T\18:28:53.624 [INFO] Downloaded: https://repo.maven.apache.org/maven2/com/twitter/chill-java/0.7.4/chill-java-0.7.4.jar
(50 KB at 52.5 KB/sec)
2017-06-09\T\18:28:53.624 [INFO] Downloading: https://repo.maven.apache.org/maven2/org/apache/sling/org.apache.sling.commons.json/2.0.6/org.apache.sling.commons.json-2.0.6.jar
2017-06-09\T\18:28:53.633 [INFO] Downloaded: https://repo.maven.apache.org/maven2/com/twitter/chill_2.10/0.7.4/chill_2.10-0.7.4.jar
(217 KB at 228.6 KB/sec)
2017-06-09\T\18:28:53.634 [INFO] Downloading: https://repo.maven.apache.org/maven2/org/apache/flink/flink-core/1.3.0/flink-core-1.3.0-tests.jar
2017-06-09\T\18:28:53.656 [INFO] Downloaded: https://repo.maven.apache.org/maven2/org/apache/sling/org.apache.sling.commons.json/2.0.6/org.apache.sling.commons.json-2.0.6.jar
(47 KB at 48.3 KB/sec)
2017-06-09\T\18:28:53.656 [INFO] Downloading: https://repo.maven.apache.org/maven2/org/apache/flink/flink-runtime_2.10/1.3.0/flink-runtime_2.10-1.3.0-tests.jar
2017-06-09\T\18:28:53.680 [INFO] Downloaded: https://repo.maven.apache.org/maven2/org/apache/flink/flink-runtime_2.10/1.3.0/flink-runtime_2.10-1.3.0.jar
(9005 KB at 9076.7 KB/sec)
2017-06-09\T\18:28:53.680 [INFO] Downloading: https://repo.maven.apache.org/maven2/org/apache/flink/flink-streaming-java_2.10/1.3.0/flink-streaming-java_2.10-1.3.0-tests.jar
2017-06-09\T\18:28:53.724 [INFO] Downloaded: https://repo.maven.apache.org/maven2/org/apache/flink/flink-core/1.3.0/flink-core-1.3.0-tests.jar
(753 KB at 726.7 KB/sec)
2017-06-09\T\18:28:53.724 [INFO] Downloading: https://repo.maven.apache.org/maven2/org/apache/flink/flink-test-utils_2.10/1.3.0/flink-test-utils_2.10-1.3.0.jar
2017-06-09\T\18:28:53.801 [INFO] Downloaded: https://repo.maven.apache.org/maven2/org/apache/flink/flink-streaming-java_2.10/1.3.0/flink-streaming-java_2.10-1.3.0-tests.jar
(1133 KB at 1017.7 KB/sec)
2017-06-09\T\18:28:53.801 [INFO] Downloading: https://repo.maven.apache.org/maven2/org/apache/flink/flink-test-utils-junit/1.3.0/flink-test-utils-junit-1.3.0.jar
2017-06-09\T\18:28:53.831 [INFO] Downloaded: https://repo.maven.apache.org/maven2/org/apache/flink/flink-test-utils-junit/1.3.0/flink-test-utils-junit-1.3.0.jar
(26 KB at 22.2 KB/sec)
2017-06-09\T\18:28:53.831 [INFO] Downloading: https://repo.maven.apache.org/maven2/org/apache/curator/curator-test/2.12.0/curator-test-2.12.0.jar
2017-06-09\T\18:28:53.880 [INFO] Downloaded: https://repo.maven.apache.org/maven2/org/apache/flink/flink-runtime_2.10/1.3.0/flink-runtime_2.10-1.3.0-tests.jar
(2841 KB at 2383.0 KB/sec)
2017-06-09\T\18:28:53.947 [INFO] Downloaded: https://repo.maven.apache.org/maven2/org/apache/flink/flink-test-utils_2.10/1.3.0/flink-test-utils_2.10-1.3.0.jar
(2365 KB at 1877.9 KB/sec)
2017-06-09\T\18:28:53.982 [INFO] Downloaded: https://repo.maven.apache.org/maven2/org/apache/curator/curator-test/2.12.0/curator-test-2.12.0.jar
(2368 KB at 1829.7 KB/sec)
2017-06-09\T\18:28:54.039 [INFO] Downloaded: https://repo.maven.apache.org/maven2/org/apache/flink/flink-shaded-hadoop2/1.3.0/flink-shaded-hadoop2-1.3.0.jar
(16586 KB at 12276.3 KB/sec)
2017-06-09\T\18:28:54.201 [INFO] Downloaded: https://repo.maven.apache.org/maven2/org/apache/flink/flink-streaming-java_2.10/1.3.0/flink-streaming-java_2.10-1.3.0.jar
(3128 KB at 2067.0 KB/sec)
2017-06-09\T\18:28:54.213 [INFO] 
2017-06-09\T\18:28:54.213 [INFO] --- maven-clean-plugin:3.0.0:clean (default-clean) @ beam-runners-flink_2.10
---
2017-06-09\T\18:28:54.214 [INFO] Deleting <https://builds.apache.org/job/beam_PostCommit_Java_JDK_Versions_Test/jdk=OpenJDK%208%20(on%20Ubuntu%20only),label=beam/ws/runners/flink>
(includes = [**/*.pyc, **/*.egg-info/, **/sdks/python/LICENSE, **/sdks/python/NOTICE, **/sdks/python/README.md],
excludes = [])
2017-06-09\T\18:28:54.217 [INFO] 
2017-06-09\T\18:28:54.217 [INFO] --- maven-enforcer-plugin:1.4.1:enforce (enforce) @ beam-runners-flink_2.10
---
2017-06-09\T\18:28:55.833 [INFO] 
2017-06-09\T\18:28:55.833 [INFO] --- maven-enforcer-plugin:1.4.1:enforce (enforce-banned-dependencies)
@ beam-runners-flink_2.10 ---
2017-06-09\T\18:28:55.850 [INFO] 
2017-06-09\T\18:28:55.851 [INFO] --- maven-remote-resources-plugin:1.5:process (process-resource-bundles)
@ beam-runners-flink_2.10 ---
2017-06-09\T\18:28:56.361 [INFO] 
2017-06-09\T\18:28:56.361 [INFO] --- maven-resources-plugin:3.0.2:resources (default-resources)
@ beam-runners-flink_2.10 ---
2017-06-09\T\18:28:56.362 [INFO] Using 'UTF-8' encoding to copy filtered resources.
2017-06-09\T\18:28:56.362 [INFO] Copying 1 resource
2017-06-09\T\18:28:56.384 [INFO] Copying 3 resources
2017-06-09\T\18:28:56.386 [INFO] 
2017-06-09\T\18:28:56.386 [INFO] --- maven-compiler-plugin:3.6.1:compile (default-compile)
@ beam-runners-flink_2.10 ---
2017-06-09\T\18:28:56.400 [INFO] Changes detected - recompiling the module!
2017-06-09\T\18:28:56.401 [INFO] Compiling 65 source files to <https://builds.apache.org/job/beam_PostCommit_Java_JDK_Versions_Test/jdk=OpenJDK%208%20(on%20Ubuntu%20only),label=beam/ws/runners/flink/target/classes>
2017-06-09\T\18:28:57.542 [INFO] <https://builds.apache.org/job/beam_PostCommit_Java_JDK_Versions_Test/jdk=OpenJDK%208%20(on%20Ubuntu%20only),label=beam/ws/runners/flink/src/main/java/org/apache/beam/runners/flink/translation/wrappers/streaming/io/DedupingOperator.java>:
Some input files use or override a deprecated API.
2017-06-09\T\18:28:57.542 [INFO] <https://builds.apache.org/job/beam_PostCommit_Java_JDK_Versions_Test/jdk=OpenJDK%208%20(on%20Ubuntu%20only),label=beam/ws/runners/flink/src/main/java/org/apache/beam/runners/flink/translation/wrappers/streaming/io/DedupingOperator.java>:
Recompile with -Xlint:deprecation for details.
2017-06-09\T\18:28:57.542 [INFO] <https://builds.apache.org/job/beam_PostCommit_Java_JDK_Versions_Test/jdk=OpenJDK%208%20(on%20Ubuntu%20only),label=beam/ws/runners/flink/src/main/java/org/apache/beam/runners/flink/translation/wrappers/streaming/SingletonKeyedWorkItem.java>:
Some input files use unchecked or unsafe operations.
2017-06-09\T\18:28:57.542 [INFO] <https://builds.apache.org/job/beam_PostCommit_Java_JDK_Versions_Test/jdk=OpenJDK%208%20(on%20Ubuntu%20only),label=beam/ws/runners/flink/src/main/java/org/apache/beam/runners/flink/translation/wrappers/streaming/SingletonKeyedWorkItem.java>:
Recompile with -Xlint:unchecked for details.
2017-06-09\T\18:28:57.542 [INFO] -------------------------------------------------------------
2017-06-09\T\18:28:57.542 [ERROR] COMPILATION ERROR : 
2017-06-09\T\18:28:57.542 [INFO] -------------------------------------------------------------
2017-06-09\T\18:28:57.542 [ERROR] <https://builds.apache.org/job/beam_PostCommit_Java_JDK_Versions_Test/jdk=OpenJDK%208%20(on%20Ubuntu%20only),label=beam/ws/runners/flink/src/main/java/org/apache/beam/runners/flink/FlinkStreamingTransformTranslators.java>:[366,27]
method put in interface java.util.Map<K,V> cannot be applied to given types;
  required: org.apache.beam.sdk.values.TupleTag<?>,org.apache.flink.util.OutputTag<org.apache.beam.sdk.util.WindowedValue<?>>
  found: org.apache.beam.sdk.values.TupleTag<capture#1 of ?>,org.apache.flink.util.OutputTag<java.lang.Object>
  reason: actual argument org.apache.flink.util.OutputTag<java.lang.Object> cannot be
converted to org.apache.flink.util.OutputTag<org.apache.beam.sdk.util.WindowedValue<?>>
by method invocation conversion
2017-06-09\T\18:28:57.542 [INFO] 1 error
2017-06-09\T\18:28:57.542 [INFO] -------------------------------------------------------------
2017-06-09\T\18:28:57.543 [INFO] ------------------------------------------------------------------------
2017-06-09\T\18:28:57.543 [INFO] Reactor Summary:
2017-06-09\T\18:28:57.543 [INFO] 
2017-06-09\T\18:28:57.543 [INFO] Apache Beam :: Parent .............................. SUCCESS
[ 18.517 s]
2017-06-09\T\18:28:57.543 [INFO] Apache Beam :: SDKs :: Java :: Build Tools ......... SUCCESS
[  6.846 s]
2017-06-09\T\18:28:57.543 [INFO] Apache Beam :: SDKs ................................ SUCCESS
[  0.605 s]
2017-06-09\T\18:28:57.543 [INFO] Apache Beam :: SDKs :: Common ...................... SUCCESS
[  0.414 s]
2017-06-09\T\18:28:57.543 [INFO] Apache Beam :: SDKs :: Common :: Runner API ........ SUCCESS
[  6.753 s]
2017-06-09\T\18:28:57.543 [INFO] Apache Beam :: SDKs :: Common :: Fn API ............ SUCCESS
[  4.577 s]
2017-06-09\T\18:28:57.544 [INFO] Apache Beam :: SDKs :: Java ........................ SUCCESS
[  0.447 s]
2017-06-09\T\18:28:57.544 [INFO] Apache Beam :: SDKs :: Java :: Core ................ SUCCESS
[01:15 min]
2017-06-09\T\18:28:57.544 [INFO] Apache Beam :: Runners ............................. SUCCESS
[  0.435 s]
2017-06-09\T\18:28:57.544 [INFO] Apache Beam :: Runners :: Core Construction Java ... SUCCESS
[ 10.950 s]
2017-06-09\T\18:28:57.544 [INFO] Apache Beam :: Runners :: Core Java ................ SUCCESS
[ 24.963 s]
2017-06-09\T\18:28:57.544 [INFO] Apache Beam :: Runners :: Direct Java .............. SUCCESS
[02:50 min]
2017-06-09\T\18:28:57.544 [INFO] Apache Beam :: SDKs :: Java :: IO .................. SUCCESS
[  0.420 s]
2017-06-09\T\18:28:57.544 [INFO] Apache Beam :: SDKs :: Java :: IO :: Common ........ SUCCESS
[  2.667 s]
2017-06-09\T\18:28:57.544 [INFO] Apache Beam :: SDKs :: Java :: IO :: Cassandra ..... SUCCESS
[ 14.133 s]
2017-06-09\T\18:28:57.544 [INFO] Apache Beam :: SDKs :: Java :: IO :: Elasticsearch . SUCCESS
[ 23.558 s]
2017-06-09\T\18:28:57.544 [INFO] Apache Beam :: SDKs :: Java :: Extensions .......... SUCCESS
[  0.416 s]
2017-06-09\T\18:28:57.544 [INFO] Apache Beam :: SDKs :: Java :: Extensions :: Google Cloud
Platform Core SUCCESS [ 19.723 s]
2017-06-09\T\18:28:57.544 [INFO] Apache Beam :: SDKs :: Java :: Extensions :: Protobuf SUCCESS
[  8.174 s]
2017-06-09\T\18:28:57.544 [INFO] Apache Beam :: SDKs :: Java :: IO :: Google Cloud Platform
SUCCESS [ 51.921 s]
2017-06-09\T\18:28:57.544 [INFO] Apache Beam :: SDKs :: Java :: IO :: Hadoop Common . SUCCESS
[ 11.461 s]
2017-06-09\T\18:28:57.544 [INFO] Apache Beam :: SDKs :: Java :: IO :: Hadoop File System SUCCESS
[ 21.054 s]
2017-06-09\T\18:28:57.544 [INFO] Apache Beam :: SDKs :: Java :: IO :: Hadoop ........ SUCCESS
[  2.867 s]
2017-06-09\T\18:28:57.544 [INFO] Apache Beam :: SDKs :: Java :: IO :: Hadoop :: input-format
SUCCESS [  9.436 s]
2017-06-09\T\18:28:57.544 [INFO] Apache Beam :: SDKs :: Java :: IO :: HBase ......... SUCCESS
[ 49.646 s]
2017-06-09\T\18:28:57.544 [INFO] Apache Beam :: SDKs :: Java :: IO :: HCatalog ...... SUCCESS
[ 52.028 s]
2017-06-09\T\18:28:57.544 [INFO] Apache Beam :: Runners :: Google Cloud Dataflow .... SUCCESS
[05:33 min]
2017-06-09\T\18:28:57.544 [INFO] Apache Beam :: SDKs :: Java :: IO :: JDBC .......... SUCCESS
[ 18.493 s]
2017-06-09\T\18:28:57.544 [INFO] Apache Beam :: SDKs :: Java :: IO :: JMS ........... SUCCESS
[ 10.267 s]
2017-06-09\T\18:28:57.544 [INFO] Apache Beam :: SDKs :: Java :: IO :: Kafka ......... SUCCESS
[ 23.003 s]
2017-06-09\T\18:28:57.544 [INFO] Apache Beam :: SDKs :: Java :: IO :: Kinesis ....... SUCCESS
[ 11.811 s]
2017-06-09\T\18:28:57.544 [INFO] Apache Beam :: SDKs :: Java :: IO :: MongoDB ....... SUCCESS
[ 22.001 s]
2017-06-09\T\18:28:57.544 [INFO] Apache Beam :: SDKs :: Java :: IO :: MQTT .......... SUCCESS
[ 10.473 s]
2017-06-09\T\18:28:57.544 [INFO] Apache Beam :: SDKs :: Java :: IO :: XML ........... SUCCESS
[ 13.972 s]
2017-06-09\T\18:28:57.544 [INFO] Apache Beam :: SDKs :: Java :: Maven Archetypes .... SUCCESS
[  0.413 s]
2017-06-09\T\18:28:57.544 [INFO] Apache Beam :: SDKs :: Java :: Maven Archetypes :: Starter
SUCCESS [ 10.538 s]
2017-06-09\T\18:28:57.544 [INFO] Apache Beam :: Examples ............................ SUCCESS
[  0.549 s]
2017-06-09\T\18:28:57.544 [INFO] Apache Beam :: Examples :: Java .................... SUCCESS
[08:49 min]
2017-06-09\T\18:28:57.544 [INFO] Apache Beam :: SDKs :: Java :: Maven Archetypes :: Examples
SUCCESS [ 23.345 s]
2017-06-09\T\18:28:57.544 [INFO] Apache Beam :: SDKs :: Java :: Extensions :: Jackson SUCCESS
[  6.666 s]
2017-06-09\T\18:28:57.544 [INFO] Apache Beam :: SDKs :: Java :: Extensions :: Join library
SUCCESS [  9.180 s]
2017-06-09\T\18:28:57.544 [INFO] Apache Beam :: SDKs :: Java :: Extensions :: Sorter  SUCCESS
[ 20.676 s]
2017-06-09\T\18:28:57.544 [INFO] Apache Beam :: Runners :: Flink .................... FAILURE
[  6.379 s]
2017-06-09\T\18:28:57.544 [INFO] Apache Beam :: Runners :: Spark .................... SKIPPED
2017-06-09\T\18:28:57.544 [INFO] Apache Beam :: SDKs :: Java :: Aggregated Javadoc .. SKIPPED
2017-06-09\T\18:28:57.544 [INFO] ------------------------------------------------------------------------
2017-06-09\T\18:28:57.544 [INFO] BUILD FAILURE
2017-06-09\T\18:28:57.544 [INFO] ------------------------------------------------------------------------
2017-06-09\T\18:28:57.545 [INFO] Total time: 27:22 min
2017-06-09\T\18:28:57.545 [INFO] Finished at: 2017-06-09T18:28:57+00:00
2017-06-09\T\18:28:58.714 [INFO] Final Memory: 252M/1856M
2017-06-09\T\18:28:58.714 [INFO] ------------------------------------------------------------------------
2017-06-09\T\18:28:58.716 [ERROR] Failed to execute goal org.apache.maven.plugins:maven-compiler-plugin:3.6.1:compile
(default-compile) on project beam-runners-flink_2.10: Compilation failure
2017-06-09\T\18:28:58.716 [ERROR] <https://builds.apache.org/job/beam_PostCommit_Java_JDK_Versions_Test/jdk=OpenJDK%208%20(on%20Ubuntu%20only),label=beam/ws/runners/flink/src/main/java/org/apache/beam/runners/flink/FlinkStreamingTransformTranslators.java>:[366,27]
method put in interface java.util.Map<K,V> cannot be applied to given types;
2017-06-09\T\18:28:58.716 [ERROR] required: org.apache.beam.sdk.values.TupleTag<?>,org.apache.flink.util.OutputTag<org.apache.beam.sdk.util.WindowedValue<?>>
2017-06-09\T\18:28:58.716 [ERROR] found: org.apache.beam.sdk.values.TupleTag<capture#1
of ?>,org.apache.flink.util.OutputTag<java.lang.Object>
2017-06-09\T\18:28:58.716 [ERROR] reason: actual argument org.apache.flink.util.OutputTag<java.lang.Object>
cannot be converted to org.apache.flink.util.OutputTag<org.apache.beam.sdk.util.WindowedValue<?>>
by method invocation conversion
2017-06-09\T\18:28:58.716 [ERROR] -> [Help 1]
org.apache.maven.lifecycle.LifecycleExecutionException: Failed to execute goal org.apache.maven.plugins:maven-compiler-plugin:3.6.1:compile
(default-compile) on project beam-runners-flink_2.10: Compilation failure
<https://builds.apache.org/job/beam_PostCommit_Java_JDK_Versions_Test/jdk=OpenJDK%208%20(on%20Ubuntu%20only),label=beam/ws/runners/flink/src/main/java/org/apache/beam/runners/flink/FlinkStreamingTransformTranslators.java>:[366,27]
method put in interface java.util.Map<K,V> cannot be applied to given types;
  required: org.apache.beam.sdk.values.TupleTag<?>,org.apache.flink.util.OutputTag<org.apache.beam.sdk.util.WindowedValue<?>>
  found: org.apache.beam.sdk.values.TupleTag<capture#1 of ?>,org.apache.flink.util.OutputTag<java.lang.Object>
  reason: actual argument org.apache.flink.util.OutputTag<java.lang.Object> cannot be
converted to org.apache.flink.util.OutputTag<org.apache.beam.sdk.util.WindowedValue<?>>
by method invocation conversion

	at org.apache.maven.lifecycle.internal.MojoExecutor.execute(MojoExecutor.java:212)
	at org.apache.maven.lifecycle.internal.MojoExecutor.execute(MojoExecutor.java:153)
	at org.apache.maven.lifecycle.internal.MojoExecutor.execute(MojoExecutor.java:145)
	at org.apache.maven.lifecycle.internal.LifecycleModuleBuilder.buildProject(LifecycleModuleBuilder.java:116)
	at org.apache.maven.lifecycle.internal.LifecycleModuleBuilder.buildProject(LifecycleModuleBuilder.java:80)
	at org.apache.maven.lifecycle.internal.builder.singlethreaded.SingleThreadedBuilder.build(SingleThreadedBuilder.java:51)
	at org.apache.maven.lifecycle.internal.LifecycleStarter.execute(LifecycleStarter.java:128)
	at org.apache.maven.DefaultMaven.doExecute(DefaultMaven.java:307)
	at org.apache.maven.DefaultMaven.doExecute(DefaultMaven.java:193)
	at org.apache.maven.DefaultMaven.execute(DefaultMaven.java:106)
	at org.apache.maven.cli.MavenCli.execute(MavenCli.java:862)
	at org.apache.maven.cli.MavenCli.doMain(MavenCli.java:286)
	at org.apache.maven.cli.MavenCli.main(MavenCli.java:197)
	at sun.reflect.NativeMethodAccessorImpl.invoke0(Native Method)
	at sun.reflect.NativeMethodAccessorImpl.invoke(NativeMethodAccessorImpl.java:57)
	at sun.reflect.DelegatingMethodAccessorImpl.invoke(DelegatingMethodAccessorImpl.java:43)
	at java.lang.reflect.Method.invoke(Method.java:606)
	at org.codehaus.plexus.classworlds.launcher.Launcher.launchEnhanced(Launcher.java:289)
	at org.codehaus.plexus.classworlds.launcher.Launcher.launch(Launcher.java:229)
	at org.codehaus.plexus.classworlds.launcher.Launcher.mainWithExitCode(Launcher.java:415)
	at org.codehaus.plexus.classworlds.launcher.Launcher.main(Launcher.java:356)
Caused by: org.apache.maven.plugin.compiler.CompilationFailureException: Compilation failure
<https://builds.apache.org/job/beam_PostCommit_Java_JDK_Versions_Test/jdk=OpenJDK%208%20(on%20Ubuntu%20only),label=beam/ws/runners/flink/src/main/java/org/apache/beam/runners/flink/FlinkStreamingTransformTranslators.java>:[366,27]
method put in interface java.util.Map<K,V> cannot be applied to given types;
  required: org.apache.beam.sdk.values.TupleTag<?>,org.apache.flink.util.OutputTag<org.apache.beam.sdk.util.WindowedValue<?>>
  found: org.apache.beam.sdk.values.TupleTag<capture#1 of ?>,org.apache.flink.util.OutputTag<java.lang.Object>
  reason: actual argument org.apache.flink.util.OutputTag<java.lang.Object> cannot be
converted to org.apache.flink.util.OutputTag<org.apache.beam.sdk.util.WindowedValue<?>>
by method invocation conversion

	at org.apache.maven.plugin.compiler.AbstractCompilerMojo.execute(AbstractCompilerMojo.java:1029)
	at org.apache.maven.plugin.compiler.CompilerMojo.execute(CompilerMojo.java:137)
	at org.apache.maven.plugin.DefaultBuildPluginManager.executeMojo(DefaultBuildPluginManager.java:134)
	at org.apache.maven.lifecycle.internal.MojoExecutor.execute(MojoExecutor.java:208)
	... 20 more
2017-06-09\T\18:28:58.717 [ERROR] 
2017-06-09\T\18:28:58.717 [ERROR] Re-run Maven using the -X switch to enable full debug logging.
2017-06-09\T\18:28:58.717 [ERROR] 
2017-06-09\T\18:28:58.717 [ERROR] For more information about the errors and possible solutions,
please read the following articles:
2017-06-09\T\18:28:58.717 [ERROR] [Help 1] http://cwiki.apache.org/confluence/display/MAVEN/MojoFailureException
2017-06-09\T\18:28:58.717 [ERROR] 
2017-06-09\T\18:28:58.717 [ERROR] After correcting the problems, you can resume the build
with the command
2017-06-09\T\18:28:58.717 [ERROR]   mvn <goals> -rf :beam-runners-flink_2.10
Build step 'Invoke top-level Maven targets' marked build as failure
Not sending mail to unregistered user kirpichov@google.com
Not sending mail to unregistered user klk@google.com
Not sending mail to unregistered user ccy@google.com

Mime
View raw message