beam-commits mailing list archives

Site index · List index
Message view « Date » · « Thread »
Top « Date » · « Thread »
From Apache Jenkins Server <jenk...@builds.apache.org>
Subject Build failed in Jenkins: beam_PostCommit_Java_ValidatesRunner_Flink #3215
Date Thu, 22 Jun 2017 20:20:34 GMT
See <https://builds.apache.org/job/beam_PostCommit_Java_ValidatesRunner_Flink/3215/display/redirect?page=changes>

Changes:

[altay] Clean up test_stream_test and remove stray print statement

------------------------------------------
[...truncated 276.19 KB...]
2017-06-22T20:20:24.474 [INFO] Downloading: https://repo.maven.apache.org/maven2/org/apache/ant/ant-antlr/1.9.4/ant-antlr-1.9.4.pom
2017-06-22T20:20:24.500 [INFO] Downloaded: https://repo.maven.apache.org/maven2/org/apache/ant/ant-antlr/1.9.4/ant-antlr-1.9.4.pom
(4 KB at 115.5 KB/sec)
2017-06-22T20:20:24.503 [INFO] Downloading: https://repo.maven.apache.org/maven2/org/codehaus/groovy/groovy-groovydoc/2.4.7/groovy-groovydoc-2.4.7.pom
2017-06-22T20:20:24.532 [INFO] Downloaded: https://repo.maven.apache.org/maven2/org/codehaus/groovy/groovy-groovydoc/2.4.7/groovy-groovydoc-2.4.7.pom
(16 KB at 527.8 KB/sec)
2017-06-22T20:20:24.534 [INFO] Downloading: https://repo.maven.apache.org/maven2/org/codehaus/groovy/groovy-templates/2.4.7/groovy-templates-2.4.7.pom
2017-06-22T20:20:24.566 [INFO] Downloaded: https://repo.maven.apache.org/maven2/org/codehaus/groovy/groovy-templates/2.4.7/groovy-templates-2.4.7.pom
(16 KB at 478.2 KB/sec)
2017-06-22T20:20:24.570 [INFO] Downloading: https://repo.maven.apache.org/maven2/org/codehaus/groovy/groovy-xml/2.4.7/groovy-xml-2.4.7.pom
2017-06-22T20:20:24.599 [INFO] Downloaded: https://repo.maven.apache.org/maven2/org/codehaus/groovy/groovy-xml/2.4.7/groovy-xml-2.4.7.pom
(16 KB at 521.3 KB/sec)
2017-06-22T20:20:24.601 [INFO] Downloading: https://repo.maven.apache.org/maven2/org/apache/ant/ant-junit/1.9.4/ant-junit-1.9.4.pom
2017-06-22T20:20:24.628 [INFO] Downloaded: https://repo.maven.apache.org/maven2/org/apache/ant/ant-junit/1.9.4/ant-junit-1.9.4.pom
(4 KB at 146.6 KB/sec)
2017-06-22T20:20:24.630 [INFO] Downloading: https://repo.maven.apache.org/maven2/org/apache/maven/reporting/maven-reporting-impl/2.1/maven-reporting-impl-2.1.pom
2017-06-22T20:20:24.656 [INFO] Downloaded: https://repo.maven.apache.org/maven2/org/apache/maven/reporting/maven-reporting-impl/2.1/maven-reporting-impl-2.1.pom
(5 KB at 169.9 KB/sec)
2017-06-22T20:20:24.661 [INFO] Downloading: https://repo.maven.apache.org/maven2/org/apache/maven/maven-project/2.0.10/maven-project-2.0.10.pom
2017-06-22T20:20:24.687 [INFO] Downloaded: https://repo.maven.apache.org/maven2/org/apache/maven/maven-project/2.0.10/maven-project-2.0.10.pom
(3 KB at 106.9 KB/sec)
2017-06-22T20:20:24.689 [INFO] Downloading: https://repo.maven.apache.org/maven2/org/apache/maven/maven/2.0.10/maven-2.0.10.pom
2017-06-22T20:20:24.717 [INFO] Downloaded: https://repo.maven.apache.org/maven2/org/apache/maven/maven/2.0.10/maven-2.0.10.pom
(24 KB at 846.9 KB/sec)
2017-06-22T20:20:24.720 [INFO] Downloading: https://repo.maven.apache.org/maven2/org/apache/maven/maven-settings/2.0.10/maven-settings-2.0.10.pom
2017-06-22T20:20:24.746 [INFO] Downloaded: https://repo.maven.apache.org/maven2/org/apache/maven/maven-settings/2.0.10/maven-settings-2.0.10.pom
(3 KB at 84.1 KB/sec)
2017-06-22T20:20:24.751 [INFO] Downloading: https://repo.maven.apache.org/maven2/org/apache/maven/maven-model/2.0.10/maven-model-2.0.10.pom
2017-06-22T20:20:24.777 [INFO] Downloaded: https://repo.maven.apache.org/maven2/org/apache/maven/maven-model/2.0.10/maven-model-2.0.10.pom
(4 KB at 125.3 KB/sec)
2017-06-22T20:20:24.780 [INFO] Downloading: https://repo.maven.apache.org/maven2/org/codehaus/plexus/plexus-interpolation/1.1/plexus-interpolation-1.1.pom
2017-06-22T20:20:24.805 [INFO] Downloaded: https://repo.maven.apache.org/maven2/org/codehaus/plexus/plexus-interpolation/1.1/plexus-interpolation-1.1.pom
(2 KB at 56.1 KB/sec)
2017-06-22T20:20:24.807 [INFO] Downloading: https://repo.maven.apache.org/maven2/org/apache/maven/maven-profile/2.0.10/maven-profile-2.0.10.pom
2017-06-22T20:20:24.836 [INFO] Downloaded: https://repo.maven.apache.org/maven2/org/apache/maven/maven-profile/2.0.10/maven-profile-2.0.10.pom
(3 KB at 70.5 KB/sec)
2017-06-22T20:20:24.840 [INFO] Downloading: https://repo.maven.apache.org/maven2/org/apache/maven/maven-artifact-manager/2.0.10/maven-artifact-manager-2.0.10.pom
2017-06-22T20:20:24.867 [INFO] Downloaded: https://repo.maven.apache.org/maven2/org/apache/maven/maven-artifact-manager/2.0.10/maven-artifact-manager-2.0.10.pom
(3 KB at 97.7 KB/sec)
2017-06-22T20:20:24.870 [INFO] Downloading: https://repo.maven.apache.org/maven2/org/apache/maven/maven-repository-metadata/2.0.10/maven-repository-metadata-2.0.10.pom
2017-06-22T20:20:24.898 [INFO] Downloaded: https://repo.maven.apache.org/maven2/org/apache/maven/maven-repository-metadata/2.0.10/maven-repository-metadata-2.0.10.pom
(3 KB at 80.7 KB/sec)
2017-06-22T20:20:24.900 [INFO] Downloading: https://repo.maven.apache.org/maven2/org/apache/maven/maven-artifact/2.0.10/maven-artifact-2.0.10.pom
2017-06-22T20:20:24.928 [INFO] Downloaded: https://repo.maven.apache.org/maven2/org/apache/maven/maven-artifact/2.0.10/maven-artifact-2.0.10.pom
(2 KB at 56.5 KB/sec)
2017-06-22T20:20:24.932 [INFO] Downloading: https://repo.maven.apache.org/maven2/org/apache/maven/maven-plugin-registry/2.0.10/maven-plugin-registry-2.0.10.pom
2017-06-22T20:20:24.959 [INFO] Downloaded: https://repo.maven.apache.org/maven2/org/apache/maven/maven-plugin-registry/2.0.10/maven-plugin-registry-2.0.10.pom
(2 KB at 72.9 KB/sec)
2017-06-22T20:20:24.962 [INFO] Downloading: https://repo.maven.apache.org/maven2/org/apache/maven/doxia/doxia-sink-api/1.1.2/doxia-sink-api-1.1.2.pom
2017-06-22T20:20:24.991 [INFO] Downloaded: https://repo.maven.apache.org/maven2/org/apache/maven/doxia/doxia-sink-api/1.1.2/doxia-sink-api-1.1.2.pom
(2 KB at 53.0 KB/sec)
2017-06-22T20:20:24.992 [INFO] Downloading: https://repo.maven.apache.org/maven2/org/apache/maven/doxia/doxia/1.1.2/doxia-1.1.2.pom
2017-06-22T20:20:25.020 [INFO] Downloaded: https://repo.maven.apache.org/maven2/org/apache/maven/doxia/doxia/1.1.2/doxia-1.1.2.pom
(18 KB at 633.2 KB/sec)
2017-06-22T20:20:25.025 [INFO] Downloading: https://repo.maven.apache.org/maven2/org/apache/maven/doxia/doxia-logging-api/1.1.2/doxia-logging-api-1.1.2.pom
2017-06-22T20:20:25.051 [INFO] Downloaded: https://repo.maven.apache.org/maven2/org/apache/maven/doxia/doxia-logging-api/1.1.2/doxia-logging-api-1.1.2.pom
(2 KB at 61.7 KB/sec)
2017-06-22T20:20:25.053 [INFO] Downloading: https://repo.maven.apache.org/maven2/org/apache/maven/doxia/doxia-core/1.1.2/doxia-core-1.1.2.pom
2017-06-22T20:20:25.079 [INFO] Downloaded: https://repo.maven.apache.org/maven2/org/apache/maven/doxia/doxia-core/1.1.2/doxia-core-1.1.2.pom
(4 KB at 139.7 KB/sec)
2017-06-22T20:20:25.082 [INFO] Downloading: https://repo.maven.apache.org/maven2/org/codehaus/plexus/plexus-utils/1.5.12/plexus-utils-1.5.12.pom
2017-06-22T20:20:25.109 [INFO] Downloaded: https://repo.maven.apache.org/maven2/org/codehaus/plexus/plexus-utils/1.5.12/plexus-utils-1.5.12.pom
(6 KB at 203.8 KB/sec)
2017-06-22T20:20:25.113 [INFO] Downloading: https://repo.maven.apache.org/maven2/xerces/xercesImpl/2.8.1/xercesImpl-2.8.1.pom
2017-06-22T20:20:25.139 [INFO] Downloaded: https://repo.maven.apache.org/maven2/xerces/xercesImpl/2.8.1/xercesImpl-2.8.1.pom
(3 KB at 82.9 KB/sec)
2017-06-22T20:20:25.142 [INFO] Downloading: https://repo.maven.apache.org/maven2/xml-apis/xml-apis/1.3.03/xml-apis-1.3.03.pom
2017-06-22T20:20:25.170 [INFO] Downloaded: https://repo.maven.apache.org/maven2/xml-apis/xml-apis/1.3.03/xml-apis-1.3.03.pom
(738 B at 24.9 KB/sec)
2017-06-22T20:20:25.172 [INFO] Downloading: https://repo.maven.apache.org/maven2/org/apache/apache/1/apache-1.pom
2017-06-22T20:20:25.198 [INFO] Downloaded: https://repo.maven.apache.org/maven2/org/apache/apache/1/apache-1.pom
(4 KB at 128.1 KB/sec)
2017-06-22T20:20:25.200 [INFO] Downloading: https://repo.maven.apache.org/maven2/commons-httpclient/commons-httpclient/3.1/commons-httpclient-3.1.pom
2017-06-22T20:20:25.226 [INFO] Downloaded: https://repo.maven.apache.org/maven2/commons-httpclient/commons-httpclient/3.1/commons-httpclient-3.1.pom
(8 KB at 280.8 KB/sec)
2017-06-22T20:20:25.230 [INFO] Downloading: https://repo.maven.apache.org/maven2/commons-codec/commons-codec/1.2/commons-codec-1.2.pom
2017-06-22T20:20:25.256 [INFO] Downloaded: https://repo.maven.apache.org/maven2/commons-codec/commons-codec/1.2/commons-codec-1.2.pom
(4 KB at 143.7 KB/sec)
2017-06-22T20:20:25.258 [INFO] Downloading: https://repo.maven.apache.org/maven2/org/apache/maven/doxia/doxia-site-renderer/1.1.2/doxia-site-renderer-1.1.2.pom
2017-06-22T20:20:25.284 [INFO] Downloaded: https://repo.maven.apache.org/maven2/org/apache/maven/doxia/doxia-site-renderer/1.1.2/doxia-site-renderer-1.1.2.pom
(6 KB at 229.9 KB/sec)
2017-06-22T20:20:25.286 [INFO] Downloading: https://repo.maven.apache.org/maven2/org/apache/maven/doxia/doxia-sitetools/1.1.2/doxia-sitetools-1.1.2.pom
2017-06-22T20:20:25.312 [INFO] Downloaded: https://repo.maven.apache.org/maven2/org/apache/maven/doxia/doxia-sitetools/1.1.2/doxia-sitetools-1.1.2.pom
(15 KB at 574.1 KB/sec)
2017-06-22T20:20:25.315 [INFO] Downloading: https://repo.maven.apache.org/maven2/org/apache/maven/doxia/doxia-decoration-model/1.1.2/doxia-decoration-model-1.1.2.pom
2017-06-22T20:20:25.342 [INFO] Downloaded: https://repo.maven.apache.org/maven2/org/apache/maven/doxia/doxia-decoration-model/1.1.2/doxia-decoration-model-1.1.2.pom
(3 KB at 107.6 KB/sec)
2017-06-22T20:20:25.345 [INFO] Downloading: https://repo.maven.apache.org/maven2/org/apache/maven/doxia/doxia-module-xhtml/1.1.2/doxia-module-xhtml-1.1.2.pom
2017-06-22T20:20:25.370 [INFO] Downloaded: https://repo.maven.apache.org/maven2/org/apache/maven/doxia/doxia-module-xhtml/1.1.2/doxia-module-xhtml-1.1.2.pom
(2 KB at 62.6 KB/sec)
2017-06-22T20:20:25.371 [INFO] Downloading: https://repo.maven.apache.org/maven2/org/apache/maven/doxia/doxia-modules/1.1.2/doxia-modules-1.1.2.pom
2017-06-22T20:20:25.397 [INFO] Downloaded: https://repo.maven.apache.org/maven2/org/apache/maven/doxia/doxia-modules/1.1.2/doxia-modules-1.1.2.pom
(3 KB at 91.5 KB/sec)
2017-06-22T20:20:25.400 [INFO] Downloading: https://repo.maven.apache.org/maven2/org/apache/maven/doxia/doxia-module-fml/1.1.2/doxia-module-fml-1.1.2.pom
2017-06-22T20:20:25.427 [INFO] Downloaded: https://repo.maven.apache.org/maven2/org/apache/maven/doxia/doxia-module-fml/1.1.2/doxia-module-fml-1.1.2.pom
(6 KB at 198.7 KB/sec)
2017-06-22T20:20:25.433 [INFO] Downloading: https://repo.maven.apache.org/maven2/commons-validator/commons-validator/1.2.0/commons-validator-1.2.0.pom
2017-06-22T20:20:25.459 [INFO] Downloaded: https://repo.maven.apache.org/maven2/commons-validator/commons-validator/1.2.0/commons-validator-1.2.0.pom
(9 KB at 341.2 KB/sec)
2017-06-22T20:20:25.461 [INFO] Downloading: https://repo.maven.apache.org/maven2/xml-apis/xml-apis/2.0.2/xml-apis-2.0.2.pom
2017-06-22T20:20:25.486 [INFO] Downloaded: https://repo.maven.apache.org/maven2/xml-apis/xml-apis/2.0.2/xml-apis-2.0.2.pom
(346 B at 13.5 KB/sec)
2017-06-22T20:20:25.492 [INFO] Downloading: https://repo.maven.apache.org/maven2/org/apache/maven/maven-plugin-api/2.0/maven-plugin-api-2.0.pom
2017-06-22T20:20:25.522 [INFO] Downloaded: https://repo.maven.apache.org/maven2/org/apache/maven/maven-plugin-api/2.0/maven-plugin-api-2.0.pom
(601 B at 19.6 KB/sec)
2017-06-22T20:20:25.524 [INFO] Downloading: https://repo.maven.apache.org/maven2/org/apache/maven/maven/2.0/maven-2.0.pom
2017-06-22T20:20:25.551 [INFO] Downloaded: https://repo.maven.apache.org/maven2/org/apache/maven/maven/2.0/maven-2.0.pom
(9 KB at 317.1 KB/sec)
2017-06-22T20:20:25.555 [INFO] Downloading: https://repo.maven.apache.org/maven2/org/apache/maven/shared/maven-doxia-tools/1.2.1/maven-doxia-tools-1.2.1.pom
2017-06-22T20:20:25.582 [INFO] Downloaded: https://repo.maven.apache.org/maven2/org/apache/maven/shared/maven-doxia-tools/1.2.1/maven-doxia-tools-1.2.1.pom
(7 KB at 228.3 KB/sec)
2017-06-22T20:20:25.585 [INFO] Downloading: https://repo.maven.apache.org/maven2/org/apache/maven/doxia/doxia-logging-api/1.1.3/doxia-logging-api-1.1.3.pom
2017-06-22T20:20:25.610 [INFO] Downloaded: https://repo.maven.apache.org/maven2/org/apache/maven/doxia/doxia-logging-api/1.1.3/doxia-logging-api-1.1.3.pom
(2 KB at 61.7 KB/sec)
2017-06-22T20:20:25.614 [INFO] Downloading: https://repo.maven.apache.org/maven2/org/apache/maven/doxia/doxia/1.1.3/doxia-1.1.3.pom
2017-06-22T20:20:25.642 [INFO] Downloaded: https://repo.maven.apache.org/maven2/org/apache/maven/doxia/doxia/1.1.3/doxia-1.1.3.pom
(19 KB at 648.9 KB/sec)
2017-06-22T20:20:25.645 [INFO] Downloading: https://repo.maven.apache.org/maven2/org/apache/maven/doxia/doxia-decoration-model/1.1.3/doxia-decoration-model-1.1.3.pom
2017-06-22T20:20:25.671 [INFO] Downloaded: https://repo.maven.apache.org/maven2/org/apache/maven/doxia/doxia-decoration-model/1.1.3/doxia-decoration-model-1.1.3.pom
(3 KB at 111.7 KB/sec)
2017-06-22T20:20:25.673 [INFO] Downloading: https://repo.maven.apache.org/maven2/org/apache/maven/doxia/doxia-sitetools/1.1.3/doxia-sitetools-1.1.3.pom
2017-06-22T20:20:25.732 [INFO] Downloaded: https://repo.maven.apache.org/maven2/org/apache/maven/doxia/doxia-sitetools/1.1.3/doxia-sitetools-1.1.3.pom
(16 KB at 260.6 KB/sec)
[WARNING] Failed to getClass for org.codehaus.mojo.findbugs.FindBugsMojo
[WARNING] Failed to getClass for org.codehaus.mojo.findbugs.FindbugsViolationCheckMojo
[WARNING] Failed to getClass for org.codehaus.mojo.findbugs.FindbugsViolationCheckMojo
[JENKINS] Archiving disabled
[JENKINS] Archiving disabled
[JENKINS] Archiving disabled
[JENKINS] Archiving disabled
[JENKINS] Archiving disabled
[JENKINS] Archiving disabled
[JENKINS] Archiving disabled
[JENKINS] Archiving disabled
[JENKINS] Archiving disabled
[JENKINS] Archiving disabled
[JENKINS] Archiving disabled
[JENKINS] Archiving disabled
[JENKINS] Archiving disabled
2017-06-22T20:20:29.054 [INFO] ------------------------------------------------------------------------
2017-06-22T20:20:29.054 [INFO] Reactor Summary:
2017-06-22T20:20:29.054 [INFO] 
2017-06-22T20:20:29.054 [INFO] Apache Beam :: Parent .............................. SUCCESS
[ 20.183 s]
2017-06-22T20:20:29.054 [INFO] Apache Beam :: SDKs :: Java :: Build Tools ......... SUCCESS
[  8.140 s]
2017-06-22T20:20:29.054 [INFO] Apache Beam :: SDKs ................................ SUCCESS
[  1.999 s]
2017-06-22T20:20:29.055 [INFO] Apache Beam :: SDKs :: Common ...................... SUCCESS
[  3.248 s]
2017-06-22T20:20:29.055 [INFO] Apache Beam :: SDKs :: Common :: Runner API ........ FAILURE
[  6.166 s]
2017-06-22T20:20:29.055 [INFO] Apache Beam :: SDKs :: Common :: Fn API ............ SKIPPED
2017-06-22T20:20:29.055 [INFO] Apache Beam :: SDKs :: Java ........................ SKIPPED
2017-06-22T20:20:29.055 [INFO] Apache Beam :: SDKs :: Java :: Core ................ SKIPPED
2017-06-22T20:20:29.055 [INFO] Apache Beam :: Runners ............................. SKIPPED
2017-06-22T20:20:29.055 [INFO] Apache Beam :: Runners :: Core Construction Java ... SKIPPED
2017-06-22T20:20:29.055 [INFO] Apache Beam :: Runners :: Core Java ................ SKIPPED
2017-06-22T20:20:29.055 [INFO] Apache Beam :: Runners :: Flink .................... SKIPPED
2017-06-22T20:20:29.055 [INFO] ------------------------------------------------------------------------
2017-06-22T20:20:29.055 [INFO] BUILD FAILURE
2017-06-22T20:20:29.055 [INFO] ------------------------------------------------------------------------
2017-06-22T20:20:29.055 [INFO] Total time: 01:19 min
2017-06-22T20:20:29.055 [INFO] Finished at: 2017-06-22T20:20:29+00:00
2017-06-22T20:20:29.332 [INFO] Final Memory: 72M/981M
2017-06-22T20:20:29.332 [INFO] ------------------------------------------------------------------------
2017-06-22T20:20:29.333 [WARNING] The requested profile "validates-runner-tests" could not
be activated because it does not exist.
2017-06-22T20:20:29.336 [ERROR] Failed to execute goal org.codehaus.mojo:findbugs-maven-plugin:3.0.4:findbugs
(findbugs) on project beam-sdks-common-runner-api: Execution findbugs of goal org.codehaus.mojo:findbugs-maven-plugin:3.0.4:findbugs
failed: Plugin org.codehaus.mojo:findbugs-maven-plugin:3.0.4 or one of its dependencies could
not be resolved: Failed to collect dependencies at org.codehaus.mojo:findbugs-maven-plugin:jar:3.0.4
-> org.codehaus.groovy:groovy:jar:2.4.7: Failed to read artifact descriptor for org.codehaus.groovy:groovy:jar:2.4.7:
Could not transfer artifact org.codehaus.groovy:groovy:pom:2.4.7 from/to central (https://repo.maven.apache.org/maven2):
Connection reset -> [Help 1]
org.apache.maven.lifecycle.LifecycleExecutionException: Failed to execute goal org.codehaus.mojo:findbugs-maven-plugin:3.0.4:findbugs
(findbugs) on project beam-sdks-common-runner-api: Execution findbugs of goal org.codehaus.mojo:findbugs-maven-plugin:3.0.4:findbugs
failed: Plugin org.codehaus.mojo:findbugs-maven-plugin:3.0.4 or one of its dependencies could
not be resolved: Failed to collect dependencies at org.codehaus.mojo:findbugs-maven-plugin:jar:3.0.4
-> org.codehaus.groovy:groovy:jar:2.4.7
	at org.apache.maven.lifecycle.internal.MojoExecutor.execute(MojoExecutor.java:224)
	at org.apache.maven.lifecycle.internal.MojoExecutor.execute(MojoExecutor.java:153)
	at org.apache.maven.lifecycle.internal.MojoExecutor.execute(MojoExecutor.java:145)
	at org.apache.maven.lifecycle.internal.MojoExecutor.executeForkedExecutions(MojoExecutor.java:364)
	at org.apache.maven.lifecycle.internal.MojoExecutor.execute(MojoExecutor.java:198)
	at org.apache.maven.lifecycle.internal.MojoExecutor.execute(MojoExecutor.java:153)
	at org.apache.maven.lifecycle.internal.MojoExecutor.execute(MojoExecutor.java:145)
	at org.apache.maven.lifecycle.internal.LifecycleModuleBuilder.buildProject(LifecycleModuleBuilder.java:116)
	at org.apache.maven.lifecycle.internal.LifecycleModuleBuilder.buildProject(LifecycleModuleBuilder.java:80)
	at org.apache.maven.lifecycle.internal.builder.singlethreaded.SingleThreadedBuilder.build(SingleThreadedBuilder.java:51)
	at org.apache.maven.lifecycle.internal.LifecycleStarter.execute(LifecycleStarter.java:128)
	at org.apache.maven.DefaultMaven.doExecute(DefaultMaven.java:307)
	at org.apache.maven.DefaultMaven.doExecute(DefaultMaven.java:193)
	at org.apache.maven.DefaultMaven.execute(DefaultMaven.java:106)
	at org.jvnet.hudson.maven3.launcher.Maven33Launcher.main(Maven33Launcher.java:129)
	at sun.reflect.NativeMethodAccessorImpl.invoke0(Native Method)
	at sun.reflect.NativeMethodAccessorImpl.invoke(NativeMethodAccessorImpl.java:62)
	at sun.reflect.DelegatingMethodAccessorImpl.invoke(DelegatingMethodAccessorImpl.java:43)
	at java.lang.reflect.Method.invoke(Method.java:498)
	at org.codehaus.plexus.classworlds.launcher.Launcher.launchStandard(Launcher.java:330)
	at org.codehaus.plexus.classworlds.launcher.Launcher.launch(Launcher.java:238)
	at jenkins.maven3.agent.Maven33Main.launch(Maven33Main.java:176)
	at sun.reflect.NativeMethodAccessorImpl.invoke0(Native Method)
	at sun.reflect.NativeMethodAccessorImpl.invoke(NativeMethodAccessorImpl.java:62)
	at sun.reflect.DelegatingMethodAccessorImpl.invoke(DelegatingMethodAccessorImpl.java:43)
	at java.lang.reflect.Method.invoke(Method.java:498)
	at hudson.maven.Maven3Builder.call(Maven3Builder.java:139)
	at hudson.maven.Maven3Builder.call(Maven3Builder.java:70)
	at hudson.remoting.UserRequest.perform(UserRequest.java:153)
	at hudson.remoting.UserRequest.perform(UserRequest.java:50)
	at hudson.remoting.Request$2.run(Request.java:336)
	at hudson.remoting.InterceptingExecutorService$1.call(InterceptingExecutorService.java:68)
	at java.util.concurrent.FutureTask.run(FutureTask.java:266)
	at java.util.concurrent.ThreadPoolExecutor.runWorker(ThreadPoolExecutor.java:1142)
	at java.util.concurrent.ThreadPoolExecutor$Worker.run(ThreadPoolExecutor.java:617)
	at java.lang.Thread.run(Thread.java:748)
Caused by: org.apache.maven.plugin.PluginExecutionException: Execution findbugs of goal org.codehaus.mojo:findbugs-maven-plugin:3.0.4:findbugs
failed: Plugin org.codehaus.mojo:findbugs-maven-plugin:3.0.4 or one of its dependencies could
not be resolved: Failed to collect dependencies at org.codehaus.mojo:findbugs-maven-plugin:jar:3.0.4
-> org.codehaus.groovy:groovy:jar:2.4.7
	at org.apache.maven.plugin.DefaultBuildPluginManager.executeMojo(DefaultBuildPluginManager.java:106)
	at org.apache.maven.lifecycle.internal.MojoExecutor.execute(MojoExecutor.java:208)
	... 35 more
Caused by: org.apache.maven.plugin.PluginResolutionException: Plugin org.codehaus.mojo:findbugs-maven-plugin:3.0.4
or one of its dependencies could not be resolved: Failed to collect dependencies at org.codehaus.mojo:findbugs-maven-plugin:jar:3.0.4
-> org.codehaus.groovy:groovy:jar:2.4.7
	at org.apache.maven.plugin.internal.DefaultPluginDependenciesResolver.resolveInternal(DefaultPluginDependenciesResolver.java:214)
	at org.apache.maven.plugin.internal.DefaultPluginDependenciesResolver.resolve(DefaultPluginDependenciesResolver.java:149)
	at org.apache.maven.plugin.internal.DefaultMavenPluginManager.createPluginRealm(DefaultMavenPluginManager.java:422)
	at org.apache.maven.plugin.internal.DefaultMavenPluginManager.setupPluginRealm(DefaultMavenPluginManager.java:385)
	at org.apache.maven.plugin.DefaultBuildPluginManager.getPluginRealm(DefaultBuildPluginManager.java:231)
	at org.apache.maven.plugin.DefaultBuildPluginManager.executeMojo(DefaultBuildPluginManager.java:102)
	... 36 more
Caused by: org.eclipse.aether.collection.DependencyCollectionException: Failed to collect
dependencies at org.codehaus.mojo:findbugs-maven-plugin:jar:3.0.4 -> org.codehaus.groovy:groovy:jar:2.4.7
	at org.eclipse.aether.internal.impl.DefaultDependencyCollector.collectDependencies(DefaultDependencyCollector.java:291)
	at org.eclipse.aether.internal.impl.DefaultRepositorySystem.collectDependencies(DefaultRepositorySystem.java:316)
	at org.apache.maven.plugin.internal.DefaultPluginDependenciesResolver.resolveInternal(DefaultPluginDependenciesResolver.java:202)
	... 41 more
Caused by: org.eclipse.aether.resolution.ArtifactDescriptorException: Failed to read artifact
descriptor for org.codehaus.groovy:groovy:jar:2.4.7
	at org.apache.maven.repository.internal.DefaultArtifactDescriptorReader.loadPom(DefaultArtifactDescriptorReader.java:302)
	at org.apache.maven.repository.internal.DefaultArtifactDescriptorReader.readArtifactDescriptor(DefaultArtifactDescriptorReader.java:218)
	at org.eclipse.aether.internal.impl.DefaultDependencyCollector.resolveCachedArtifactDescriptor(DefaultDependencyCollector.java:535)
	at org.eclipse.aether.internal.impl.DefaultDependencyCollector.getArtifactDescriptorResult(DefaultDependencyCollector.java:519)
	at org.eclipse.aether.internal.impl.DefaultDependencyCollector.processDependency(DefaultDependencyCollector.java:409)
	at org.eclipse.aether.internal.impl.DefaultDependencyCollector.processDependency(DefaultDependencyCollector.java:363)
	at org.eclipse.aether.internal.impl.DefaultDependencyCollector.process(DefaultDependencyCollector.java:351)
	at org.eclipse.aether.internal.impl.DefaultDependencyCollector.collectDependencies(DefaultDependencyCollector.java:254)
	... 43 more
Caused by: org.eclipse.aether.resolution.ArtifactResolutionException: Could not transfer artifact
org.codehaus.groovy:groovy:pom:2.4.7 from/to central (https://repo.maven.apache.org/maven2):
Connection reset
	at org.eclipse.aether.internal.impl.DefaultArtifactResolver.resolve(DefaultArtifactResolver.java:444)
	at org.eclipse.aether.internal.impl.DefaultArtifactResolver.resolveArtifacts(DefaultArtifactResolver.java:246)
	at org.eclipse.aether.internal.impl.DefaultArtifactResolver.resolveArtifact(DefaultArtifactResolver.java:223)
	at org.apache.maven.repository.internal.DefaultArtifactDescriptorReader.loadPom(DefaultArtifactDescriptorReader.java:287)
	... 50 more
Caused by: org.eclipse.aether.transfer.ArtifactTransferException: Could not transfer artifact
org.codehaus.groovy:groovy:pom:2.4.7 from/to central (https://repo.maven.apache.org/maven2):
Connection reset
	at org.eclipse.aether.connector.basic.ArtifactTransportListener.transferFailed(ArtifactTransportListener.java:43)
	at org.eclipse.aether.connector.basic.BasicRepositoryConnector$TaskRunner.run(BasicRepositoryConnector.java:355)
	at org.eclipse.aether.util.concurrency.RunnableErrorForwarder$1.run(RunnableErrorForwarder.java:67)
	at org.eclipse.aether.connector.basic.BasicRepositoryConnector$DirectExecutor.execute(BasicRepositoryConnector.java:581)
	at org.eclipse.aether.connector.basic.BasicRepositoryConnector.get(BasicRepositoryConnector.java:249)
	at org.eclipse.aether.internal.impl.DefaultArtifactResolver.performDownloads(DefaultArtifactResolver.java:520)
	at org.eclipse.aether.internal.impl.DefaultArtifactResolver.resolve(DefaultArtifactResolver.java:421)
	... 53 more
Caused by: org.apache.maven.wagon.TransferFailedException: Connection reset
	at org.apache.maven.wagon.providers.http.AbstractHttpClientWagon.fillInputData(AbstractHttpClientWagon.java:1066)
	at org.apache.maven.wagon.providers.http.AbstractHttpClientWagon.fillInputData(AbstractHttpClientWagon.java:960)
	at org.apache.maven.wagon.StreamWagon.getInputStream(StreamWagon.java:116)
	at org.apache.maven.wagon.StreamWagon.getIfNewer(StreamWagon.java:88)
	at org.apache.maven.wagon.StreamWagon.get(StreamWagon.java:61)
	at org.eclipse.aether.transport.wagon.WagonTransporter$GetTaskRunner.run(WagonTransporter.java:560)
	at org.eclipse.aether.transport.wagon.WagonTransporter.execute(WagonTransporter.java:427)
	at org.eclipse.aether.transport.wagon.WagonTransporter.get(WagonTransporter.java:404)
	at org.eclipse.aether.connector.basic.BasicRepositoryConnector$GetTaskRunner.runTask(BasicRepositoryConnector.java:447)
	at org.eclipse.aether.connector.basic.BasicRepositoryConnector$TaskRunner.run(BasicRepositoryConnector.java:350)
	... 58 more
Caused by: java.net.SocketException: Connection reset
	at java.net.SocketInputStream.read(SocketInputStream.java:210)
	at java.net.SocketInputStream.read(SocketInputStream.java:141)
	at sun.security.ssl.InputRecord.readFully(InputRecord.java:465)
	at sun.security.ssl.InputRecord.read(InputRecord.java:503)
	at sun.security.ssl.SSLSocketImpl.readRecord(SSLSocketImpl.java:973)
	at sun.security.ssl.SSLSocketImpl.readDataRecord(SSLSocketImpl.java:930)
	at sun.security.ssl.AppInputStream.read(AppInputStream.java:105)
	at org.apache.maven.wagon.providers.http.httpclient.impl.io.SessionInputBufferImpl.streamRead(SessionInputBufferImpl.java:136)
	at org.apache.maven.wagon.providers.http.httpclient.impl.io.SessionInputBufferImpl.fillBuffer(SessionInputBufferImpl.java:152)
	at org.apache.maven.wagon.providers.http.httpclient.impl.io.SessionInputBufferImpl.readLine(SessionInputBufferImpl.java:270)
	at org.apache.maven.wagon.providers.http.httpclient.impl.conn.DefaultHttpResponseParser.parseHead(DefaultHttpResponseParser.java:140)
	at org.apache.maven.wagon.providers.http.httpclient.impl.conn.DefaultHttpResponseParser.parseHead(DefaultHttpResponseParser.java:57)
	at org.apache.maven.wagon.providers.http.httpclient.impl.io.AbstractMessageParser.parse(AbstractMessageParser.java:260)
	at org.apache.maven.wagon.providers.http.httpclient.impl.DefaultBHttpClientConnection.receiveResponseHeader(DefaultBHttpClientConnection.java:161)
	at org.apache.maven.wagon.providers.http.httpclient.impl.conn.CPoolProxy.receiveResponseHeader(CPoolProxy.java:153)
	at org.apache.maven.wagon.providers.http.httpclient.protocol.HttpRequestExecutor.doReceiveResponse(HttpRequestExecutor.java:271)
	at org.apache.maven.wagon.providers.http.httpclient.protocol.HttpRequestExecutor.execute(HttpRequestExecutor.java:123)
	at org.apache.maven.wagon.providers.http.httpclient.impl.execchain.MainClientExec.execute(MainClientExec.java:254)
	at org.apache.maven.wagon.providers.http.httpclient.impl.execchain.ProtocolExec.execute(ProtocolExec.java:195)
	at org.apache.maven.wagon.providers.http.httpclient.impl.execchain.RetryExec.execute(RetryExec.java:86)
	at org.apache.maven.wagon.providers.http.httpclient.impl.execchain.RedirectExec.execute(RedirectExec.java:108)
	at org.apache.maven.wagon.providers.http.httpclient.impl.client.InternalHttpClient.doExecute(InternalHttpClient.java:184)
	at org.apache.maven.wagon.providers.http.httpclient.impl.client.CloseableHttpClient.execute(CloseableHttpClient.java:82)
	at org.apache.maven.wagon.providers.http.AbstractHttpClientWagon.execute(AbstractHttpClientWagon.java:832)
	at org.apache.maven.wagon.providers.http.AbstractHttpClientWagon.fillInputData(AbstractHttpClientWagon.java:983)
	... 67 more
2017-06-22T20:20:29.338 [ERROR] 
2017-06-22T20:20:29.338 [ERROR] Re-run Maven using the -X switch to enable full debug logging.
2017-06-22T20:20:29.338 [ERROR] 
2017-06-22T20:20:29.339 [ERROR] For more information about the errors and possible solutions,
please read the following articles:
2017-06-22T20:20:29.339 [ERROR] [Help 1] http://cwiki.apache.org/confluence/display/MAVEN/PluginResolutionException
2017-06-22T20:20:29.339 [ERROR] 
2017-06-22T20:20:29.339 [ERROR] After correcting the problems, you can resume the build with
the command
2017-06-22T20:20:29.339 [ERROR]   mvn <goals> -rf :beam-sdks-common-runner-api
channel stopped

Mime
View raw message