beam-commits mailing list archives

Site index · List index
Message view « Date » · « Thread »
Top « Date » · « Thread »
From Apache Jenkins Server <jenk...@builds.apache.org>
Subject Build failed in Jenkins: beam_PostCommit_Java_ValidatesRunner_Flink #3037
Date Mon, 05 Jun 2017 18:05:56 GMT
See <https://builds.apache.org/job/beam_PostCommit_Java_ValidatesRunner_Flink/3037/display/redirect>

------------------------------------------
[...truncated 464.93 KB...]
2017-06-05T18:05:46.468 [INFO] Downloaded: https://repo.maven.apache.org/maven2/commons-beanutils/commons-beanutils-bean-collections/1.8.3/commons-beanutils-bean-collections-1.8.3.pom
(2 KB at 70.0 KB/sec)
2017-06-05T18:05:46.469 [INFO] Downloading: https://repo.maven.apache.org/maven2/commons-daemon/commons-daemon/1.0.13/commons-daemon-1.0.13.pom
2017-06-05T18:05:46.497 [INFO] Downloaded: https://repo.maven.apache.org/maven2/commons-daemon/commons-daemon/1.0.13/commons-daemon-1.0.13.pom
(5 KB at 151.7 KB/sec)
2017-06-05T18:05:46.502 [INFO] Downloading: https://repo.maven.apache.org/maven2/javax/xml/bind/jaxb-api/2.2.2/jaxb-api-2.2.2.pom
2017-06-05T18:05:46.528 [INFO] Downloaded: https://repo.maven.apache.org/maven2/javax/xml/bind/jaxb-api/2.2.2/jaxb-api-2.2.2.pom
(6 KB at 201.5 KB/sec)
2017-06-05T18:05:46.530 [INFO] Downloading: https://repo.maven.apache.org/maven2/javax/xml/stream/stax-api/1.0-2/stax-api-1.0-2.pom
2017-06-05T18:05:46.555 [INFO] Downloaded: https://repo.maven.apache.org/maven2/javax/xml/stream/stax-api/1.0-2/stax-api-1.0-2.pom
(962 B at 37.6 KB/sec)
2017-06-05T18:05:46.557 [INFO] Downloading: https://repo.maven.apache.org/maven2/javax/activation/activation/1.1/activation-1.1.pom
2017-06-05T18:05:46.582 [INFO] Downloaded: https://repo.maven.apache.org/maven2/javax/activation/activation/1.1/activation-1.1.pom
(2 KB at 41.3 KB/sec)
2017-06-05T18:05:46.585 [INFO] Downloading: https://repo.maven.apache.org/maven2/org/apache/flink/flink-runtime_2.10/1.3.0/flink-runtime_2.10-1.3.0.pom
2017-06-05T18:05:46.615 [INFO] Downloaded: https://repo.maven.apache.org/maven2/org/apache/flink/flink-runtime_2.10/1.3.0/flink-runtime_2.10-1.3.0.pom
(14 KB at 480.3 KB/sec)
2017-06-05T18:05:46.622 [INFO] Downloading: https://repo.maven.apache.org/maven2/io/netty/netty-all/4.0.27.Final/netty-all-4.0.27.Final.pom
2017-06-05T18:05:46.653 [INFO] Downloaded: https://repo.maven.apache.org/maven2/io/netty/netty-all/4.0.27.Final/netty-all-4.0.27.Final.pom
(17 KB at 526.6 KB/sec)
2017-06-05T18:05:46.656 [INFO] Downloading: https://repo.maven.apache.org/maven2/io/netty/netty-parent/4.0.27.Final/netty-parent-4.0.27.Final.pom
2017-06-05T18:05:46.697 [INFO] Downloaded: https://repo.maven.apache.org/maven2/io/netty/netty-parent/4.0.27.Final/netty-parent-4.0.27.Final.pom
(48 KB at 1162.0 KB/sec)
2017-06-05T18:05:46.715 [INFO] Downloading: https://repo.maven.apache.org/maven2/org/javassist/javassist/3.18.2-GA/javassist-3.18.2-GA.pom
2017-06-05T18:05:46.758 [INFO] Downloaded: https://repo.maven.apache.org/maven2/org/javassist/javassist/3.18.2-GA/javassist-3.18.2-GA.pom
(10 KB at 216.3 KB/sec)
2017-06-05T18:05:46.762 [INFO] Downloading: https://repo.maven.apache.org/maven2/org/scala-lang/scala-library/2.10.4/scala-library-2.10.4.pom
2017-06-05T18:05:46.794 [INFO] Downloaded: https://repo.maven.apache.org/maven2/org/scala-lang/scala-library/2.10.4/scala-library-2.10.4.pom
(2 KB at 62.4 KB/sec)
2017-06-05T18:05:46.797 [INFO] Downloading: https://repo.maven.apache.org/maven2/com/data-artisans/flakka-actor_2.10/2.3-custom/flakka-actor_2.10-2.3-custom.pom
2017-06-05T18:05:46.823 [INFO] Downloaded: https://repo.maven.apache.org/maven2/com/data-artisans/flakka-actor_2.10/2.3-custom/flakka-actor_2.10-2.3-custom.pom
(2 KB at 72.7 KB/sec)
2017-06-05T18:05:46.825 [INFO] Downloading: https://repo.maven.apache.org/maven2/com/typesafe/config/1.2.1/config-1.2.1.pom
2017-06-05T18:05:46.853 [INFO] Downloaded: https://repo.maven.apache.org/maven2/com/typesafe/config/1.2.1/config-1.2.1.pom
(2 KB at 65.1 KB/sec)
2017-06-05T18:05:46.855 [INFO] Downloading: https://repo.maven.apache.org/maven2/com/data-artisans/flakka-remote_2.10/2.3-custom/flakka-remote_2.10-2.3-custom.pom
2017-06-05T18:05:46.883 [INFO] Downloaded: https://repo.maven.apache.org/maven2/com/data-artisans/flakka-remote_2.10/2.3-custom/flakka-remote_2.10-2.3-custom.pom
(4 KB at 129.4 KB/sec)
2017-06-05T18:05:46.886 [INFO] Downloading: https://repo.maven.apache.org/maven2/io/netty/netty/3.8.0.Final/netty-3.8.0.Final.pom
2017-06-05T18:05:46.919 [INFO] Downloaded: https://repo.maven.apache.org/maven2/io/netty/netty/3.8.0.Final/netty-3.8.0.Final.pom
(26 KB at 775.4 KB/sec)
2017-06-05T18:05:46.927 [INFO] Downloading: https://repo.maven.apache.org/maven2/org/uncommons/maths/uncommons-maths/1.2.2a/uncommons-maths-1.2.2a.pom
2017-06-05T18:05:46.954 [INFO] Downloaded: https://repo.maven.apache.org/maven2/org/uncommons/maths/uncommons-maths/1.2.2a/uncommons-maths-1.2.2a.pom
(2 KB at 59.7 KB/sec)
2017-06-05T18:05:46.956 [INFO] Downloading: https://repo.maven.apache.org/maven2/com/data-artisans/flakka-slf4j_2.10/2.3-custom/flakka-slf4j_2.10-2.3-custom.pom
2017-06-05T18:05:46.983 [INFO] Downloaded: https://repo.maven.apache.org/maven2/com/data-artisans/flakka-slf4j_2.10/2.3-custom/flakka-slf4j_2.10-2.3-custom.pom
(3 KB at 92.6 KB/sec)
2017-06-05T18:05:46.985 [INFO] Downloading: https://repo.maven.apache.org/maven2/org/clapper/grizzled-slf4j_2.10/1.0.2/grizzled-slf4j_2.10-1.0.2.pom
2017-06-05T18:05:47.011 [INFO] Downloaded: https://repo.maven.apache.org/maven2/org/clapper/grizzled-slf4j_2.10/1.0.2/grizzled-slf4j_2.10-1.0.2.pom
(2 KB at 71.9 KB/sec)
2017-06-05T18:05:47.014 [INFO] Downloading: https://repo.maven.apache.org/maven2/org/scala-lang/scala-library/2.10.3/scala-library-2.10.3.pom
2017-06-05T18:05:47.040 [INFO] Downloaded: https://repo.maven.apache.org/maven2/org/scala-lang/scala-library/2.10.3/scala-library-2.10.3.pom
(2 KB at 76.8 KB/sec)
2017-06-05T18:05:47.043 [INFO] Downloading: https://repo.maven.apache.org/maven2/com/github/scopt/scopt_2.10/3.5.0/scopt_2.10-3.5.0.pom
2017-06-05T18:05:47.070 [INFO] Downloaded: https://repo.maven.apache.org/maven2/com/github/scopt/scopt_2.10/3.5.0/scopt_2.10-3.5.0.pom
(2 KB at 60.6 KB/sec)
2017-06-05T18:05:47.074 [INFO] Downloading: https://repo.maven.apache.org/maven2/org/apache/zookeeper/zookeeper/3.4.6/zookeeper-3.4.6.pom
2017-06-05T18:05:47.101 [INFO] Downloaded: https://repo.maven.apache.org/maven2/org/apache/zookeeper/zookeeper/3.4.6/zookeeper-3.4.6.pom
(4 KB at 121.8 KB/sec)
2017-06-05T18:05:47.103 [INFO] Downloading: https://repo.maven.apache.org/maven2/jline/jline/0.9.94/jline-0.9.94.pom
2017-06-05T18:05:47.130 [INFO] Downloaded: https://repo.maven.apache.org/maven2/jline/jline/0.9.94/jline-0.9.94.pom
(7 KB at 230.0 KB/sec)
2017-06-05T18:05:47.135 [INFO] Downloading: https://repo.maven.apache.org/maven2/io/netty/netty/3.7.0.Final/netty-3.7.0.Final.pom
2017-06-05T18:05:47.167 [INFO] Downloaded: https://repo.maven.apache.org/maven2/io/netty/netty/3.7.0.Final/netty-3.7.0.Final.pom
(26 KB at 799.7 KB/sec)
2017-06-05T18:05:47.175 [INFO] Downloading: https://repo.maven.apache.org/maven2/com/twitter/chill_2.10/0.7.4/chill_2.10-0.7.4.pom
2017-06-05T18:05:47.204 [INFO] Downloaded: https://repo.maven.apache.org/maven2/com/twitter/chill_2.10/0.7.4/chill_2.10-0.7.4.pom
(3 KB at 79.9 KB/sec)
2017-06-05T18:05:47.207 [INFO] Downloading: https://repo.maven.apache.org/maven2/org/scala-lang/scala-library/2.10.5/scala-library-2.10.5.pom
2017-06-05T18:05:47.233 [INFO] Downloaded: https://repo.maven.apache.org/maven2/org/scala-lang/scala-library/2.10.5/scala-library-2.10.5.pom
(2 KB at 76.8 KB/sec)
2017-06-05T18:05:47.235 [INFO] Downloading: https://repo.maven.apache.org/maven2/com/twitter/chill-java/0.7.4/chill-java-0.7.4.pom
2017-06-05T18:05:47.263 [INFO] Downloaded: https://repo.maven.apache.org/maven2/com/twitter/chill-java/0.7.4/chill-java-0.7.4.pom
(2 KB at 70.9 KB/sec)
2017-06-05T18:05:47.270 [INFO] Downloading: https://repo.maven.apache.org/maven2/org/apache/flink/flink-streaming-java_2.10/1.3.0/flink-streaming-java_2.10-1.3.0.pom
2017-06-05T18:05:47.299 [INFO] Downloaded: https://repo.maven.apache.org/maven2/org/apache/flink/flink-streaming-java_2.10/1.3.0/flink-streaming-java_2.10-1.3.0.pom
(7 KB at 207.9 KB/sec)
2017-06-05T18:05:47.306 [INFO] Downloading: https://repo.maven.apache.org/maven2/org/apache/sling/org.apache.sling.commons.json/2.0.6/org.apache.sling.commons.json-2.0.6.pom
2017-06-05T18:05:47.337 [INFO] Downloaded: https://repo.maven.apache.org/maven2/org/apache/sling/org.apache.sling.commons.json/2.0.6/org.apache.sling.commons.json-2.0.6.pom
(4 KB at 98.9 KB/sec)
2017-06-05T18:05:47.339 [INFO] Downloading: https://repo.maven.apache.org/maven2/org/apache/sling/sling/10/sling-10.pom
2017-06-05T18:05:47.372 [INFO] Downloaded: https://repo.maven.apache.org/maven2/org/apache/sling/sling/10/sling-10.pom
(26 KB at 759.6 KB/sec)
2017-06-05T18:05:47.375 [INFO] Downloading: https://repo.maven.apache.org/maven2/org/apache/apache/8/apache-8.pom
2017-06-05T18:05:47.405 [INFO] Downloaded: https://repo.maven.apache.org/maven2/org/apache/apache/8/apache-8.pom
(14 KB at 457.5 KB/sec)
2017-06-05T18:05:47.423 [INFO] Downloading: https://repo.maven.apache.org/maven2/com/google/apis/google-api-services-bigquery/v2-rev295-1.22.0/google-api-services-bigquery-v2-rev295-1.22.0.pom
2017-06-05T18:05:47.453 [INFO] Downloaded: https://repo.maven.apache.org/maven2/com/google/apis/google-api-services-bigquery/v2-rev295-1.22.0/google-api-services-bigquery-v2-rev295-1.22.0.pom
(3 KB at 85.1 KB/sec)
2017-06-05T18:05:47.456 [INFO] Downloading: https://repo.maven.apache.org/maven2/com/google/api-client/google-api-client/1.22.0/google-api-client-1.22.0.pom
2017-06-05T18:05:47.484 [INFO] Downloaded: https://repo.maven.apache.org/maven2/com/google/api-client/google-api-client/1.22.0/google-api-client-1.22.0.pom
(4 KB at 136.4 KB/sec)
2017-06-05T18:05:47.486 [INFO] Downloading: https://repo.maven.apache.org/maven2/com/google/api-client/google-api-client-parent/1.22.0/google-api-client-parent-1.22.0.pom
2017-06-05T18:05:47.519 [INFO] Downloaded: https://repo.maven.apache.org/maven2/com/google/api-client/google-api-client-parent/1.22.0/google-api-client-parent-1.22.0.pom
(25 KB at 728.2 KB/sec)
2017-06-05T18:05:47.524 [INFO] Downloading: https://repo.maven.apache.org/maven2/com/google/oauth-client/google-oauth-client/1.22.0/google-oauth-client-1.22.0.pom
2017-06-05T18:05:47.551 [INFO] Downloaded: https://repo.maven.apache.org/maven2/com/google/oauth-client/google-oauth-client/1.22.0/google-oauth-client-1.22.0.pom
(3 KB at 104.6 KB/sec)
2017-06-05T18:05:47.554 [INFO] Downloading: https://repo.maven.apache.org/maven2/com/google/oauth-client/google-oauth-client-parent/1.22.0/google-oauth-client-parent-1.22.0.pom
2017-06-05T18:05:47.586 [INFO] Downloaded: https://repo.maven.apache.org/maven2/com/google/oauth-client/google-oauth-client-parent/1.22.0/google-oauth-client-parent-1.22.0.pom
(21 KB at 649.9 KB/sec)
2017-06-05T18:05:47.593 [INFO] Downloading: https://repo.maven.apache.org/maven2/com/google/http-client/google-http-client/1.22.0/google-http-client-1.22.0.pom
2017-06-05T18:05:47.621 [INFO] Downloaded: https://repo.maven.apache.org/maven2/com/google/http-client/google-http-client/1.22.0/google-http-client-1.22.0.pom
(6 KB at 185.8 KB/sec)
2017-06-05T18:05:47.623 [INFO] Downloading: https://repo.maven.apache.org/maven2/com/google/http-client/google-http-client-parent/1.22.0/google-http-client-parent-1.22.0.pom
2017-06-05T18:05:47.656 [INFO] Downloaded: https://repo.maven.apache.org/maven2/com/google/http-client/google-http-client-parent/1.22.0/google-http-client-parent-1.22.0.pom
(25 KB at 753.3 KB/sec)
2017-06-05T18:05:47.662 [INFO] Downloading: https://repo.maven.apache.org/maven2/org/apache/httpcomponents/httpclient/4.0.1/httpclient-4.0.1.pom
2017-06-05T18:05:47.689 [INFO] Downloaded: https://repo.maven.apache.org/maven2/org/apache/httpcomponents/httpclient/4.0.1/httpclient-4.0.1.pom
(7 KB at 245.9 KB/sec)
2017-06-05T18:05:47.692 [INFO] Downloading: https://repo.maven.apache.org/maven2/org/apache/httpcomponents/httpcomponents-client/4.0.1/httpcomponents-client-4.0.1.pom
2017-06-05T18:05:47.720 [INFO] Downloaded: https://repo.maven.apache.org/maven2/org/apache/httpcomponents/httpcomponents-client/4.0.1/httpcomponents-client-4.0.1.pom
(9 KB at 332.5 KB/sec)
2017-06-05T18:05:47.723 [INFO] Downloading: https://repo.maven.apache.org/maven2/com/google/http-client/google-http-client-jackson2/1.22.0/google-http-client-jackson2-1.22.0.pom
2017-06-05T18:05:47.751 [INFO] Downloaded: https://repo.maven.apache.org/maven2/com/google/http-client/google-http-client-jackson2/1.22.0/google-http-client-jackson2-1.22.0.pom
(3 KB at 99.5 KB/sec)
2017-06-05T18:05:47.762 [INFO] Downloading: https://repo.maven.apache.org/maven2/org/apache/flink/flink-test-utils_2.10/1.3.0/flink-test-utils_2.10-1.3.0.pom
2017-06-05T18:05:47.788 [INFO] Downloaded: https://repo.maven.apache.org/maven2/org/apache/flink/flink-test-utils_2.10/1.3.0/flink-test-utils_2.10-1.3.0.pom
(5 KB at 178.1 KB/sec)
2017-06-05T18:05:47.791 [INFO] Downloading: https://repo.maven.apache.org/maven2/org/apache/flink/flink-test-utils-parent/1.3.0/flink-test-utils-parent-1.3.0.pom
2017-06-05T18:05:47.818 [INFO] Downloaded: https://repo.maven.apache.org/maven2/org/apache/flink/flink-test-utils-parent/1.3.0/flink-test-utils-parent-1.3.0.pom
(2 KB at 52.1 KB/sec)
2017-06-05T18:05:47.826 [INFO] Downloading: https://repo.maven.apache.org/maven2/org/apache/flink/flink-test-utils-junit/1.3.0/flink-test-utils-junit-1.3.0.pom
2017-06-05T18:05:47.853 [INFO] Downloaded: https://repo.maven.apache.org/maven2/org/apache/flink/flink-test-utils-junit/1.3.0/flink-test-utils-junit-1.3.0.pom
(4 KB at 118.9 KB/sec)
2017-06-05T18:05:47.861 [INFO] Downloading: https://repo.maven.apache.org/maven2/org/apache/curator/curator-test/2.12.0/curator-test-2.12.0.pom
2017-06-05T18:05:47.887 [INFO] Downloaded: https://repo.maven.apache.org/maven2/org/apache/curator/curator-test/2.12.0/curator-test-2.12.0.pom
(5 KB at 155.8 KB/sec)
2017-06-05T18:05:47.890 [INFO] Downloading: https://repo.maven.apache.org/maven2/org/apache/curator/apache-curator/2.12.0/apache-curator-2.12.0.pom
2017-06-05T18:05:47.925 [INFO] Downloaded: https://repo.maven.apache.org/maven2/org/apache/curator/apache-curator/2.12.0/apache-curator-2.12.0.pom
(32 KB at 902.0 KB/sec)
2017-06-05T18:05:47.928 [INFO] Downloading: https://repo.maven.apache.org/maven2/org/apache/zookeeper/zookeeper/3.4.8/zookeeper-3.4.8.pom
2017-06-05T18:05:47.954 [INFO] Downloaded: https://repo.maven.apache.org/maven2/org/apache/zookeeper/zookeeper/3.4.8/zookeeper-3.4.8.pom
(4 KB at 151.2 KB/sec)
2017-06-05T18:05:47.957 [INFO] Downloading: https://repo.maven.apache.org/maven2/log4j/log4j/1.2.16/log4j-1.2.16.pom
2017-06-05T18:05:47.986 [INFO] Downloaded: https://repo.maven.apache.org/maven2/log4j/log4j/1.2.16/log4j-1.2.16.pom
(20 KB at 684.9 KB/sec)
2017-06-05T18:05:47.990 [INFO] Downloading: https://repo.maven.apache.org/maven2/org/javassist/javassist/3.18.1-GA/javassist-3.18.1-GA.pom
2017-06-05T18:05:48.019 [INFO] Downloaded: https://repo.maven.apache.org/maven2/org/javassist/javassist/3.18.1-GA/javassist-3.18.1-GA.pom
(10 KB at 320.6 KB/sec)
[JENKINS] Archiving disabled
[JENKINS] Archiving disabled
[JENKINS] Archiving disabled
[JENKINS] Archiving disabled
[JENKINS] Archiving disabled
[JENKINS] Archiving disabled
[JENKINS] Archiving disabled
[JENKINS] Archiving disabled
[JENKINS] Archiving disabled
[JENKINS] Archiving disabled
[JENKINS] Archiving disabled
[JENKINS] Archiving disabled
[JENKINS] Archiving disabled2017-06-05T18:05:52.079 [INFO] ------------------------------------------------------------------------

2017-06-05T18:05:52.079 [INFO] Reactor Summary:
2017-06-05T18:05:52.079 [INFO] 
2017-06-05T18:05:52.080 [INFO] Apache Beam :: Parent .............................. SUCCESS
[ 24.981 s]
2017-06-05T18:05:52.080 [INFO] Apache Beam :: SDKs :: Java :: Build Tools ......... SUCCESS
[ 10.063 s]
2017-06-05T18:05:52.080 [INFO] Apache Beam :: SDKs ................................ SUCCESS
[  1.469 s]
2017-06-05T18:05:52.080 [INFO] Apache Beam :: SDKs :: Common ...................... SUCCESS
[  1.303 s]
2017-06-05T18:05:52.080 [INFO] Apache Beam :: SDKs :: Common :: Runner API ........ SUCCESS
[  9.732 s]
2017-06-05T18:05:52.080 [INFO] Apache Beam :: SDKs :: Common :: Fn API ............ SUCCESS
[  7.183 s]
2017-06-05T18:05:52.080 [INFO] Apache Beam :: SDKs :: Java ........................ SUCCESS
[  1.256 s]
2017-06-05T18:05:52.080 [INFO] Apache Beam :: SDKs :: Java :: Core ................ SUCCESS
[02:13 min]
2017-06-05T18:05:52.080 [INFO] Apache Beam :: Runners ............................. SUCCESS
[  2.002 s]
2017-06-05T18:05:52.080 [INFO] Apache Beam :: Runners :: Core Construction Java ... SUCCESS
[ 15.758 s]
2017-06-05T18:05:52.080 [INFO] Apache Beam :: Runners :: Core Java ................ SUCCESS
[ 43.953 s]
2017-06-05T18:05:52.080 [INFO] Apache Beam :: Runners :: Flink .................... FAILURE
[  3.059 s]
2017-06-05T18:05:52.080 [INFO] ------------------------------------------------------------------------
2017-06-05T18:05:52.080 [INFO] BUILD FAILURE
2017-06-05T18:05:52.080 [INFO] ------------------------------------------------------------------------
2017-06-05T18:05:52.080 [INFO] Total time: 04:48 min
2017-06-05T18:05:52.080 [INFO] Finished at: 2017-06-05T18:05:52+00:00
2017-06-05T18:05:52.940 [INFO] Final Memory: 114M/1466M
2017-06-05T18:05:52.940 [INFO] ------------------------------------------------------------------------
2017-06-05T18:05:52.941 [WARNING] The requested profile "validates-runner-tests" could not
be activated because it does not exist.
Waiting for Jenkins to finish collecting data
2017-06-05T18:05:53.101 [ERROR] Failed to execute goal on project beam-runners-flink_2.10:
Could not resolve dependencies for project org.apache.beam:beam-runners-flink_2.10:jar:2.1.0-SNAPSHOT:
Failed to collect dependencies at org.apache.flink:flink-clients_2.10:jar:1.3.0: Failed to
read artifact descriptor for org.apache.flink:flink-clients_2.10:jar:1.3.0: Could not transfer
artifact org.apache.flink:flink-clients_2.10:pom:1.3.0 from/to central (https://repo.maven.apache.org/maven2):
Connection reset -> [Help 1]
org.apache.maven.lifecycle.LifecycleExecutionException: Failed to execute goal on project
beam-runners-flink_2.10: Could not resolve dependencies for project org.apache.beam:beam-runners-flink_2.10:jar:2.1.0-SNAPSHOT:
Failed to collect dependencies at org.apache.flink:flink-clients_2.10:jar:1.3.0
	at org.apache.maven.lifecycle.internal.LifecycleDependencyResolver.getDependencies(LifecycleDependencyResolver.java:221)
	at org.apache.maven.lifecycle.internal.LifecycleDependencyResolver.resolveProjectDependencies(LifecycleDependencyResolver.java:127)
	at org.apache.maven.lifecycle.internal.MojoExecutor.ensureDependenciesAreResolved(MojoExecutor.java:257)
	at org.apache.maven.lifecycle.internal.MojoExecutor.execute(MojoExecutor.java:200)
	at org.apache.maven.lifecycle.internal.MojoExecutor.execute(MojoExecutor.java:153)
	at org.apache.maven.lifecycle.internal.MojoExecutor.execute(MojoExecutor.java:145)
	at org.apache.maven.lifecycle.internal.LifecycleModuleBuilder.buildProject(LifecycleModuleBuilder.java:116)
	at org.apache.maven.lifecycle.internal.LifecycleModuleBuilder.buildProject(LifecycleModuleBuilder.java:80)
	at org.apache.maven.lifecycle.internal.builder.singlethreaded.SingleThreadedBuilder.build(SingleThreadedBuilder.java:51)
	at org.apache.maven.lifecycle.internal.LifecycleStarter.execute(LifecycleStarter.java:128)
	at org.apache.maven.DefaultMaven.doExecute(DefaultMaven.java:307)
	at org.apache.maven.DefaultMaven.doExecute(DefaultMaven.java:193)
	at org.apache.maven.DefaultMaven.execute(DefaultMaven.java:106)
	at org.jvnet.hudson.maven3.launcher.Maven33Launcher.main(Maven33Launcher.java:129)
	at sun.reflect.NativeMethodAccessorImpl.invoke0(Native Method)
	at sun.reflect.NativeMethodAccessorImpl.invoke(NativeMethodAccessorImpl.java:62)
	at sun.reflect.DelegatingMethodAccessorImpl.invoke(DelegatingMethodAccessorImpl.java:43)
	at java.lang.reflect.Method.invoke(Method.java:498)
	at org.codehaus.plexus.classworlds.launcher.Launcher.launchStandard(Launcher.java:330)
	at org.codehaus.plexus.classworlds.launcher.Launcher.launch(Launcher.java:238)
	at jenkins.maven3.agent.Maven33Main.launch(Maven33Main.java:176)
	at sun.reflect.NativeMethodAccessorImpl.invoke0(Native Method)
	at sun.reflect.NativeMethodAccessorImpl.invoke(NativeMethodAccessorImpl.java:62)
	at sun.reflect.DelegatingMethodAccessorImpl.invoke(DelegatingMethodAccessorImpl.java:43)
	at java.lang.reflect.Method.invoke(Method.java:498)
	at hudson.maven.Maven3Builder.call(Maven3Builder.java:139)
	at hudson.maven.Maven3Builder.call(Maven3Builder.java:70)
	at hudson.remoting.UserRequest.perform(UserRequest.java:153)
	at hudson.remoting.UserRequest.perform(UserRequest.java:50)
	at hudson.remoting.Request$2.run(Request.java:336)
	at hudson.remoting.InterceptingExecutorService$1.call(InterceptingExecutorService.java:68)
	at java.util.concurrent.FutureTask.run(FutureTask.java:266)
	at java.util.concurrent.ThreadPoolExecutor.runWorker(ThreadPoolExecutor.java:1142)
	at java.util.concurrent.ThreadPoolExecutor$Worker.run(ThreadPoolExecutor.java:617)
	at java.lang.Thread.run(Thread.java:745)
Caused by: org.apache.maven.project.DependencyResolutionException: Could not resolve dependencies
for project org.apache.beam:beam-runners-flink_2.10:jar:2.1.0-SNAPSHOT: Failed to collect
dependencies at org.apache.flink:flink-clients_2.10:jar:1.3.0
	at org.apache.maven.project.DefaultProjectDependenciesResolver.resolve(DefaultProjectDependenciesResolver.java:180)
	at org.apache.maven.lifecycle.internal.LifecycleDependencyResolver.getDependencies(LifecycleDependencyResolver.java:195)
	... 34 more
Caused by: org.eclipse.aether.collection.DependencyCollectionException: Failed to collect
dependencies at org.apache.flink:flink-clients_2.10:jar:1.3.0
	at org.eclipse.aether.internal.impl.DefaultDependencyCollector.collectDependencies(DefaultDependencyCollector.java:291)
	at org.eclipse.aether.internal.impl.DefaultRepositorySystem.collectDependencies(DefaultRepositorySystem.java:316)
	at org.apache.maven.project.DefaultProjectDependenciesResolver.resolve(DefaultProjectDependenciesResolver.java:172)
	... 35 more
Caused by: org.eclipse.aether.resolution.ArtifactDescriptorException: Failed to read artifact
descriptor for org.apache.flink:flink-clients_2.10:jar:1.3.0
	at org.apache.maven.repository.internal.DefaultArtifactDescriptorReader.loadPom(DefaultArtifactDescriptorReader.java:302)
	at org.apache.maven.repository.internal.DefaultArtifactDescriptorReader.readArtifactDescriptor(DefaultArtifactDescriptorReader.java:218)
	at org.eclipse.aether.internal.impl.DefaultDependencyCollector.resolveCachedArtifactDescriptor(DefaultDependencyCollector.java:535)
	at org.eclipse.aether.internal.impl.DefaultDependencyCollector.getArtifactDescriptorResult(DefaultDependencyCollector.java:519)
	at org.eclipse.aether.internal.impl.DefaultDependencyCollector.processDependency(DefaultDependencyCollector.java:409)
	at org.eclipse.aether.internal.impl.DefaultDependencyCollector.processDependency(DefaultDependencyCollector.java:363)
	at org.eclipse.aether.internal.impl.DefaultDependencyCollector.process(DefaultDependencyCollector.java:351)
	at org.eclipse.aether.internal.impl.DefaultDependencyCollector.collectDependencies(DefaultDependencyCollector.java:254)
	... 37 more
Caused by: org.eclipse.aether.resolution.ArtifactResolutionException: Could not transfer artifact
org.apache.flink:flink-clients_2.10:pom:1.3.0 from/to central (https://repo.maven.apache.org/maven2):
Connection reset
	at org.eclipse.aether.internal.impl.DefaultArtifactResolver.resolve(DefaultArtifactResolver.java:444)
	at org.eclipse.aether.internal.impl.DefaultArtifactResolver.resolveArtifacts(DefaultArtifactResolver.java:246)
	at org.eclipse.aether.internal.impl.DefaultArtifactResolver.resolveArtifact(DefaultArtifactResolver.java:223)
	at org.apache.maven.repository.internal.DefaultArtifactDescriptorReader.loadPom(DefaultArtifactDescriptorReader.java:287)
	... 44 more
Caused by: org.eclipse.aether.transfer.ArtifactTransferException: Could not transfer artifact
org.apache.flink:flink-clients_2.10:pom:1.3.0 from/to central (https://repo.maven.apache.org/maven2):
Connection reset
	at org.eclipse.aether.connector.basic.ArtifactTransportListener.transferFailed(ArtifactTransportListener.java:43)
	at org.eclipse.aether.connector.basic.BasicRepositoryConnector$TaskRunner.run(BasicRepositoryConnector.java:355)
	at org.eclipse.aether.util.concurrency.RunnableErrorForwarder$1.run(RunnableErrorForwarder.java:67)
	at org.eclipse.aether.connector.basic.BasicRepositoryConnector$DirectExecutor.execute(BasicRepositoryConnector.java:581)
	at org.eclipse.aether.connector.basic.BasicRepositoryConnector.get(BasicRepositoryConnector.java:249)
	at org.eclipse.aether.internal.impl.DefaultArtifactResolver.performDownloads(DefaultArtifactResolver.java:520)
	at org.eclipse.aether.internal.impl.DefaultArtifactResolver.resolve(DefaultArtifactResolver.java:421)
	... 47 more
Caused by: org.apache.maven.wagon.TransferFailedException: Connection reset
	at org.apache.maven.wagon.providers.http.AbstractHttpClientWagon.fillInputData(AbstractHttpClientWagon.java:1066)
	at org.apache.maven.wagon.providers.http.AbstractHttpClientWagon.fillInputData(AbstractHttpClientWagon.java:960)
	at org.apache.maven.wagon.StreamWagon.getInputStream(StreamWagon.java:116)
	at org.apache.maven.wagon.StreamWagon.getIfNewer(StreamWagon.java:88)
	at org.apache.maven.wagon.StreamWagon.get(StreamWagon.java:61)
	at org.eclipse.aether.transport.wagon.WagonTransporter$GetTaskRunner.run(WagonTransporter.java:560)
	at org.eclipse.aether.transport.wagon.WagonTransporter.execute(WagonTransporter.java:427)
	at org.eclipse.aether.transport.wagon.WagonTransporter.get(WagonTransporter.java:404)
	at org.eclipse.aether.connector.basic.BasicRepositoryConnector$GetTaskRunner.runTask(BasicRepositoryConnector.java:447)
	at org.eclipse.aether.connector.basic.BasicRepositoryConnector$TaskRunner.run(BasicRepositoryConnector.java:350)
	... 52 more
Caused by: java.net.SocketException: Connection reset
	at java.net.SocketInputStream.read(SocketInputStream.java:210)
	at java.net.SocketInputStream.read(SocketInputStream.java:141)
	at sun.security.ssl.InputRecord.readFully(InputRecord.java:465)
	at sun.security.ssl.InputRecord.read(InputRecord.java:503)
	at sun.security.ssl.SSLSocketImpl.readRecord(SSLSocketImpl.java:973)
	at sun.security.ssl.SSLSocketImpl.readDataRecord(SSLSocketImpl.java:930)
	at sun.security.ssl.AppInputStream.read(AppInputStream.java:105)
	at org.apache.maven.wagon.providers.http.httpclient.impl.io.SessionInputBufferImpl.streamRead(SessionInputBufferImpl.java:136)
	at org.apache.maven.wagon.providers.http.httpclient.impl.io.SessionInputBufferImpl.fillBuffer(SessionInputBufferImpl.java:152)
	at org.apache.maven.wagon.providers.http.httpclient.impl.io.SessionInputBufferImpl.readLine(SessionInputBufferImpl.java:270)
	at org.apache.maven.wagon.providers.http.httpclient.impl.conn.DefaultHttpResponseParser.parseHead(DefaultHttpResponseParser.java:140)
	at org.apache.maven.wagon.providers.http.httpclient.impl.conn.DefaultHttpResponseParser.parseHead(DefaultHttpResponseParser.java:57)
	at org.apache.maven.wagon.providers.http.httpclient.impl.io.AbstractMessageParser.parse(AbstractMessageParser.java:260)
	at org.apache.maven.wagon.providers.http.httpclient.impl.DefaultBHttpClientConnection.receiveResponseHeader(DefaultBHttpClientConnection.java:161)
	at org.apache.maven.wagon.providers.http.httpclient.impl.conn.CPoolProxy.receiveResponseHeader(CPoolProxy.java:153)
	at org.apache.maven.wagon.providers.http.httpclient.protocol.HttpRequestExecutor.doReceiveResponse(HttpRequestExecutor.java:271)
	at org.apache.maven.wagon.providers.http.httpclient.protocol.HttpRequestExecutor.execute(HttpRequestExecutor.java:123)
	at org.apache.maven.wagon.providers.http.httpclient.impl.execchain.MainClientExec.execute(MainClientExec.java:254)
	at org.apache.maven.wagon.providers.http.httpclient.impl.execchain.ProtocolExec.execute(ProtocolExec.java:195)
	at org.apache.maven.wagon.providers.http.httpclient.impl.execchain.RetryExec.execute(RetryExec.java:86)
	at org.apache.maven.wagon.providers.http.httpclient.impl.execchain.RedirectExec.execute(RedirectExec.java:108)
	at org.apache.maven.wagon.providers.http.httpclient.impl.client.InternalHttpClient.doExecute(InternalHttpClient.java:184)
	at org.apache.maven.wagon.providers.http.httpclient.impl.client.CloseableHttpClient.execute(CloseableHttpClient.java:82)
	at org.apache.maven.wagon.providers.http.AbstractHttpClientWagon.execute(AbstractHttpClientWagon.java:832)
	at org.apache.maven.wagon.providers.http.AbstractHttpClientWagon.fillInputData(AbstractHttpClientWagon.java:983)
	... 61 more
2017-06-05T18:05:53.112 [ERROR] 
2017-06-05T18:05:53.112 [ERROR] Re-run Maven using the -X switch to enable full debug logging.
2017-06-05T18:05:53.112 [ERROR] 
2017-06-05T18:05:53.113 [ERROR] For more information about the errors and possible solutions,
please read the following articles:
2017-06-05T18:05:53.113 [ERROR] [Help 1] http://cwiki.apache.org/confluence/display/MAVEN/DependencyResolutionException
2017-06-05T18:05:53.113 [ERROR] 
2017-06-05T18:05:53.113 [ERROR] After correcting the problems, you can resume the build with
the command
2017-06-05T18:05:53.114 [ERROR]   mvn <goals> -rf :beam-runners-flink_2.10
channel stopped

Mime
View raw message