beam-commits mailing list archives

Site index · List index
Message view « Date » · « Thread »
Top « Date » · « Thread »
From Apache Jenkins Server <jenk...@builds.apache.org>
Subject Build failed in Jenkins: beam_PostCommit_Java_MavenInstall #4142
Date Mon, 19 Jun 2017 18:37:04 GMT
See <https://builds.apache.org/job/beam_PostCommit_Java_MavenInstall/4142/display/redirect?page=changes>

Changes:

[kirpichov] A few cleanups in CombineTest

------------------------------------------
[...truncated 3.24 MB...]
root: INFO: start <DataOutputOperation assert_that/Group/Flatten/Write >
root: INFO: start <DoOperation assert_that/Group/pair_with_0 output_tags=[u'out']>
root: INFO: start <DoOperation assert_that/Create/Read output_tags=[u'out']>
root: INFO: start <DataInputOperation assert_that/Create/Read/inject_source receivers=[ConsumerSet[assert_that/Create/Read/inject_source.out0,
coder=DillCoder, len(consumers)=1]]>
root: INFO: finish <DataInputOperation assert_that/Create/Read/inject_source receivers=[ConsumerSet[assert_that/Create/Read/inject_source.out0,
coder=DillCoder, len(consumers)=1]]>
root: INFO: finish <DoOperation assert_that/Create/Read output_tags=[u'out'], receivers=[ConsumerSet[assert_that/Create/Read.out0,
coder=WindowedValueCoder[TupleCoder[FastPrimitivesCoder, FastPrimitivesCoder]], len(consumers)=1]]>
root: INFO: finish <DoOperation assert_that/Group/pair_with_0 output_tags=[u'out'], receivers=[ConsumerSet[assert_that/Group/pair_with_0.out0,
coder=WindowedValueCoder[TupleCoder[FastPrimitivesCoder, TupleCoder[FastPrimitivesCoder, FastPrimitivesCoder]]],
len(consumers)=1]]>
root: INFO: finish <DataOutputOperation assert_that/Group/Flatten/Write >
root: INFO: CONTROL RESPONSE instruction_id: "28"
process_bundle {
}

root: INFO: Running [('FlatMap(cross_product)/Read', WorkerRead(source=SourceBundle(weight=1.0,
source=<apache_beam.runners.portability.maptask_executor_runner.InMemorySource object at
0x7efee42641d0>, start_position=None, stop_position=None))), ('FlatMap(cross_product)',
WorkerDoFn(output_tags=['out'], input=(0, 0), side_inputs=[WorkerSideInputSource(source=<apache_beam.runners.portability.maptask_executor_runner.InMemorySource
object at 0x7efee4264f50>, tag=0)])), ('assert_that/WindowInto(WindowIntoFn)', WorkerDoFn(output_tags=['out'],
input=(1, 0))), ('assert_that/ToVoidKey', WorkerDoFn(output_tags=['out'], input=(2, 0))),
('assert_that/Group/pair_with_1', WorkerDoFn(output_tags=['out'], input=(3, 0))), ('assert_that/Group/Flatten/Write',
WorkerInMemoryWrite(output_buffer=GroupingOutput[1], write_windowed_values=True, input=(4,
0)))]
--------------------- >> end captured logging << ---------------------

======================================================================
FAIL: test_using_slow_impl (apache_beam.coders.slow_coders_test.SlowCoders)
----------------------------------------------------------------------
Traceback (most recent call last):
  File "<https://builds.apache.org/job/beam_PostCommit_Java_MavenInstall/ws/sdks/python/apache_beam/coders/slow_coders_test.py",>
line 41, in test_using_slow_impl
    import apache_beam.coders.stream
AssertionError: ImportError not raised

----------------------------------------------------------------------
Ran 1249 tests in 189.686s

FAILED (failures=1, errors=2, skipped=16)
Test failed: <unittest.runner.TextTestResult run=1249 errors=2 failures=1>
error: Test failed: <unittest.runner.TextTestResult run=1249 errors=2 failures=1>
ERROR: InvocationError: '<https://builds.apache.org/job/beam_PostCommit_Java_MavenInstall/ws/sdks/python/target/.tox/py27gcp/bin/python>
setup.py test'
___________________________________ summary ____________________________________
  docs: commands succeeded
  lint: commands succeeded
ERROR:   py27: commands failed
ERROR:   py27cython: commands failed
ERROR:   py27gcp: commands failed
2017-06-19T18:36:14.943 [ERROR] Command execution failed.
org.apache.commons.exec.ExecuteException: Process exited with an error: 1 (Exit value: 1)
	at org.apache.commons.exec.DefaultExecutor.executeInternal(DefaultExecutor.java:404)
	at org.apache.commons.exec.DefaultExecutor.execute(DefaultExecutor.java:166)
	at org.codehaus.mojo.exec.ExecMojo.executeCommandLine(ExecMojo.java:764)
	at org.codehaus.mojo.exec.ExecMojo.executeCommandLine(ExecMojo.java:711)
	at org.codehaus.mojo.exec.ExecMojo.execute(ExecMojo.java:289)
	at org.apache.maven.plugin.DefaultBuildPluginManager.executeMojo(DefaultBuildPluginManager.java:134)
	at org.apache.maven.lifecycle.internal.MojoExecutor.execute(MojoExecutor.java:208)
	at org.apache.maven.lifecycle.internal.MojoExecutor.execute(MojoExecutor.java:153)
	at org.apache.maven.lifecycle.internal.MojoExecutor.execute(MojoExecutor.java:145)
	at org.apache.maven.lifecycle.internal.LifecycleModuleBuilder.buildProject(LifecycleModuleBuilder.java:116)
	at org.apache.maven.lifecycle.internal.LifecycleModuleBuilder.buildProject(LifecycleModuleBuilder.java:80)
	at org.apache.maven.lifecycle.internal.builder.singlethreaded.SingleThreadedBuilder.build(SingleThreadedBuilder.java:51)
	at org.apache.maven.lifecycle.internal.LifecycleStarter.execute(LifecycleStarter.java:128)
	at org.apache.maven.DefaultMaven.doExecute(DefaultMaven.java:307)
	at org.apache.maven.DefaultMaven.doExecute(DefaultMaven.java:193)
	at org.apache.maven.DefaultMaven.execute(DefaultMaven.java:106)
	at org.jvnet.hudson.maven3.launcher.Maven33Launcher.main(Maven33Launcher.java:129)
	at sun.reflect.NativeMethodAccessorImpl.invoke0(Native Method)
	at sun.reflect.NativeMethodAccessorImpl.invoke(NativeMethodAccessorImpl.java:62)
	at sun.reflect.DelegatingMethodAccessorImpl.invoke(DelegatingMethodAccessorImpl.java:43)
	at java.lang.reflect.Method.invoke(Method.java:498)
	at org.codehaus.plexus.classworlds.launcher.Launcher.launchStandard(Launcher.java:330)
	at org.codehaus.plexus.classworlds.launcher.Launcher.launch(Launcher.java:238)
	at jenkins.maven3.agent.Maven33Main.launch(Maven33Main.java:176)
	at sun.reflect.NativeMethodAccessorImpl.invoke0(Native Method)
	at sun.reflect.NativeMethodAccessorImpl.invoke(NativeMethodAccessorImpl.java:62)
	at sun.reflect.DelegatingMethodAccessorImpl.invoke(DelegatingMethodAccessorImpl.java:43)
	at java.lang.reflect.Method.invoke(Method.java:498)
	at hudson.maven.Maven3Builder.call(Maven3Builder.java:139)
	at hudson.maven.Maven3Builder.call(Maven3Builder.java:70)
	at hudson.remoting.UserRequest.perform(UserRequest.java:153)
	at hudson.remoting.UserRequest.perform(UserRequest.java:50)
	at hudson.remoting.Request$2.run(Request.java:336)
	at hudson.remoting.InterceptingExecutorService$1.call(InterceptingExecutorService.java:68)
	at java.util.concurrent.FutureTask.run(FutureTask.java:266)
	at java.util.concurrent.ThreadPoolExecutor.runWorker(ThreadPoolExecutor.java:1142)
	at java.util.concurrent.ThreadPoolExecutor$Worker.run(ThreadPoolExecutor.java:617)
	at java.lang.Thread.run(Thread.java:748)
[JENKINS] Archiving disabled
2017-06-19T18:36:15.419 [INFO]                                                           
             
2017-06-19T18:36:15.419 [INFO] ------------------------------------------------------------------------
2017-06-19T18:36:15.419 [INFO] Skipping Apache Beam :: Parent
2017-06-19T18:36:15.419 [INFO] This project has been banned from the build due to previous
failures.
2017-06-19T18:36:15.419 [INFO] ------------------------------------------------------------------------
[JENKINS] Archiving disabled
[JENKINS] Archiving disabled
[JENKINS] Archiving disabled
[JENKINS] Archiving disabled
[JENKINS] Archiving disabled
[JENKINS] Archiving disabled
[JENKINS] Archiving disabled
[JENKINS] Archiving disabled
[JENKINS] Archiving disabled
[JENKINS] Archiving disabled
[JENKINS] Archiving disabled
[JENKINS] Archiving disabled
[JENKINS] Archiving disabled
[JENKINS] Archiving disabled
[JENKINS] Archiving disabled
[JENKINS] Archiving disabled
[JENKINS] Archiving disabled
[JENKINS] Archiving disabled
[JENKINS] Archiving disabled
[JENKINS] Archiving disabled
[JENKINS] Archiving disabled
[JENKINS] Archiving disabled
[JENKINS] Archiving disabled
[JENKINS] Archiving disabled
[JENKINS] Archiving disabled
[JENKINS] Archiving disabled
[JENKINS] Archiving disabled
[JENKINS] Archiving disabled
[JENKINS] Archiving disabled
[JENKINS] Archiving disabled
[JENKINS] Archiving disabled
[JENKINS] Archiving disabled
[JENKINS] Archiving disabled
[JENKINS] Archiving disabled
[JENKINS] Archiving disabled
[JENKINS] Archiving disabled
[JENKINS] Archiving disabled
[JENKINS] Archiving disabled
[JENKINS] Archiving disabled
[JENKINS] Archiving disabled
[JENKINS] Archiving disabled
[JENKINS] Archiving disabled
[JENKINS] Archiving disabled
[JENKINS] Archiving disabled
[JENKINS] Archiving disabled
[JENKINS] Archiving disabled
[JENKINS] Archiving disabled
[JENKINS] Archiving disabled2017-06-19T18:36:43.602 [INFO] ------------------------------------------------------------------------
2017-06-19T18:36:43.602 [INFO] Reactor Summary:
2017-06-19T18:36:43.602 [INFO] 
2017-06-19T18:36:43.602 [INFO] Apache Beam :: Parent .............................. SUCCESS
[ 51.498 s]
2017-06-19T18:36:43.602 [INFO] Apache Beam :: SDKs :: Java :: Build Tools ......... SUCCESS
[ 29.983 s]
2017-06-19T18:36:43.602 [INFO] Apache Beam :: SDKs ................................ SUCCESS
[  9.595 s]
2017-06-19T18:36:43.602 [INFO] Apache Beam :: SDKs :: Common ...................... SUCCESS
[  3.243 s]
2017-06-19T18:36:43.602 [INFO] Apache Beam :: SDKs :: Common :: Runner API ........ SUCCESS
[ 31.614 s]
2017-06-19T18:36:43.602 [INFO] Apache Beam :: SDKs :: Common :: Fn API ............ SUCCESS
[ 45.236 s]
2017-06-19T18:36:43.602 [INFO] Apache Beam :: SDKs :: Java ........................ SUCCESS
[ 30.276 s]
2017-06-19T18:36:43.602 [INFO] Apache Beam :: SDKs :: Java :: Core ................ SUCCESS
[03:20 min]
2017-06-19T18:36:43.602 [INFO] Apache Beam :: Runners ............................. SUCCESS
[  7.064 s]
2017-06-19T18:36:43.602 [INFO] Apache Beam :: Runners :: Core Construction Java ... SUCCESS
[ 50.171 s]
2017-06-19T18:36:43.602 [INFO] Apache Beam :: Runners :: Core Java ................ SUCCESS
[01:21 min]
2017-06-19T18:36:43.602 [INFO] Apache Beam :: Runners :: Direct Java .............. SUCCESS
[04:10 min]
2017-06-19T18:36:43.602 [INFO] Apache Beam :: SDKs :: Java :: IO .................. SUCCESS
[  3.708 s]
2017-06-19T18:36:43.602 [INFO] Apache Beam :: SDKs :: Java :: IO :: Common ........ SUCCESS
[  8.322 s]
2017-06-19T18:36:43.603 [INFO] Apache Beam :: SDKs :: Java :: IO :: Cassandra ..... SUCCESS
[ 31.461 s]
2017-06-19T18:36:43.603 [INFO] Apache Beam :: SDKs :: Java :: IO :: Elasticsearch . SUCCESS
[ 55.002 s]
2017-06-19T18:36:43.603 [INFO] Apache Beam :: SDKs :: Java :: Extensions .......... SUCCESS
[  2.005 s]
2017-06-19T18:36:43.603 [INFO] Apache Beam :: SDKs :: Java :: Extensions :: Google Cloud Platform
Core SUCCESS [ 42.674 s]
2017-06-19T18:36:43.603 [INFO] Apache Beam :: SDKs :: Java :: Extensions :: Protobuf SUCCESS
[ 28.708 s]
2017-06-19T18:36:43.603 [INFO] Apache Beam :: SDKs :: Java :: IO :: Google Cloud Platform
SUCCESS [01:27 min]
2017-06-19T18:36:43.603 [INFO] Apache Beam :: SDKs :: Java :: IO :: Hadoop Common . SUCCESS
[ 29.109 s]
2017-06-19T18:36:43.603 [INFO] Apache Beam :: SDKs :: Java :: IO :: Hadoop File System SUCCESS
[ 54.370 s]
2017-06-19T18:36:43.603 [INFO] Apache Beam :: SDKs :: Java :: IO :: Hadoop ........ SUCCESS
[  6.660 s]
2017-06-19T18:36:43.603 [INFO] Apache Beam :: SDKs :: Java :: IO :: Hadoop :: input-format
SUCCESS [ 28.811 s]
2017-06-19T18:36:43.603 [INFO] Apache Beam :: Runners :: Google Cloud Dataflow .... SUCCESS
[06:51 min]
2017-06-19T18:36:43.603 [INFO] Apache Beam :: SDKs :: Java :: IO :: Hadoop :: jdk1.8-tests
SUCCESS [01:39 min]
2017-06-19T18:36:43.603 [INFO] Apache Beam :: SDKs :: Java :: IO :: HBase ......... SUCCESS
[01:38 min]
2017-06-19T18:36:43.603 [INFO] Apache Beam :: SDKs :: Java :: IO :: HCatalog ...... SUCCESS
[01:21 min]
2017-06-19T18:36:43.603 [INFO] Apache Beam :: SDKs :: Java :: IO :: JDBC .......... SUCCESS
[ 33.525 s]
2017-06-19T18:36:43.603 [INFO] Apache Beam :: SDKs :: Java :: IO :: JMS ........... SUCCESS
[ 33.339 s]
2017-06-19T18:36:43.603 [INFO] Apache Beam :: SDKs :: Java :: IO :: Kafka ......... SUCCESS
[ 28.633 s]
2017-06-19T18:36:43.604 [INFO] Apache Beam :: SDKs :: Java :: IO :: Kinesis ....... SUCCESS
[ 37.431 s]
2017-06-19T18:36:43.604 [INFO] Apache Beam :: SDKs :: Java :: IO :: MongoDB ....... SUCCESS
[ 45.822 s]
2017-06-19T18:36:43.604 [INFO] Apache Beam :: SDKs :: Java :: IO :: MQTT .......... SUCCESS
[ 28.683 s]
2017-06-19T18:36:43.604 [INFO] Apache Beam :: SDKs :: Java :: IO :: XML ........... SUCCESS
[ 45.456 s]
2017-06-19T18:36:43.604 [INFO] Apache Beam :: SDKs :: Java :: Maven Archetypes .... SUCCESS
[  1.623 s]
2017-06-19T18:36:43.604 [INFO] Apache Beam :: SDKs :: Java :: Maven Archetypes :: Starter
SUCCESS [ 37.125 s]
2017-06-19T18:36:43.604 [INFO] Apache Beam :: Examples ............................ SUCCESS
[  2.183 s]
2017-06-19T18:36:43.604 [INFO] Apache Beam :: Examples :: Java .................... SUCCESS
[06:01 min]
2017-06-19T18:36:43.604 [INFO] Apache Beam :: SDKs :: Java :: Maven Archetypes :: Examples
SUCCESS [ 41.251 s]
2017-06-19T18:36:43.604 [INFO] Apache Beam :: Examples :: Java 8 .................. SUCCESS
[ 23.295 s]
2017-06-19T18:36:43.604 [INFO] Apache Beam :: SDKs :: Java :: Maven Archetypes :: Examples
- Java 8 SUCCESS [ 38.029 s]
2017-06-19T18:36:43.604 [INFO] Apache Beam :: SDKs :: Java :: Extensions :: Jackson SUCCESS
[ 20.518 s]
2017-06-19T18:36:43.604 [INFO] Apache Beam :: SDKs :: Java :: Extensions :: Join library SUCCESS
[ 19.225 s]
2017-06-19T18:36:43.604 [INFO] Apache Beam :: SDKs :: Java :: Extensions :: Sorter  SUCCESS
[01:03 min]
2017-06-19T18:36:43.604 [INFO] Apache Beam :: SDKs :: Java :: Harness ............. SUCCESS
[ 38.372 s]
2017-06-19T18:36:43.604 [INFO] Apache Beam :: SDKs :: Java :: Java 8 Tests ........ SUCCESS
[ 12.163 s]
2017-06-19T18:36:43.604 [INFO] Apache Beam :: SDKs :: Python ...................... FAILURE
[20:41 min]
2017-06-19T18:36:43.604 [INFO] Apache Beam :: Runners :: Flink .................... SKIPPED
2017-06-19T18:36:43.604 [INFO] Apache Beam :: Runners :: Spark .................... SKIPPED
2017-06-19T18:36:43.604 [INFO] Apache Beam :: Runners :: Apex ..................... SKIPPED
2017-06-19T18:36:43.604 [INFO] Apache Beam :: SDKs :: Java :: Aggregated Javadoc .. SKIPPED
2017-06-19T18:36:43.604 [INFO] ------------------------------------------------------------------------
2017-06-19T18:36:43.604 [INFO] BUILD FAILURE
2017-06-19T18:36:43.604 [INFO] ------------------------------------------------------------------------
2017-06-19T18:36:43.604 [INFO] Total time: 01:10 h
2017-06-19T18:36:43.604 [INFO] Finished at: 2017-06-19T18:36:43+00:00

2017-06-19T18:36:44.938 [INFO] Final Memory: 282M/2241M
2017-06-19T18:36:44.938 [INFO] ------------------------------------------------------------------------
Waiting for Jenkins to finish collecting data
2017-06-19T18:36:59.719 [ERROR] Failed to execute goal org.codehaus.mojo:exec-maven-plugin:1.5.0:exec
(setuptools-test) on project beam-sdks-python: Command execution failed. Process exited with
an error: 1 (Exit value: 1) -> [Help 1]
org.apache.maven.lifecycle.LifecycleExecutionException: Failed to execute goal org.codehaus.mojo:exec-maven-plugin:1.5.0:exec
(setuptools-test) on project beam-sdks-python: Command execution failed.
	at org.apache.maven.lifecycle.internal.MojoExecutor.execute(MojoExecutor.java:216)
	at org.apache.maven.lifecycle.internal.MojoExecutor.execute(MojoExecutor.java:153)
	at org.apache.maven.lifecycle.internal.MojoExecutor.execute(MojoExecutor.java:145)
	at org.apache.maven.lifecycle.internal.LifecycleModuleBuilder.buildProject(LifecycleModuleBuilder.java:116)
	at org.apache.maven.lifecycle.internal.LifecycleModuleBuilder.buildProject(LifecycleModuleBuilder.java:80)
	at org.apache.maven.lifecycle.internal.builder.singlethreaded.SingleThreadedBuilder.build(SingleThreadedBuilder.java:51)
	at org.apache.maven.lifecycle.internal.LifecycleStarter.execute(LifecycleStarter.java:128)
	at org.apache.maven.DefaultMaven.doExecute(DefaultMaven.java:307)
	at org.apache.maven.DefaultMaven.doExecute(DefaultMaven.java:193)
	at org.apache.maven.DefaultMaven.execute(DefaultMaven.java:106)
	at org.jvnet.hudson.maven3.launcher.Maven33Launcher.main(Maven33Launcher.java:129)
	at sun.reflect.NativeMethodAccessorImpl.invoke0(Native Method)
	at sun.reflect.NativeMethodAccessorImpl.invoke(NativeMethodAccessorImpl.java:62)
	at sun.reflect.DelegatingMethodAccessorImpl.invoke(DelegatingMethodAccessorImpl.java:43)
	at java.lang.reflect.Method.invoke(Method.java:498)
	at org.codehaus.plexus.classworlds.launcher.Launcher.launchStandard(Launcher.java:330)
	at org.codehaus.plexus.classworlds.launcher.Launcher.launch(Launcher.java:238)
	at jenkins.maven3.agent.Maven33Main.launch(Maven33Main.java:176)
	at sun.reflect.NativeMethodAccessorImpl.invoke0(Native Method)
	at sun.reflect.NativeMethodAccessorImpl.invoke(NativeMethodAccessorImpl.java:62)
	at sun.reflect.DelegatingMethodAccessorImpl.invoke(DelegatingMethodAccessorImpl.java:43)
	at java.lang.reflect.Method.invoke(Method.java:498)
	at hudson.maven.Maven3Builder.call(Maven3Builder.java:139)
	at hudson.maven.Maven3Builder.call(Maven3Builder.java:70)
	at hudson.remoting.UserRequest.perform(UserRequest.java:153)
	at hudson.remoting.UserRequest.perform(UserRequest.java:50)
	at hudson.remoting.Request$2.run(Request.java:336)
	at hudson.remoting.InterceptingExecutorService$1.call(InterceptingExecutorService.java:68)
	at java.util.concurrent.FutureTask.run(FutureTask.java:266)
	at java.util.concurrent.ThreadPoolExecutor.runWorker(ThreadPoolExecutor.java:1142)
	at java.util.concurrent.ThreadPoolExecutor$Worker.run(ThreadPoolExecutor.java:617)
	at java.lang.Thread.run(Thread.java:748)
Caused by: org.apache.maven.plugin.MojoExecutionException: Command execution failed.
	at org.codehaus.mojo.exec.ExecMojo.execute(ExecMojo.java:302)
	at org.apache.maven.plugin.DefaultBuildPluginManager.executeMojo(DefaultBuildPluginManager.java:134)
	at org.apache.maven.lifecycle.internal.MojoExecutor.execute(MojoExecutor.java:208)
	... 31 more
Caused by: org.apache.commons.exec.ExecuteException: Process exited with an error: 1 (Exit
value: 1)
	at org.apache.commons.exec.DefaultExecutor.executeInternal(DefaultExecutor.java:404)
	at org.apache.commons.exec.DefaultExecutor.execute(DefaultExecutor.java:166)
	at org.codehaus.mojo.exec.ExecMojo.executeCommandLine(ExecMojo.java:764)
	at org.codehaus.mojo.exec.ExecMojo.executeCommandLine(ExecMojo.java:711)
	at org.codehaus.mojo.exec.ExecMojo.execute(ExecMojo.java:289)
	... 33 more
2017-06-19T18:36:59.720 [ERROR] 
2017-06-19T18:36:59.720 [ERROR] Re-run Maven using the -X switch to enable full debug logging.
2017-06-19T18:36:59.720 [ERROR] 
2017-06-19T18:36:59.720 [ERROR] For more information about the errors and possible solutions,
please read the following articles:
2017-06-19T18:36:59.720 [ERROR] [Help 1] http://cwiki.apache.org/confluence/display/MAVEN/MojoExecutionException
2017-06-19T18:36:59.721 [ERROR] 
2017-06-19T18:36:59.721 [ERROR] After correcting the problems, you can resume the build with
the command
2017-06-19T18:36:59.721 [ERROR]   mvn <goals> -rf :beam-sdks-python
channel stopped
Not sending mail to unregistered user kirpichov@google.com

Mime
View raw message