beam-commits mailing list archives

Site index · List index
Message view « Date » · « Thread »
Top « Date » · « Thread »
From Apache Jenkins Server <jenk...@builds.apache.org>
Subject Build failed in Jenkins: beam_PostCommit_Java_MavenInstall #4140
Date Mon, 19 Jun 2017 18:21:46 GMT
See <https://builds.apache.org/job/beam_PostCommit_Java_MavenInstall/4140/display/redirect?page=changes>

Changes:

[lcwik] [BEAM-1348] Model the Fn State Api as per

------------------------------------------
[...truncated 3.24 MB...]

root: INFO: start <DataOutputOperation assert_that/Group/Flatten/Write >
root: INFO: start <DoOperation assert_that/Group/pair_with_0 output_tags=[u'out']>
root: INFO: start <DoOperation assert_that/Create/Read output_tags=[u'out']>
root: INFO: start <DataInputOperation assert_that/Create/Read/inject_source receivers=[ConsumerSet[assert_that/Create/Read/inject_source.out0,
coder=DillCoder, len(consumers)=1]]>
root: INFO: finish <DataInputOperation assert_that/Create/Read/inject_source receivers=[ConsumerSet[assert_that/Create/Read/inject_source.out0,
coder=DillCoder, len(consumers)=1]]>
root: INFO: finish <DoOperation assert_that/Create/Read output_tags=[u'out'], receivers=[ConsumerSet[assert_that/Create/Read.out0,
coder=WindowedValueCoder[TupleCoder[FastPrimitivesCoder, FastPrimitivesCoder]], len(consumers)=1]]>
root: INFO: finish <DoOperation assert_that/Group/pair_with_0 output_tags=[u'out'], receivers=[ConsumerSet[assert_that/Group/pair_with_0.out0,
coder=WindowedValueCoder[TupleCoder[FastPrimitivesCoder, TupleCoder[FastPrimitivesCoder, FastPrimitivesCoder]]],
len(consumers)=1]]>
root: INFO: finish <DataOutputOperation assert_that/Group/Flatten/Write >
root: INFO: CONTROL RESPONSE instruction_id: "28"
process_bundle {
}

root: INFO: Running [('FlatMap(cross_product)/Read', WorkerRead(source=SourceBundle(weight=1.0,
source=<apache_beam.runners.portability.maptask_executor_runner.InMemorySource object at
0x7f7aedf2f5d0>, start_position=None, stop_position=None))), ('FlatMap(cross_product)',
WorkerDoFn(output_tags=['out'], input=(0, 0), side_inputs=[WorkerSideInputSource(source=<apache_beam.runners.portability.maptask_executor_runner.InMemorySource
object at 0x7f7aedf2f6d0>, tag=0)])), ('assert_that/WindowInto(WindowIntoFn)', WorkerDoFn(output_tags=['out'],
input=(1, 0))), ('assert_that/ToVoidKey', WorkerDoFn(output_tags=['out'], input=(2, 0))),
('assert_that/Group/pair_with_1', WorkerDoFn(output_tags=['out'], input=(3, 0))), ('assert_that/Group/Flatten/Write',
WorkerInMemoryWrite(output_buffer=GroupingOutput[1], write_windowed_values=True, input=(4,
0)))]
--------------------- >> end captured logging << ---------------------

======================================================================
FAIL: test_using_slow_impl (apache_beam.coders.slow_coders_test.SlowCoders)
----------------------------------------------------------------------
Traceback (most recent call last):
  File "<https://builds.apache.org/job/beam_PostCommit_Java_MavenInstall/ws/sdks/python/apache_beam/coders/slow_coders_test.py",>
line 41, in test_using_slow_impl
    import apache_beam.coders.stream
AssertionError: ImportError not raised

----------------------------------------------------------------------
Ran 1248 tests in 137.731s

FAILED (failures=1, errors=2, skipped=16)
Test failed: <unittest.runner.TextTestResult run=1248 errors=2 failures=1>
error: Test failed: <unittest.runner.TextTestResult run=1248 errors=2 failures=1>
ERROR: InvocationError: '<https://builds.apache.org/job/beam_PostCommit_Java_MavenInstall/ws/sdks/python/target/.tox/py27gcp/bin/python>
setup.py test'
___________________________________ summary ____________________________________
  docs: commands succeeded
  lint: commands succeeded
ERROR:   py27: commands failed
ERROR:   py27cython: commands failed
ERROR:   py27gcp: commands failed
2017-06-19T18:21:05.632 [ERROR] Command execution failed.
org.apache.commons.exec.ExecuteException: Process exited with an error: 1 (Exit value: 1)
	at org.apache.commons.exec.DefaultExecutor.executeInternal(DefaultExecutor.java:404)
	at org.apache.commons.exec.DefaultExecutor.execute(DefaultExecutor.java:166)
	at org.codehaus.mojo.exec.ExecMojo.executeCommandLine(ExecMojo.java:764)
	at org.codehaus.mojo.exec.ExecMojo.executeCommandLine(ExecMojo.java:711)
	at org.codehaus.mojo.exec.ExecMojo.execute(ExecMojo.java:289)
	at org.apache.maven.plugin.DefaultBuildPluginManager.executeMojo(DefaultBuildPluginManager.java:134)
	at org.apache.maven.lifecycle.internal.MojoExecutor.execute(MojoExecutor.java:208)
	at org.apache.maven.lifecycle.internal.MojoExecutor.execute(MojoExecutor.java:153)
	at org.apache.maven.lifecycle.internal.MojoExecutor.execute(MojoExecutor.java:145)
	at org.apache.maven.lifecycle.internal.LifecycleModuleBuilder.buildProject(LifecycleModuleBuilder.java:116)
	at org.apache.maven.lifecycle.internal.LifecycleModuleBuilder.buildProject(LifecycleModuleBuilder.java:80)
	at org.apache.maven.lifecycle.internal.builder.singlethreaded.SingleThreadedBuilder.build(SingleThreadedBuilder.java:51)
	at org.apache.maven.lifecycle.internal.LifecycleStarter.execute(LifecycleStarter.java:128)
	at org.apache.maven.DefaultMaven.doExecute(DefaultMaven.java:307)
	at org.apache.maven.DefaultMaven.doExecute(DefaultMaven.java:193)
	at org.apache.maven.DefaultMaven.execute(DefaultMaven.java:106)
	at org.jvnet.hudson.maven3.launcher.Maven33Launcher.main(Maven33Launcher.java:129)
	at sun.reflect.NativeMethodAccessorImpl.invoke0(Native Method)
	at sun.reflect.NativeMethodAccessorImpl.invoke(NativeMethodAccessorImpl.java:62)
	at sun.reflect.DelegatingMethodAccessorImpl.invoke(DelegatingMethodAccessorImpl.java:43)
	at java.lang.reflect.Method.invoke(Method.java:498)
	at org.codehaus.plexus.classworlds.launcher.Launcher.launchStandard(Launcher.java:330)
	at org.codehaus.plexus.classworlds.launcher.Launcher.launch(Launcher.java:238)
	at jenkins.maven3.agent.Maven33Main.launch(Maven33Main.java:176)
	at sun.reflect.NativeMethodAccessorImpl.invoke0(Native Method)
	at sun.reflect.NativeMethodAccessorImpl.invoke(NativeMethodAccessorImpl.java:62)
	at sun.reflect.DelegatingMethodAccessorImpl.invoke(DelegatingMethodAccessorImpl.java:43)
	at java.lang.reflect.Method.invoke(Method.java:498)
	at hudson.maven.Maven3Builder.call(Maven3Builder.java:139)
	at hudson.maven.Maven3Builder.call(Maven3Builder.java:70)
	at hudson.remoting.UserRequest.perform(UserRequest.java:153)
	at hudson.remoting.UserRequest.perform(UserRequest.java:50)
	at hudson.remoting.Request$2.run(Request.java:336)
	at hudson.remoting.InterceptingExecutorService$1.call(InterceptingExecutorService.java:68)
	at java.util.concurrent.FutureTask.run(FutureTask.java:266)
	at java.util.concurrent.ThreadPoolExecutor.runWorker(ThreadPoolExecutor.java:1142)
	at java.util.concurrent.ThreadPoolExecutor$Worker.run(ThreadPoolExecutor.java:617)
	at java.lang.Thread.run(Thread.java:748)
[JENKINS] Archiving disabled
2017-06-19T18:21:06.178 [INFO]                                                           
             
2017-06-19T18:21:06.178 [INFO] ------------------------------------------------------------------------
2017-06-19T18:21:06.178 [INFO] Skipping Apache Beam :: Parent
2017-06-19T18:21:06.178 [INFO] This project has been banned from the build due to previous
failures.
2017-06-19T18:21:06.178 [INFO] ------------------------------------------------------------------------
[JENKINS] Archiving disabled
[JENKINS] Archiving disabled
[JENKINS] Archiving disabled
[JENKINS] Archiving disabled
[JENKINS] Archiving disabled
[JENKINS] Archiving disabled
[JENKINS] Archiving disabled
[JENKINS] Archiving disabled
[JENKINS] Archiving disabled
[JENKINS] Archiving disabled
[JENKINS] Archiving disabled
[JENKINS] Archiving disabled
[JENKINS] Archiving disabled
[JENKINS] Archiving disabled
[JENKINS] Archiving disabled
[JENKINS] Archiving disabled
[JENKINS] Archiving disabled
[JENKINS] Archiving disabled
[JENKINS] Archiving disabled
[JENKINS] Archiving disabled
[JENKINS] Archiving disabled
[JENKINS] Archiving disabled
[JENKINS] Archiving disabled
[JENKINS] Archiving disabled
[JENKINS] Archiving disabled
[JENKINS] Archiving disabled
[JENKINS] Archiving disabled
[JENKINS] Archiving disabled
[JENKINS] Archiving disabled
[JENKINS] Archiving disabled
[JENKINS] Archiving disabled
[JENKINS] Archiving disabled
[JENKINS] Archiving disabled
[JENKINS] Archiving disabled
[JENKINS] Archiving disabled
[JENKINS] Archiving disabled
[JENKINS] Archiving disabled
[JENKINS] Archiving disabled
[JENKINS] Archiving disabled
[JENKINS] Archiving disabled
[JENKINS] Archiving disabled
[JENKINS] Archiving disabled
[JENKINS] Archiving disabled
[JENKINS] Archiving disabled
[JENKINS] Archiving disabled
[JENKINS] Archiving disabled
[JENKINS] Archiving disabled
[JENKINS] Archiving disabled
2017-06-19T18:21:27.908 [INFO] ------------------------------------------------------------------------
2017-06-19T18:21:27.908 [INFO] Reactor Summary:
2017-06-19T18:21:27.908 [INFO] 
2017-06-19T18:21:27.908 [INFO] Apache Beam :: Parent .............................. SUCCESS
[ 26.226 s]
2017-06-19T18:21:27.908 [INFO] Apache Beam :: SDKs :: Java :: Build Tools ......... SUCCESS
[  9.274 s]
2017-06-19T18:21:27.908 [INFO] Apache Beam :: SDKs ................................ SUCCESS
[  4.768 s]
2017-06-19T18:21:27.908 [INFO] Apache Beam :: SDKs :: Common ...................... SUCCESS
[  1.779 s]
2017-06-19T18:21:27.909 [INFO] Apache Beam :: SDKs :: Common :: Runner API ........ SUCCESS
[ 18.020 s]
2017-06-19T18:21:27.909 [INFO] Apache Beam :: SDKs :: Common :: Fn API ............ SUCCESS
[ 18.260 s]
2017-06-19T18:21:27.909 [INFO] Apache Beam :: SDKs :: Java ........................ SUCCESS
[  1.765 s]
2017-06-19T18:21:27.909 [INFO] Apache Beam :: SDKs :: Java :: Core ................ SUCCESS
[02:53 min]
2017-06-19T18:21:27.909 [INFO] Apache Beam :: Runners ............................. SUCCESS
[  4.756 s]
2017-06-19T18:21:27.909 [INFO] Apache Beam :: Runners :: Core Construction Java ... SUCCESS
[ 37.488 s]
2017-06-19T18:21:27.909 [INFO] Apache Beam :: Runners :: Core Java ................ SUCCESS
[ 51.823 s]
2017-06-19T18:21:27.909 [INFO] Apache Beam :: Runners :: Direct Java .............. SUCCESS
[03:29 min]
2017-06-19T18:21:27.909 [INFO] Apache Beam :: SDKs :: Java :: IO .................. SUCCESS
[  3.872 s]
2017-06-19T18:21:27.909 [INFO] Apache Beam :: SDKs :: Java :: IO :: Common ........ SUCCESS
[ 12.743 s]
2017-06-19T18:21:27.909 [INFO] Apache Beam :: SDKs :: Java :: IO :: Cassandra ..... SUCCESS
[ 43.457 s]
2017-06-19T18:21:27.909 [INFO] Apache Beam :: SDKs :: Java :: IO :: Elasticsearch . SUCCESS
[ 51.374 s]
2017-06-19T18:21:27.909 [INFO] Apache Beam :: SDKs :: Java :: Extensions .......... SUCCESS
[ 12.074 s]
2017-06-19T18:21:27.909 [INFO] Apache Beam :: SDKs :: Java :: Extensions :: Google Cloud Platform
Core SUCCESS [ 44.890 s]
2017-06-19T18:21:27.909 [INFO] Apache Beam :: SDKs :: Java :: Extensions :: Protobuf SUCCESS
[ 34.473 s]
2017-06-19T18:21:27.909 [INFO] Apache Beam :: SDKs :: Java :: IO :: Google Cloud Platform
SUCCESS [01:45 min]
2017-06-19T18:21:27.909 [INFO] Apache Beam :: SDKs :: Java :: IO :: Hadoop Common . SUCCESS
[ 29.193 s]
2017-06-19T18:21:27.909 [INFO] Apache Beam :: SDKs :: Java :: IO :: Hadoop File System SUCCESS
[01:00 min]
2017-06-19T18:21:27.909 [INFO] Apache Beam :: SDKs :: Java :: IO :: Hadoop ........ SUCCESS
[ 26.825 s]
2017-06-19T18:21:27.909 [INFO] Apache Beam :: SDKs :: Java :: IO :: Hadoop :: input-format
SUCCESS [ 46.172 s]
2017-06-19T18:21:27.909 [INFO] Apache Beam :: Runners :: Google Cloud Dataflow .... SUCCESS
[07:10 min]
2017-06-19T18:21:27.909 [INFO] Apache Beam :: SDKs :: Java :: IO :: Hadoop :: jdk1.8-tests
SUCCESS [01:22 min]
2017-06-19T18:21:27.909 [INFO] Apache Beam :: SDKs :: Java :: IO :: HBase ......... SUCCESS
[01:08 min]
2017-06-19T18:21:27.909 [INFO] Apache Beam :: SDKs :: Java :: IO :: HCatalog ...... SUCCESS
[ 58.381 s]
2017-06-19T18:21:27.909 [INFO] Apache Beam :: SDKs :: Java :: IO :: JDBC .......... SUCCESS
[ 27.680 s]
2017-06-19T18:21:27.909 [INFO] Apache Beam :: SDKs :: Java :: IO :: JMS ........... SUCCESS
[ 24.017 s]
2017-06-19T18:21:27.909 [INFO] Apache Beam :: SDKs :: Java :: IO :: Kafka ......... SUCCESS
[ 37.541 s]
2017-06-19T18:21:27.909 [INFO] Apache Beam :: SDKs :: Java :: IO :: Kinesis ....... SUCCESS
[ 29.542 s]
2017-06-19T18:21:27.909 [INFO] Apache Beam :: SDKs :: Java :: IO :: MongoDB ....... SUCCESS
[ 46.301 s]
2017-06-19T18:21:27.909 [INFO] Apache Beam :: SDKs :: Java :: IO :: MQTT .......... SUCCESS
[ 19.536 s]
2017-06-19T18:21:27.909 [INFO] Apache Beam :: SDKs :: Java :: IO :: XML ........... SUCCESS
[ 27.513 s]
2017-06-19T18:21:27.909 [INFO] Apache Beam :: SDKs :: Java :: Maven Archetypes .... SUCCESS
[  1.971 s]
2017-06-19T18:21:27.909 [INFO] Apache Beam :: SDKs :: Java :: Maven Archetypes :: Starter
SUCCESS [ 20.298 s]
2017-06-19T18:21:27.909 [INFO] Apache Beam :: Examples ............................ SUCCESS
[  1.787 s]
2017-06-19T18:21:27.909 [INFO] Apache Beam :: Examples :: Java .................... SUCCESS
[06:34 min]
2017-06-19T18:21:27.909 [INFO] Apache Beam :: SDKs :: Java :: Maven Archetypes :: Examples
SUCCESS [ 42.533 s]
2017-06-19T18:21:27.909 [INFO] Apache Beam :: Examples :: Java 8 .................. SUCCESS
[ 25.579 s]
2017-06-19T18:21:27.909 [INFO] Apache Beam :: SDKs :: Java :: Maven Archetypes :: Examples
- Java 8 SUCCESS [ 32.079 s]
2017-06-19T18:21:27.910 [INFO] Apache Beam :: SDKs :: Java :: Extensions :: Jackson SUCCESS
[ 14.119 s]
2017-06-19T18:21:27.910 [INFO] Apache Beam :: SDKs :: Java :: Extensions :: Join library SUCCESS
[ 17.421 s]
2017-06-19T18:21:27.910 [INFO] Apache Beam :: SDKs :: Java :: Extensions :: Sorter  SUCCESS
[ 30.456 s]
2017-06-19T18:21:27.910 [INFO] Apache Beam :: SDKs :: Java :: Harness ............. SUCCESS
[ 36.985 s]
2017-06-19T18:21:27.910 [INFO] Apache Beam :: SDKs :: Java :: Java 8 Tests ........ SUCCESS
[ 12.109 s]
2017-06-19T18:21:27.910 [INFO] Apache Beam :: SDKs :: Python ...................... FAILURE
[20:57 min]
2017-06-19T18:21:27.910 [INFO] Apache Beam :: Runners :: Flink .................... SKIPPED
2017-06-19T18:21:27.910 [INFO] Apache Beam :: Runners :: Spark .................... SKIPPED
2017-06-19T18:21:27.910 [INFO] Apache Beam :: Runners :: Apex ..................... SKIPPED
2017-06-19T18:21:27.910 [INFO] Apache Beam :: SDKs :: Java :: Aggregated Javadoc .. SKIPPED
2017-06-19T18:21:27.910 [INFO] ------------------------------------------------------------------------
2017-06-19T18:21:27.910 [INFO] BUILD FAILURE
2017-06-19T18:21:27.910 [INFO] ------------------------------------------------------------------------
2017-06-19T18:21:27.910 [INFO] Total time: 01:07 h
2017-06-19T18:21:27.910 [INFO] Finished at: 2017-06-19T18:21:27+00:00
2017-06-19T18:21:28.600 [INFO] Final Memory: 286M/1819M
2017-06-19T18:21:28.600 [INFO] ------------------------------------------------------------------------
Waiting for Jenkins to finish collecting data
2017-06-19T18:21:40.770 [ERROR] Failed to execute goal org.codehaus.mojo:exec-maven-plugin:1.5.0:exec
(setuptools-test) on project beam-sdks-python: Command execution failed. Process exited with
an error: 1 (Exit value: 1) -> [Help 1]
org.apache.maven.lifecycle.LifecycleExecutionException: Failed to execute goal org.codehaus.mojo:exec-maven-plugin:1.5.0:exec
(setuptools-test) on project beam-sdks-python: Command execution failed.
	at org.apache.maven.lifecycle.internal.MojoExecutor.execute(MojoExecutor.java:216)
	at org.apache.maven.lifecycle.internal.MojoExecutor.execute(MojoExecutor.java:153)
	at org.apache.maven.lifecycle.internal.MojoExecutor.execute(MojoExecutor.java:145)
	at org.apache.maven.lifecycle.internal.LifecycleModuleBuilder.buildProject(LifecycleModuleBuilder.java:116)
	at org.apache.maven.lifecycle.internal.LifecycleModuleBuilder.buildProject(LifecycleModuleBuilder.java:80)
	at org.apache.maven.lifecycle.internal.builder.singlethreaded.SingleThreadedBuilder.build(SingleThreadedBuilder.java:51)
	at org.apache.maven.lifecycle.internal.LifecycleStarter.execute(LifecycleStarter.java:128)
	at org.apache.maven.DefaultMaven.doExecute(DefaultMaven.java:307)
	at org.apache.maven.DefaultMaven.doExecute(DefaultMaven.java:193)
	at org.apache.maven.DefaultMaven.execute(DefaultMaven.java:106)
	at org.jvnet.hudson.maven3.launcher.Maven33Launcher.main(Maven33Launcher.java:129)
	at sun.reflect.NativeMethodAccessorImpl.invoke0(Native Method)
	at sun.reflect.NativeMethodAccessorImpl.invoke(NativeMethodAccessorImpl.java:62)
	at sun.reflect.DelegatingMethodAccessorImpl.invoke(DelegatingMethodAccessorImpl.java:43)
	at java.lang.reflect.Method.invoke(Method.java:498)
	at org.codehaus.plexus.classworlds.launcher.Launcher.launchStandard(Launcher.java:330)
	at org.codehaus.plexus.classworlds.launcher.Launcher.launch(Launcher.java:238)
	at jenkins.maven3.agent.Maven33Main.launch(Maven33Main.java:176)
	at sun.reflect.NativeMethodAccessorImpl.invoke0(Native Method)
	at sun.reflect.NativeMethodAccessorImpl.invoke(NativeMethodAccessorImpl.java:62)
	at sun.reflect.DelegatingMethodAccessorImpl.invoke(DelegatingMethodAccessorImpl.java:43)
	at java.lang.reflect.Method.invoke(Method.java:498)
	at hudson.maven.Maven3Builder.call(Maven3Builder.java:139)
	at hudson.maven.Maven3Builder.call(Maven3Builder.java:70)
	at hudson.remoting.UserRequest.perform(UserRequest.java:153)
	at hudson.remoting.UserRequest.perform(UserRequest.java:50)
	at hudson.remoting.Request$2.run(Request.java:336)
	at hudson.remoting.InterceptingExecutorService$1.call(InterceptingExecutorService.java:68)
	at java.util.concurrent.FutureTask.run(FutureTask.java:266)
	at java.util.concurrent.ThreadPoolExecutor.runWorker(ThreadPoolExecutor.java:1142)
	at java.util.concurrent.ThreadPoolExecutor$Worker.run(ThreadPoolExecutor.java:617)
	at java.lang.Thread.run(Thread.java:748)
Caused by: org.apache.maven.plugin.MojoExecutionException: Command execution failed.
	at org.codehaus.mojo.exec.ExecMojo.execute(ExecMojo.java:302)
	at org.apache.maven.plugin.DefaultBuildPluginManager.executeMojo(DefaultBuildPluginManager.java:134)
	at org.apache.maven.lifecycle.internal.MojoExecutor.execute(MojoExecutor.java:208)
	... 31 more
Caused by: org.apache.commons.exec.ExecuteException: Process exited with an error: 1 (Exit
value: 1)
	at org.apache.commons.exec.DefaultExecutor.executeInternal(DefaultExecutor.java:404)
	at org.apache.commons.exec.DefaultExecutor.execute(DefaultExecutor.java:166)
	at org.codehaus.mojo.exec.ExecMojo.executeCommandLine(ExecMojo.java:764)
	at org.codehaus.mojo.exec.ExecMojo.executeCommandLine(ExecMojo.java:711)
	at org.codehaus.mojo.exec.ExecMojo.execute(ExecMojo.java:289)
	... 33 more
2017-06-19T18:21:40.771 [ERROR] 
2017-06-19T18:21:40.771 [ERROR] Re-run Maven using the -X switch to enable full debug logging.
2017-06-19T18:21:40.771 [ERROR] 
2017-06-19T18:21:40.771 [ERROR] For more information about the errors and possible solutions,
please read the following articles:
2017-06-19T18:21:40.771 [ERROR] [Help 1] http://cwiki.apache.org/confluence/display/MAVEN/MojoExecutionException
2017-06-19T18:21:40.771 [ERROR] 
2017-06-19T18:21:40.771 [ERROR] After correcting the problems, you can resume the build with
the command
2017-06-19T18:21:40.771 [ERROR]   mvn <goals> -rf :beam-sdks-python
channel stopped

Mime
View raw message