beam-commits mailing list archives

Site index · List index
Message view « Date » · « Thread »
Top « Date » · « Thread »
From Apache Jenkins Server <jenk...@builds.apache.org>
Subject Build failed in Jenkins: beam_PostCommit_Java_JDK_Versions_Test » JDK 1.7 (latest),beam #74
Date Mon, 12 Jun 2017 00:16:34 GMT
See <https://builds.apache.org/job/beam_PostCommit_Java_JDK_Versions_Test/jdk=JDK%201.7%20(latest),label=beam/74/display/redirect>

------------------------------------------
[...truncated 1012.17 KB...]
2017-06-12\T\00:11:33.947 [INFO] Excluding com.google.cloud:google-cloud-spanner:jar:0.16.0-beta
from the shaded jar.
2017-06-12\T\00:11:33.947 [INFO] Excluding com.google.cloud:google-cloud-core-grpc:jar:1.0.0-rc3
from the shaded jar.
2017-06-12\T\00:11:33.947 [INFO] Excluding com.google.api:gax-grpc:jar:0.15.0 from the shaded
jar.
2017-06-12\T\00:11:33.947 [INFO] Excluding com.google.api.grpc:proto-google-cloud-spanner-v1:jar:0.1.9
from the shaded jar.
2017-06-12\T\00:11:33.947 [INFO] Excluding com.google.api.grpc:proto-google-cloud-spanner-admin-instance-v1:jar:0.1.9
from the shaded jar.
2017-06-12\T\00:11:33.947 [INFO] Excluding com.google.api.grpc:grpc-google-cloud-spanner-v1:jar:0.1.9
from the shaded jar.
2017-06-12\T\00:11:33.947 [INFO] Excluding com.google.api.grpc:grpc-google-cloud-spanner-admin-database-v1:jar:0.1.9
from the shaded jar.
2017-06-12\T\00:11:33.947 [INFO] Excluding com.google.api.grpc:grpc-google-cloud-spanner-admin-instance-v1:jar:0.1.9
from the shaded jar.
2017-06-12\T\00:11:33.947 [INFO] Excluding com.google.api.grpc:grpc-google-longrunning-v1:jar:0.1.9
from the shaded jar.
2017-06-12\T\00:11:33.947 [INFO] Excluding com.google.api.grpc:proto-google-longrunning-v1:jar:0.1.9
from the shaded jar.
2017-06-12\T\00:11:33.947 [INFO] Excluding com.google.cloud.bigtable:bigtable-protos:jar:0.9.6.2
from the shaded jar.
2017-06-12\T\00:11:33.947 [INFO] Excluding com.google.cloud.bigtable:bigtable-client-core:jar:0.9.6.2
from the shaded jar.
2017-06-12\T\00:11:33.947 [INFO] Excluding commons-logging:commons-logging:jar:1.2 from the
shaded jar.
2017-06-12\T\00:11:33.947 [INFO] Excluding com.google.auth:google-auth-library-appengine:jar:0.6.0
from the shaded jar.
2017-06-12\T\00:11:33.947 [INFO] Excluding com.google.appengine:appengine-api-1.0-sdk:jar:1.9.34
from the shaded jar.
2017-06-12\T\00:11:33.947 [INFO] Excluding io.dropwizard.metrics:metrics-core:jar:3.1.2 from
the shaded jar.
2017-06-12\T\00:11:33.947 [INFO] Excluding io.netty:netty-tcnative-boringssl-static:jar:1.1.33.Fork26
from the shaded jar.
2017-06-12\T\00:11:33.947 [INFO] Excluding com.google.api.grpc:proto-google-cloud-spanner-admin-database-v1:jar:0.1.9
from the shaded jar.
2017-06-12\T\00:11:33.947 [INFO] Excluding com.google.api.grpc:proto-google-common-protos:jar:0.1.9
from the shaded jar.
2017-06-12\T\00:11:33.947 [INFO] Including org.apache.beam:beam-runners-core-construction-java:jar:2.1.0-SNAPSHOT
in the shaded jar.
2017-06-12\T\00:11:33.947 [INFO] Excluding com.google.protobuf:protobuf-java-util:jar:3.2.0
from the shaded jar.
2017-06-12\T\00:11:33.947 [INFO] Excluding com.google.code.gson:gson:jar:2.7 from the shaded
jar.
2017-06-12\T\00:11:33.947 [INFO] Excluding com.google.api-client:google-api-client:jar:1.22.0
from the shaded jar.
2017-06-12\T\00:11:33.947 [INFO] Excluding com.google.oauth-client:google-oauth-client:jar:1.22.0
from the shaded jar.
2017-06-12\T\00:11:33.947 [INFO] Excluding com.google.http-client:google-http-client:jar:1.22.0
from the shaded jar.
2017-06-12\T\00:11:33.947 [INFO] Excluding org.apache.httpcomponents:httpclient:jar:4.0.1
from the shaded jar.
2017-06-12\T\00:11:33.947 [INFO] Excluding org.apache.httpcomponents:httpcore:jar:4.0.1 from
the shaded jar.
2017-06-12\T\00:11:33.947 [INFO] Excluding commons-codec:commons-codec:jar:1.3 from the shaded
jar.
2017-06-12\T\00:11:33.947 [INFO] Excluding com.google.http-client:google-http-client-jackson2:jar:1.22.0
from the shaded jar.
2017-06-12\T\00:11:33.947 [INFO] Excluding com.google.apis:google-api-services-dataflow:jar:v1b3-rev196-1.22.0
from the shaded jar.
2017-06-12\T\00:11:33.947 [INFO] Excluding com.google.apis:google-api-services-clouddebugger:jar:v2-rev8-1.22.0
from the shaded jar.
2017-06-12\T\00:11:33.947 [INFO] Excluding com.google.apis:google-api-services-storage:jar:v1-rev71-1.22.0
from the shaded jar.
2017-06-12\T\00:11:33.947 [INFO] Excluding com.google.auth:google-auth-library-credentials:jar:0.6.1
from the shaded jar.
2017-06-12\T\00:11:33.947 [INFO] Excluding com.google.auth:google-auth-library-oauth2-http:jar:0.6.1
from the shaded jar.
2017-06-12\T\00:11:33.947 [INFO] Excluding com.google.cloud.bigdataoss:util:jar:1.4.5 from
the shaded jar.
2017-06-12\T\00:11:33.947 [INFO] Excluding com.google.api-client:google-api-client-java6:jar:1.22.0
from the shaded jar.
2017-06-12\T\00:11:33.947 [INFO] Excluding com.google.api-client:google-api-client-jackson2:jar:1.22.0
from the shaded jar.
2017-06-12\T\00:11:33.947 [INFO] Excluding com.google.oauth-client:google-oauth-client-java6:jar:1.22.0
from the shaded jar.
2017-06-12\T\00:11:33.947 [INFO] Including com.google.guava:guava:jar:20.0 in the shaded jar.
2017-06-12\T\00:11:33.947 [INFO] Excluding org.apache.avro:avro:jar:1.8.2 from the shaded
jar.
2017-06-12\T\00:11:33.947 [INFO] Excluding org.codehaus.jackson:jackson-core-asl:jar:1.9.13
from the shaded jar.
2017-06-12\T\00:11:33.947 [INFO] Excluding org.codehaus.jackson:jackson-mapper-asl:jar:1.9.13
from the shaded jar.
2017-06-12\T\00:11:33.947 [INFO] Excluding com.thoughtworks.paranamer:paranamer:jar:2.7 from
the shaded jar.
2017-06-12\T\00:11:33.947 [INFO] Excluding org.tukaani:xz:jar:1.5 from the shaded jar.
2017-06-12\T\00:11:33.947 [INFO] Excluding com.google.errorprone:error_prone_annotations:jar:2.0.15
from the shaded jar.
2017-06-12\T\00:11:33.947 [INFO] Excluding joda-time:joda-time:jar:2.4 from the shaded jar.
2017-06-12\T\00:11:33.947 [INFO] Excluding com.google.code.findbugs:jsr305:jar:3.0.1 from
the shaded jar.
2017-06-12\T\00:11:33.947 [INFO] Excluding com.fasterxml.jackson.core:jackson-core:jar:2.8.8
from the shaded jar.
2017-06-12\T\00:11:33.947 [INFO] Excluding com.fasterxml.jackson.core:jackson-annotations:jar:2.8.8
from the shaded jar.
2017-06-12\T\00:11:33.947 [INFO] Excluding com.fasterxml.jackson.core:jackson-databind:jar:2.8.8
from the shaded jar.
2017-06-12\T\00:11:33.947 [INFO] Excluding org.slf4j:slf4j-api:jar:1.7.14 from the shaded
jar.
2017-06-12\T\00:11:33.947 [INFO] Excluding com.google.auto.service:auto-service:jar:1.0-rc2
from the shaded jar.
2017-06-12\T\00:11:33.947 [INFO] Excluding com.google.auto:auto-common:jar:0.3 from the shaded
jar.
2017-06-12\T\00:11:33.947 [INFO] Excluding com.google.api.grpc:grpc-google-common-protos:jar:0.1.9
from the shaded jar.
2017-06-12\T\00:11:33.947 [INFO] Excluding io.grpc:grpc-protobuf:jar:1.2.0 from the shaded
jar.
2017-06-12\T\00:11:38.373 [INFO] Replacing original artifact with shaded artifact.
2017-06-12\T\00:11:38.373 [INFO] Replacing <https://builds.apache.org/job/beam_PostCommit_Java_JDK_Versions_Test/jdk=JDK%201.7%20(latest),label=beam/ws/runners/google-cloud-dataflow-java/target/beam-runners-google-cloud-dataflow-java-2.1.0-SNAPSHOT.jar>
with <https://builds.apache.org/job/beam_PostCommit_Java_JDK_Versions_Test/jdk=JDK%201.7%20(latest),label=beam/ws/runners/google-cloud-dataflow-java/target/beam-runners-google-cloud-dataflow-java-2.1.0-SNAPSHOT-shaded.jar>
2017-06-12\T\00:11:38.374 [INFO] Replacing original test artifact with shaded test artifact.
2017-06-12\T\00:11:38.374 [INFO] Replacing <https://builds.apache.org/job/beam_PostCommit_Java_JDK_Versions_Test/jdk=JDK%201.7%20(latest),label=beam/ws/runners/google-cloud-dataflow-java/target/beam-runners-google-cloud-dataflow-java-2.1.0-SNAPSHOT-tests.jar>
with <https://builds.apache.org/job/beam_PostCommit_Java_JDK_Versions_Test/jdk=JDK%201.7%20(latest),label=beam/ws/runners/google-cloud-dataflow-java/target/beam-runners-google-cloud-dataflow-java-2.1.0-SNAPSHOT-shaded-tests.jar>
2017-06-12\T\00:11:38.374 [INFO] Dependency-reduced POM written at: <https://builds.apache.org/job/beam_PostCommit_Java_JDK_Versions_Test/jdk=JDK%201.7%20(latest),label=beam/ws/runners/google-cloud-dataflow-java/dependency-reduced-pom.xml>
2017-06-12\T\00:11:38.469 [INFO] 
2017-06-12\T\00:11:38.469 [INFO] --- maven-failsafe-plugin:2.20:integration-test (integration-test)
@ beam-runners-google-cloud-dataflow-java ---
2017-06-12\T\00:11:38.545 [INFO] Failsafe report directory: <https://builds.apache.org/job/beam_PostCommit_Java_JDK_Versions_Test/jdk=JDK%201.7%20(latest),label=beam/ws/runners/google-cloud-dataflow-java/target/failsafe-reports>
2017-06-12\T\00:11:38.549 [INFO] parallel='all', perCoreThreadCount=true, threadCount=4, useUnlimitedThreads=false,
threadCountSuites=0, threadCountClasses=0, threadCountMethods=0, parallelOptimized=true
2017-06-12\T\00:11:38.566 [INFO] 
2017-06-12\T\00:11:38.566 [INFO] -------------------------------------------------------
2017-06-12\T\00:11:38.566 [INFO]  T E S T S
2017-06-12\T\00:11:38.566 [INFO] -------------------------------------------------------
2017-06-12\T\00:16:23.211 [INFO] Running org.apache.beam.sdk.io.gcp.datastore.SplitQueryFnIT
2017-06-12\T\00:16:23.221 [INFO] Tests run: 2, Failures: 0, Errors: 0, Skipped: 0, Time elapsed:
7.859 s - in org.apache.beam.sdk.io.gcp.datastore.SplitQueryFnIT
2017-06-12\T\00:16:23.222 [INFO] Running org.apache.beam.sdk.io.gcp.bigtable.BigtableWriteIT
2017-06-12\T\00:16:23.231 [ERROR] Tests run: 1, Failures: 0, Errors: 1, Skipped: 0, Time elapsed:
13.217 s <<< FAILURE! - in org.apache.beam.sdk.io.gcp.bigtable.BigtableWriteIT
2017-06-12\T\00:16:23.231 [ERROR] testE2EBigtableWrite(org.apache.beam.sdk.io.gcp.bigtable.BigtableWriteIT)
 Time elapsed: 13.217 s  <<< ERROR!
java.lang.IllegalStateException: Not started
	at com.google.common.base.Preconditions.checkState(Preconditions.java:444)
	at io.grpc.internal.ClientCallImpl.request(ClientCallImpl.java:344)
	at io.grpc.ForwardingClientCall.request(ForwardingClientCall.java:52)
	at io.grpc.ForwardingClientCall.request(ForwardingClientCall.java:52)
	at io.grpc.ForwardingClientCall.request(ForwardingClientCall.java:52)
	at io.grpc.stub.ClientCalls.startCall(ClientCalls.java:276)
	at io.grpc.stub.ClientCalls.asyncUnaryRequestCall(ClientCalls.java:249)
	at io.grpc.stub.ClientCalls.futureUnaryCall(ClientCalls.java:186)
	at io.grpc.stub.ClientCalls.blockingUnaryCall(ClientCalls.java:132)
	at com.google.bigtable.admin.v2.BigtableTableAdminGrpc$BigtableTableAdminBlockingStub.getTable(BigtableTableAdminGrpc.java:381)
	at com.google.cloud.bigtable.grpc.BigtableTableAdminGrpcClient.getTable(BigtableTableAdminGrpcClient.java:58)
	at org.apache.beam.sdk.io.gcp.bigtable.BigtableServiceImpl.tableExists(BigtableServiceImpl.java:82)
	at org.apache.beam.sdk.io.gcp.bigtable.BigtableIO$Write.validate(BigtableIO.java:511)
	at org.apache.beam.sdk.Pipeline$ValidateVisitor.enterCompositeTransform(Pipeline.java:610)
	at org.apache.beam.sdk.runners.TransformHierarchy$Node.visit(TransformHierarchy.java:590)
	at org.apache.beam.sdk.runners.TransformHierarchy$Node.visit(TransformHierarchy.java:594)
	at org.apache.beam.sdk.runners.TransformHierarchy$Node.access$500(TransformHierarchy.java:276)
	at org.apache.beam.sdk.runners.TransformHierarchy.visit(TransformHierarchy.java:210)
	at org.apache.beam.sdk.Pipeline.traverseTopologically(Pipeline.java:440)
	at org.apache.beam.sdk.Pipeline.validate(Pipeline.java:552)
	at org.apache.beam.sdk.Pipeline.run(Pipeline.java:296)
	at org.apache.beam.sdk.Pipeline.run(Pipeline.java:283)
	at org.apache.beam.sdk.io.gcp.bigtable.BigtableWriteIT.testE2EBigtableWrite(BigtableWriteIT.java:128)
	at sun.reflect.NativeMethodAccessorImpl.invoke0(Native Method)
	at sun.reflect.NativeMethodAccessorImpl.invoke(NativeMethodAccessorImpl.java:57)
	at sun.reflect.DelegatingMethodAccessorImpl.invoke(DelegatingMethodAccessorImpl.java:43)
	at java.lang.reflect.Method.invoke(Method.java:606)
	at org.junit.runners.model.FrameworkMethod$1.runReflectiveCall(FrameworkMethod.java:50)
	at org.junit.internal.runners.model.ReflectiveCallable.run(ReflectiveCallable.java:12)
	at org.junit.runners.model.FrameworkMethod.invokeExplosively(FrameworkMethod.java:47)
	at org.junit.internal.runners.statements.InvokeMethod.evaluate(InvokeMethod.java:17)
	at org.junit.internal.runners.statements.RunBefores.evaluate(RunBefores.java:26)
	at org.junit.internal.runners.statements.RunAfters.evaluate(RunAfters.java:27)
	at org.junit.runners.ParentRunner.runLeaf(ParentRunner.java:325)
	at org.junit.runners.BlockJUnit4ClassRunner.runChild(BlockJUnit4ClassRunner.java:78)
	at org.junit.runners.BlockJUnit4ClassRunner.runChild(BlockJUnit4ClassRunner.java:57)
	at org.junit.runners.ParentRunner$3.run(ParentRunner.java:290)
	at org.apache.maven.surefire.junitcore.pc.Scheduler$1.run(Scheduler.java:393)
	at java.util.concurrent.Executors$RunnableAdapter.call(Executors.java:471)
	at java.util.concurrent.FutureTask.run(FutureTask.java:262)
	at java.util.concurrent.ThreadPoolExecutor.runWorker(ThreadPoolExecutor.java:1145)
	at java.util.concurrent.ThreadPoolExecutor$Worker.run(ThreadPoolExecutor.java:615)
	at java.lang.Thread.run(Thread.java:745)

2017-06-12\T\00:16:23.231 [INFO] Running org.apache.beam.sdk.io.gcp.datastore.V1ReadIT
2017-06-12\T\00:16:23.240 [INFO] Tests run: 3, Failures: 0, Errors: 0, Skipped: 0, Time elapsed:
262.556 s - in org.apache.beam.sdk.io.gcp.datastore.V1ReadIT
2017-06-12\T\00:16:23.240 [INFO] Running org.apache.beam.sdk.io.gcp.spanner.SpannerWriteIT
2017-06-12\T\00:16:23.241 [INFO] Tests run: 1, Failures: 0, Errors: 0, Skipped: 0, Time elapsed:
197.958 s - in org.apache.beam.sdk.io.gcp.spanner.SpannerWriteIT
2017-06-12\T\00:16:23.241 [INFO] Running org.apache.beam.sdk.io.gcp.datastore.V1WriteIT
2017-06-12\T\00:16:23.242 [INFO] Tests run: 2, Failures: 0, Errors: 0, Skipped: 0, Time elapsed:
275.404 s - in org.apache.beam.sdk.io.gcp.datastore.V1WriteIT
2017-06-12\T\00:16:23.242 [INFO] Running org.apache.beam.sdk.io.gcp.bigtable.BigtableReadIT
2017-06-12\T\00:16:23.244 [INFO] Tests run: 1, Failures: 0, Errors: 0, Skipped: 0, Time elapsed:
244.312 s - in org.apache.beam.sdk.io.gcp.bigtable.BigtableReadIT
2017-06-12\T\00:16:23.829 [INFO] 
2017-06-12\T\00:16:23.829 [INFO] Results:
2017-06-12\T\00:16:23.829 [INFO] 
2017-06-12\T\00:16:23.829 [ERROR] Errors: 
2017-06-12\T\00:16:23.829 [ERROR]   BigtableWriteIT.testE2EBigtableWrite:128 » IllegalState
Not started
2017-06-12\T\00:16:23.829 [INFO] 
2017-06-12\T\00:16:23.829 [ERROR] Tests run: 10, Failures: 0, Errors: 1, Skipped: 0
2017-06-12\T\00:16:23.829 [INFO] 
2017-06-12\T\00:16:23.881 [INFO] 
2017-06-12\T\00:16:23.881 [INFO] --- maven-dependency-plugin:3.0.1:analyze-only (default)
@ beam-runners-google-cloud-dataflow-java ---
2017-06-12\T\00:16:24.011 [INFO] No dependency problems found
2017-06-12\T\00:16:24.011 [INFO] 
2017-06-12\T\00:16:24.011 [INFO] --- maven-failsafe-plugin:2.20:verify (integration-test)
@ beam-runners-google-cloud-dataflow-java ---
2017-06-12\T\00:16:24.013 [INFO] Failsafe report directory: <https://builds.apache.org/job/beam_PostCommit_Java_JDK_Versions_Test/jdk=JDK%201.7%20(latest),label=beam/ws/runners/google-cloud-dataflow-java/target/failsafe-reports>
2017-06-12\T\00:16:24.023 [INFO] ------------------------------------------------------------------------
2017-06-12\T\00:16:24.023 [INFO] Reactor Summary:
2017-06-12\T\00:16:24.023 [INFO] 
2017-06-12\T\00:16:24.023 [INFO] Apache Beam :: Parent .............................. SUCCESS
[ 18.481 s]
2017-06-12\T\00:16:24.023 [INFO] Apache Beam :: SDKs :: Java :: Build Tools ......... SUCCESS
[  6.210 s]
2017-06-12\T\00:16:24.023 [INFO] Apache Beam :: SDKs ................................ SUCCESS
[  0.434 s]
2017-06-12\T\00:16:24.024 [INFO] Apache Beam :: SDKs :: Common ...................... SUCCESS
[  0.662 s]
2017-06-12\T\00:16:24.024 [INFO] Apache Beam :: SDKs :: Common :: Runner API ........ SUCCESS
[  6.913 s]
2017-06-12\T\00:16:24.024 [INFO] Apache Beam :: SDKs :: Common :: Fn API ............ SUCCESS
[  5.907 s]
2017-06-12\T\00:16:24.024 [INFO] Apache Beam :: SDKs :: Java ........................ SUCCESS
[  0.436 s]
2017-06-12\T\00:16:24.024 [INFO] Apache Beam :: SDKs :: Java :: Core ................ SUCCESS
[01:16 min]
2017-06-12\T\00:16:24.024 [INFO] Apache Beam :: Runners ............................. SUCCESS
[  0.427 s]
2017-06-12\T\00:16:24.024 [INFO] Apache Beam :: Runners :: Core Construction Java ... SUCCESS
[ 11.567 s]
2017-06-12\T\00:16:24.024 [INFO] Apache Beam :: Runners :: Core Java ................ SUCCESS
[ 26.790 s]
2017-06-12\T\00:16:24.024 [INFO] Apache Beam :: Runners :: Direct Java .............. SUCCESS
[02:57 min]
2017-06-12\T\00:16:24.024 [INFO] Apache Beam :: SDKs :: Java :: IO .................. SUCCESS
[  0.391 s]
2017-06-12\T\00:16:24.024 [INFO] Apache Beam :: SDKs :: Java :: IO :: Common ........ SUCCESS
[  2.545 s]
2017-06-12\T\00:16:24.024 [INFO] Apache Beam :: SDKs :: Java :: IO :: Cassandra ..... SUCCESS
[ 15.133 s]
2017-06-12\T\00:16:24.024 [INFO] Apache Beam :: SDKs :: Java :: IO :: Elasticsearch . SUCCESS
[ 22.979 s]
2017-06-12\T\00:16:24.024 [INFO] Apache Beam :: SDKs :: Java :: Extensions .......... SUCCESS
[  0.391 s]
2017-06-12\T\00:16:24.024 [INFO] Apache Beam :: SDKs :: Java :: Extensions :: Google Cloud
Platform Core SUCCESS [ 20.318 s]
2017-06-12\T\00:16:24.024 [INFO] Apache Beam :: SDKs :: Java :: Extensions :: Protobuf SUCCESS
[  7.860 s]
2017-06-12\T\00:16:24.024 [INFO] Apache Beam :: SDKs :: Java :: IO :: Google Cloud Platform
SUCCESS [ 52.324 s]
2017-06-12\T\00:16:24.024 [INFO] Apache Beam :: SDKs :: Java :: IO :: Hadoop Common . SUCCESS
[ 10.617 s]
2017-06-12\T\00:16:24.024 [INFO] Apache Beam :: SDKs :: Java :: IO :: Hadoop File System SUCCESS
[ 21.639 s]
2017-06-12\T\00:16:24.024 [INFO] Apache Beam :: SDKs :: Java :: IO :: Hadoop ........ SUCCESS
[  3.317 s]
2017-06-12\T\00:16:24.024 [INFO] Apache Beam :: SDKs :: Java :: IO :: Hadoop :: input-format
SUCCESS [ 10.569 s]
2017-06-12\T\00:16:24.024 [INFO] Apache Beam :: SDKs :: Java :: IO :: HBase ......... SUCCESS
[ 50.170 s]
2017-06-12\T\00:16:24.024 [INFO] Apache Beam :: SDKs :: Java :: IO :: HCatalog ...... SUCCESS
[ 48.743 s]
2017-06-12\T\00:16:24.024 [INFO] Apache Beam :: Runners :: Google Cloud Dataflow .... FAILURE
[05:10 min]
2017-06-12\T\00:16:24.024 [INFO] Apache Beam :: SDKs :: Java :: IO :: JDBC .......... SKIPPED
2017-06-12\T\00:16:24.024 [INFO] Apache Beam :: SDKs :: Java :: IO :: JMS ........... SKIPPED
2017-06-12\T\00:16:24.024 [INFO] Apache Beam :: SDKs :: Java :: IO :: Kafka ......... SKIPPED
2017-06-12\T\00:16:24.024 [INFO] Apache Beam :: SDKs :: Java :: IO :: Kinesis ....... SKIPPED
2017-06-12\T\00:16:24.024 [INFO] Apache Beam :: SDKs :: Java :: IO :: MongoDB ....... SKIPPED
2017-06-12\T\00:16:24.024 [INFO] Apache Beam :: SDKs :: Java :: IO :: MQTT .......... SKIPPED
2017-06-12\T\00:16:24.024 [INFO] Apache Beam :: SDKs :: Java :: IO :: XML ........... SKIPPED
2017-06-12\T\00:16:24.024 [INFO] Apache Beam :: SDKs :: Java :: Maven Archetypes .... SKIPPED
2017-06-12\T\00:16:24.024 [INFO] Apache Beam :: SDKs :: Java :: Maven Archetypes :: Starter
SKIPPED
2017-06-12\T\00:16:24.024 [INFO] Apache Beam :: Examples ............................ SKIPPED
2017-06-12\T\00:16:24.024 [INFO] Apache Beam :: Examples :: Java .................... SKIPPED
2017-06-12\T\00:16:24.024 [INFO] Apache Beam :: SDKs :: Java :: Maven Archetypes :: Examples
SKIPPED
2017-06-12\T\00:16:24.024 [INFO] Apache Beam :: SDKs :: Java :: Extensions :: Jackson SKIPPED
2017-06-12\T\00:16:24.024 [INFO] Apache Beam :: SDKs :: Java :: Extensions :: Join library
SKIPPED
2017-06-12\T\00:16:24.024 [INFO] Apache Beam :: SDKs :: Java :: Extensions :: Sorter  SKIPPED
2017-06-12\T\00:16:24.024 [INFO] Apache Beam :: Runners :: Flink .................... SKIPPED
2017-06-12\T\00:16:24.024 [INFO] Apache Beam :: Runners :: Spark .................... SKIPPED
2017-06-12\T\00:16:24.024 [INFO] Apache Beam :: SDKs :: Java :: Aggregated Javadoc .. SKIPPED
2017-06-12\T\00:16:24.024 [INFO] ------------------------------------------------------------------------
2017-06-12\T\00:16:24.024 [INFO] BUILD FAILURE
2017-06-12\T\00:16:24.024 [INFO] ------------------------------------------------------------------------
2017-06-12\T\00:16:24.024 [INFO] Total time: 15:12 min
2017-06-12\T\00:16:24.025 [INFO] Finished at: 2017-06-12T00:16:24+00:00
2017-06-12\T\00:16:24.921 [INFO] Final Memory: 207M/1464M
2017-06-12\T\00:16:24.921 [INFO] ------------------------------------------------------------------------
2017-06-12\T\00:16:24.922 [ERROR] Failed to execute goal org.apache.maven.plugins:maven-failsafe-plugin:2.20:verify
(integration-test) on project beam-runners-google-cloud-dataflow-java: There are test failures.
2017-06-12\T\00:16:24.922 [ERROR] 
2017-06-12\T\00:16:24.922 [ERROR] Please refer to <https://builds.apache.org/job/beam_PostCommit_Java_JDK_Versions_Test/jdk=JDK%201.7%20(latest),label=beam/ws/runners/google-cloud-dataflow-java/target/failsafe-reports>
for the individual test results.
2017-06-12\T\00:16:24.922 [ERROR] Please refer to dump files (if any exist) [date]-jvmRun[N].dump,
[date].dumpstream and [date]-jvmRun[N].dumpstream.
2017-06-12\T\00:16:24.922 [ERROR] -> [Help 1]
org.apache.maven.lifecycle.LifecycleExecutionException: Failed to execute goal org.apache.maven.plugins:maven-failsafe-plugin:2.20:verify
(integration-test) on project beam-runners-google-cloud-dataflow-java: There are test failures.

Please refer to <https://builds.apache.org/job/beam_PostCommit_Java_JDK_Versions_Test/jdk=JDK%201.7%20(latest),label=beam/ws/runners/google-cloud-dataflow-java/target/failsafe-reports>
for the individual test results.
Please refer to dump files (if any exist) [date]-jvmRun[N].dump, [date].dumpstream and [date]-jvmRun[N].dumpstream.
	at org.apache.maven.lifecycle.internal.MojoExecutor.execute(MojoExecutor.java:212)
	at org.apache.maven.lifecycle.internal.MojoExecutor.execute(MojoExecutor.java:153)
	at org.apache.maven.lifecycle.internal.MojoExecutor.execute(MojoExecutor.java:145)
	at org.apache.maven.lifecycle.internal.LifecycleModuleBuilder.buildProject(LifecycleModuleBuilder.java:116)
	at org.apache.maven.lifecycle.internal.LifecycleModuleBuilder.buildProject(LifecycleModuleBuilder.java:80)
	at org.apache.maven.lifecycle.internal.builder.singlethreaded.SingleThreadedBuilder.build(SingleThreadedBuilder.java:51)
	at org.apache.maven.lifecycle.internal.LifecycleStarter.execute(LifecycleStarter.java:128)
	at org.apache.maven.DefaultMaven.doExecute(DefaultMaven.java:307)
	at org.apache.maven.DefaultMaven.doExecute(DefaultMaven.java:193)
	at org.apache.maven.DefaultMaven.execute(DefaultMaven.java:106)
	at org.apache.maven.cli.MavenCli.execute(MavenCli.java:862)
	at org.apache.maven.cli.MavenCli.doMain(MavenCli.java:286)
	at org.apache.maven.cli.MavenCli.main(MavenCli.java:197)
	at sun.reflect.NativeMethodAccessorImpl.invoke0(Native Method)
	at sun.reflect.NativeMethodAccessorImpl.invoke(NativeMethodAccessorImpl.java:57)
	at sun.reflect.DelegatingMethodAccessorImpl.invoke(DelegatingMethodAccessorImpl.java:43)
	at java.lang.reflect.Method.invoke(Method.java:606)
	at org.codehaus.plexus.classworlds.launcher.Launcher.launchEnhanced(Launcher.java:289)
	at org.codehaus.plexus.classworlds.launcher.Launcher.launch(Launcher.java:229)
	at org.codehaus.plexus.classworlds.launcher.Launcher.mainWithExitCode(Launcher.java:415)
	at org.codehaus.plexus.classworlds.launcher.Launcher.main(Launcher.java:356)
Caused by: org.apache.maven.plugin.MojoFailureException: There are test failures.

Please refer to <https://builds.apache.org/job/beam_PostCommit_Java_JDK_Versions_Test/jdk=JDK%201.7%20(latest),label=beam/ws/runners/google-cloud-dataflow-java/target/failsafe-reports>
for the individual test results.
Please refer to dump files (if any exist) [date]-jvmRun[N].dump, [date].dumpstream and [date]-jvmRun[N].dumpstream.
	at org.apache.maven.plugin.surefire.SurefireHelper.throwException(SurefireHelper.java:204)
	at org.apache.maven.plugin.surefire.SurefireHelper.reportExecution(SurefireHelper.java:98)
	at org.apache.maven.plugin.failsafe.VerifyMojo.execute(VerifyMojo.java:191)
	at org.apache.maven.plugin.DefaultBuildPluginManager.executeMojo(DefaultBuildPluginManager.java:134)
	at org.apache.maven.lifecycle.internal.MojoExecutor.execute(MojoExecutor.java:208)
	... 20 more
2017-06-12\T\00:16:24.923 [ERROR] 
2017-06-12\T\00:16:24.923 [ERROR] Re-run Maven using the -X switch to enable full debug logging.
2017-06-12\T\00:16:24.923 [ERROR] 
2017-06-12\T\00:16:24.923 [ERROR] For more information about the errors and possible solutions,
please read the following articles:
2017-06-12\T\00:16:24.923 [ERROR] [Help 1] http://cwiki.apache.org/confluence/display/MAVEN/MojoFailureException
2017-06-12\T\00:16:24.923 [ERROR] 
2017-06-12\T\00:16:24.923 [ERROR] After correcting the problems, you can resume the build
with the command
2017-06-12\T\00:16:24.923 [ERROR]   mvn <goals> -rf :beam-runners-google-cloud-dataflow-java
Build step 'Invoke top-level Maven targets' marked build as failure
Not sending mail to unregistered user ccy@google.com
Not sending mail to unregistered user kirpichov@google.com
Not sending mail to unregistered user aljoscha.krettek@gmail.com
Not sending mail to unregistered user klk@google.com
Not sending mail to unregistered user hepei.hp@alibaba-inc.com

Mime
View raw message