beam-commits mailing list archives

Site index · List index
Message view « Date » · « Thread »
Top « Date » · « Thread »
From Apache Jenkins Server <jenk...@builds.apache.org>
Subject Build failed in Jenkins: beam_PostCommit_Java_JDK_Versions_Test » JDK 1.7 (latest),beam #54
Date Wed, 07 Jun 2017 06:28:16 GMT
See <https://builds.apache.org/job/beam_PostCommit_Java_JDK_Versions_Test/jdk=JDK%201.7%20(latest),label=beam/54/display/redirect?page=changes>

Changes:

[bchambers] Increase visibility of some Metrics methods

[chamikara] [BEAM-2405] Override to sink interface in the batch dataflow BQ

------------------------------------------
[...truncated 1.23 MB...]
2017-06-07\T\06:27:39.573 [INFO] Downloading: https://repo.maven.apache.org/maven2/org/scala-lang/scala-library/2.10.3/scala-library-2.10.3.pom
2017-06-07\T\06:27:39.597 [INFO] Downloaded: https://repo.maven.apache.org/maven2/org/scala-lang/scala-library/2.10.3/scala-library-2.10.3.pom
(2 KB at 83.2 KB/sec)
2017-06-07\T\06:27:39.599 [INFO] Downloading: https://repo.maven.apache.org/maven2/com/github/scopt/scopt_2.10/3.5.0/scopt_2.10-3.5.0.pom
2017-06-07\T\06:27:39.624 [INFO] Downloaded: https://repo.maven.apache.org/maven2/com/github/scopt/scopt_2.10/3.5.0/scopt_2.10-3.5.0.pom
(2 KB at 65.4 KB/sec)
2017-06-07\T\06:27:39.626 [INFO] Downloading: https://repo.maven.apache.org/maven2/com/twitter/chill_2.10/0.7.4/chill_2.10-0.7.4.pom
2017-06-07\T\06:27:39.661 [INFO] Downloaded: https://repo.maven.apache.org/maven2/com/twitter/chill_2.10/0.7.4/chill_2.10-0.7.4.pom
(3 KB at 66.2 KB/sec)
2017-06-07\T\06:27:39.662 [INFO] Downloading: https://repo.maven.apache.org/maven2/org/scala-lang/scala-library/2.10.5/scala-library-2.10.5.pom
2017-06-07\T\06:27:39.687 [INFO] Downloaded: https://repo.maven.apache.org/maven2/org/scala-lang/scala-library/2.10.5/scala-library-2.10.5.pom
(2 KB at 79.8 KB/sec)
2017-06-07\T\06:27:39.689 [INFO] Downloading: https://repo.maven.apache.org/maven2/com/twitter/chill-java/0.7.4/chill-java-0.7.4.pom
2017-06-07\T\06:27:39.714 [INFO] Downloaded: https://repo.maven.apache.org/maven2/com/twitter/chill-java/0.7.4/chill-java-0.7.4.pom
(2 KB at 79.5 KB/sec)
2017-06-07\T\06:27:39.716 [INFO] Downloading: https://repo.maven.apache.org/maven2/org/apache/flink/flink-optimizer_2.10/1.3.0/flink-optimizer_2.10-1.3.0.pom
2017-06-07\T\06:27:39.741 [INFO] Downloaded: https://repo.maven.apache.org/maven2/org/apache/flink/flink-optimizer_2.10/1.3.0/flink-optimizer_2.10-1.3.0.pom
(5 KB at 168.7 KB/sec)
2017-06-07\T\06:27:39.745 [INFO] Downloading: https://repo.maven.apache.org/maven2/org/apache/flink/flink-streaming-java_2.10/1.3.0/flink-streaming-java_2.10-1.3.0.pom
2017-06-07\T\06:27:39.771 [INFO] Downloaded: https://repo.maven.apache.org/maven2/org/apache/flink/flink-streaming-java_2.10/1.3.0/flink-streaming-java_2.10-1.3.0.pom
(7 KB at 231.9 KB/sec)
2017-06-07\T\06:27:39.775 [INFO] Downloading: https://repo.maven.apache.org/maven2/org/apache/sling/org.apache.sling.commons.json/2.0.6/org.apache.sling.commons.json-2.0.6.pom
2017-06-07\T\06:27:39.800 [INFO] Downloaded: https://repo.maven.apache.org/maven2/org/apache/sling/org.apache.sling.commons.json/2.0.6/org.apache.sling.commons.json-2.0.6.pom
(4 KB at 126.6 KB/sec)
2017-06-07\T\06:27:39.801 [INFO] Downloading: https://repo.maven.apache.org/maven2/org/apache/sling/sling/10/sling-10.pom
2017-06-07\T\06:27:39.828 [INFO] Downloaded: https://repo.maven.apache.org/maven2/org/apache/sling/sling/10/sling-10.pom
(26 KB at 928.3 KB/sec)
2017-06-07\T\06:27:39.830 [INFO] Downloading: https://repo.maven.apache.org/maven2/org/apache/apache/8/apache-8.pom
2017-06-07\T\06:27:39.862 [INFO] Downloaded: https://repo.maven.apache.org/maven2/org/apache/apache/8/apache-8.pom
(14 KB at 428.9 KB/sec)
2017-06-07\T\06:27:39.874 [INFO] Downloading: https://repo.maven.apache.org/maven2/org/apache/flink/flink-test-utils_2.10/1.3.0/flink-test-utils_2.10-1.3.0.pom
2017-06-07\T\06:27:39.899 [INFO] Downloaded: https://repo.maven.apache.org/maven2/org/apache/flink/flink-test-utils_2.10/1.3.0/flink-test-utils_2.10-1.3.0.pom
(5 KB at 185.2 KB/sec)
2017-06-07\T\06:27:39.900 [INFO] Downloading: https://repo.maven.apache.org/maven2/org/apache/flink/flink-test-utils-parent/1.3.0/flink-test-utils-parent-1.3.0.pom
2017-06-07\T\06:27:39.926 [INFO] Downloaded: https://repo.maven.apache.org/maven2/org/apache/flink/flink-test-utils-parent/1.3.0/flink-test-utils-parent-1.3.0.pom
(2 KB at 54.1 KB/sec)
2017-06-07\T\06:27:39.929 [INFO] Downloading: https://repo.maven.apache.org/maven2/org/apache/flink/flink-test-utils-junit/1.3.0/flink-test-utils-junit-1.3.0.pom
2017-06-07\T\06:27:39.954 [INFO] Downloaded: https://repo.maven.apache.org/maven2/org/apache/flink/flink-test-utils-junit/1.3.0/flink-test-utils-junit-1.3.0.pom
(4 KB at 128.4 KB/sec)
2017-06-07\T\06:27:39.959 [INFO] Downloading: https://repo.maven.apache.org/maven2/org/apache/curator/curator-test/2.12.0/curator-test-2.12.0.pom
2017-06-07\T\06:27:39.984 [INFO] Downloaded: https://repo.maven.apache.org/maven2/org/apache/curator/curator-test/2.12.0/curator-test-2.12.0.pom
(5 KB at 162.0 KB/sec)
2017-06-07\T\06:27:39.986 [INFO] Downloading: https://repo.maven.apache.org/maven2/org/apache/curator/apache-curator/2.12.0/apache-curator-2.12.0.pom
2017-06-07\T\06:27:40.013 [INFO] Downloaded: https://repo.maven.apache.org/maven2/org/apache/curator/apache-curator/2.12.0/apache-curator-2.12.0.pom
(32 KB at 1169.3 KB/sec)
2017-06-07\T\06:27:40.016 [INFO] Downloading: https://repo.maven.apache.org/maven2/org/apache/zookeeper/zookeeper/3.4.8/zookeeper-3.4.8.pom
2017-06-07\T\06:27:40.041 [INFO] Downloaded: https://repo.maven.apache.org/maven2/org/apache/zookeeper/zookeeper/3.4.8/zookeeper-3.4.8.pom
(4 KB at 157.2 KB/sec)
2017-06-07\T\06:27:40.043 [INFO] Downloading: https://repo.maven.apache.org/maven2/org/javassist/javassist/3.18.1-GA/javassist-3.18.1-GA.pom
2017-06-07\T\06:27:40.068 [INFO] Downloaded: https://repo.maven.apache.org/maven2/org/javassist/javassist/3.18.1-GA/javassist-3.18.1-GA.pom
(10 KB at 372.0 KB/sec)
2017-06-07\T\06:27:40.083 [INFO] Downloading: https://repo.maven.apache.org/maven2/org/apache/flink/flink-clients_2.10/1.3.0/flink-clients_2.10-1.3.0.jar
2017-06-07\T\06:27:40.083 [INFO] Downloading: https://repo.maven.apache.org/maven2/org/apache/flink/flink-optimizer_2.10/1.3.0/flink-optimizer_2.10-1.3.0.jar
2017-06-07\T\06:27:40.084 [INFO] Downloading: https://repo.maven.apache.org/maven2/org/apache/flink/flink-core/1.3.0/flink-core-1.3.0.jar
2017-06-07\T\06:27:40.086 [INFO] Downloading: https://repo.maven.apache.org/maven2/org/apache/flink/force-shading/1.3.0/force-shading-1.3.0.jar
2017-06-07\T\06:27:40.086 [INFO] Downloading: https://repo.maven.apache.org/maven2/org/apache/flink/flink-annotations/1.3.0/flink-annotations-1.3.0.jar
2017-06-07\T\06:27:40.111 [INFO] Downloaded: https://repo.maven.apache.org/maven2/org/apache/flink/force-shading/1.3.0/force-shading-1.3.0.jar
(8 KB at 253.9 KB/sec)
2017-06-07\T\06:27:40.111 [INFO] Downloading: https://repo.maven.apache.org/maven2/com/esotericsoftware/kryo/kryo/2.24.0/kryo-2.24.0.jar
2017-06-07\T\06:27:40.112 [INFO] Downloaded: https://repo.maven.apache.org/maven2/org/apache/flink/flink-annotations/1.3.0/flink-annotations-1.3.0.jar
(8 KB at 248.7 KB/sec)
2017-06-07\T\06:27:40.112 [INFO] Downloading: https://repo.maven.apache.org/maven2/org/objenesis/objenesis/2.1/objenesis-2.1.jar
2017-06-07\T\06:27:40.118 [INFO] Downloaded: https://repo.maven.apache.org/maven2/org/apache/flink/flink-clients_2.10/1.3.0/flink-clients_2.10-1.3.0.jar
(89 KB at 2464.1 KB/sec)
2017-06-07\T\06:27:40.118 [INFO] Downloading: https://repo.maven.apache.org/maven2/org/apache/flink/flink-metrics-core/1.3.0/flink-metrics-core-1.3.0.jar
2017-06-07\T\06:27:40.140 [INFO] Downloaded: https://repo.maven.apache.org/maven2/org/objenesis/objenesis/2.1/objenesis-2.1.jar
(41 KB at 755.1 KB/sec)
2017-06-07\T\06:27:40.140 [INFO] Downloading: https://repo.maven.apache.org/maven2/org/apache/flink/flink-java/1.3.0/flink-java-1.3.0.jar
2017-06-07\T\06:27:40.145 [INFO] Downloaded: https://repo.maven.apache.org/maven2/org/apache/flink/flink-metrics-core/1.3.0/flink-metrics-core-1.3.0.jar
(16 KB at 264.7 KB/sec)
2017-06-07\T\06:27:40.145 [INFO] Downloading: https://repo.maven.apache.org/maven2/org/apache/flink/flink-shaded-hadoop2/1.3.0/flink-shaded-hadoop2-1.3.0.jar
2017-06-07\T\06:27:40.167 [INFO] Downloaded: https://repo.maven.apache.org/maven2/com/esotericsoftware/kryo/kryo/2.24.0/kryo-2.24.0.jar
(332 KB at 3991.9 KB/sec)
2017-06-07\T\06:27:40.167 [INFO] Downloading: https://repo.maven.apache.org/maven2/commons-configuration/commons-configuration/1.7/commons-configuration-1.7.jar
2017-06-07\T\06:27:40.179 [INFO] Downloaded: https://repo.maven.apache.org/maven2/org/apache/flink/flink-core/1.3.0/flink-core-1.3.0.jar
(1362 KB at 14182.3 KB/sec)
2017-06-07\T\06:27:40.179 [INFO] Downloading: https://repo.maven.apache.org/maven2/commons-digester/commons-digester/1.8.1/commons-digester-1.8.1.jar
2017-06-07\T\06:27:40.214 [INFO] Downloaded: https://repo.maven.apache.org/maven2/org/apache/flink/flink-java/1.3.0/flink-java-1.3.0.jar
(752 KB at 5874.1 KB/sec)
2017-06-07\T\06:27:40.214 [INFO] Downloading: https://repo.maven.apache.org/maven2/commons-beanutils/commons-beanutils-bean-collections/1.8.3/commons-beanutils-bean-collections-1.8.3.jar
2017-06-07\T\06:27:40.215 [INFO] Downloaded: https://repo.maven.apache.org/maven2/commons-digester/commons-digester/1.8.1/commons-digester-1.8.1.jar
(143 KB at 1106.1 KB/sec)
2017-06-07\T\06:27:40.215 [INFO] Downloading: https://repo.maven.apache.org/maven2/org/apache/commons/commons-math3/3.5/commons-math3-3.5.jar
2017-06-07\T\06:27:40.221 [INFO] Downloaded: https://repo.maven.apache.org/maven2/commons-configuration/commons-configuration/1.7/commons-configuration-1.7.jar
(343 KB at 2534.2 KB/sec)
2017-06-07\T\06:27:40.221 [INFO] Downloading: https://repo.maven.apache.org/maven2/org/apache/flink/flink-runtime_2.10/1.3.0/flink-runtime_2.10-1.3.0.jar
2017-06-07\T\06:27:40.244 [INFO] Downloaded: https://repo.maven.apache.org/maven2/commons-beanutils/commons-beanutils-bean-collections/1.8.3/commons-beanutils-bean-collections-1.8.3.jar
(26 KB at 164.2 KB/sec)
2017-06-07\T\06:27:40.245 [INFO] Downloading: https://repo.maven.apache.org/maven2/io/netty/netty-all/4.0.27.Final/netty-all-4.0.27.Final.jar
2017-06-07\T\06:27:40.279 [INFO] Downloaded: https://repo.maven.apache.org/maven2/org/apache/flink/flink-optimizer_2.10/1.3.0/flink-optimizer_2.10-1.3.0.jar
(2679 KB at 13598.7 KB/sec)
2017-06-07\T\06:27:40.280 [INFO] Downloading: https://repo.maven.apache.org/maven2/org/javassist/javassist/3.18.2-GA/javassist-3.18.2-GA.jar
2017-06-07\T\06:27:40.399 [INFO] Downloaded: https://repo.maven.apache.org/maven2/org/javassist/javassist/3.18.2-GA/javassist-3.18.2-GA.jar
(698 KB at 2229.3 KB/sec)
2017-06-07\T\06:27:40.399 [INFO] Downloading: https://repo.maven.apache.org/maven2/org/scala-lang/scala-library/2.10.4/scala-library-2.10.4.jar
2017-06-07\T\06:27:40.410 [INFO] Downloaded: https://repo.maven.apache.org/maven2/io/netty/netty-all/4.0.27.Final/netty-all-4.0.27.Final.jar
(1894 KB at 5845.6 KB/sec)
2017-06-07\T\06:27:40.410 [INFO] Downloading: https://repo.maven.apache.org/maven2/com/data-artisans/flakka-actor_2.10/2.3-custom/flakka-actor_2.10-2.3-custom.jar
2017-06-07\T\06:27:40.463 [INFO] Downloaded: https://repo.maven.apache.org/maven2/org/apache/commons/commons-math3/3.5/commons-math3-3.5.jar
(1991 KB at 5280.4 KB/sec)
2017-06-07\T\06:27:40.463 [INFO] Downloading: https://repo.maven.apache.org/maven2/com/typesafe/config/1.2.1/config-1.2.1.jar
2017-06-07\T\06:27:40.517 [INFO] Downloaded: https://repo.maven.apache.org/maven2/com/typesafe/config/1.2.1/config-1.2.1.jar
(215 KB at 497.5 KB/sec)
2017-06-07\T\06:27:40.517 [INFO] Downloading: https://repo.maven.apache.org/maven2/com/data-artisans/flakka-remote_2.10/2.3-custom/flakka-remote_2.10-2.3-custom.jar
2017-06-07\T\06:27:40.647 [INFO] Downloaded: https://repo.maven.apache.org/maven2/com/data-artisans/flakka-actor_2.10/2.3-custom/flakka-actor_2.10-2.3-custom.jar
(2754 KB at 4908.1 KB/sec)
2017-06-07\T\06:27:40.647 [INFO] Downloading: https://repo.maven.apache.org/maven2/io/netty/netty/3.8.0.Final/netty-3.8.0.Final.jar
2017-06-07\T\06:27:40.715 [INFO] Downloaded: https://repo.maven.apache.org/maven2/com/data-artisans/flakka-remote_2.10/2.3-custom/flakka-remote_2.10-2.3-custom.jar
(1347 KB at 2141.4 KB/sec)
2017-06-07\T\06:27:40.715 [INFO] Downloading: https://repo.maven.apache.org/maven2/org/uncommons/maths/uncommons-maths/1.2.2a/uncommons-maths-1.2.2a.jar
2017-06-07\T\06:27:40.744 [INFO] Downloaded: https://repo.maven.apache.org/maven2/org/uncommons/maths/uncommons-maths/1.2.2a/uncommons-maths-1.2.2a.jar
(48 KB at 72.8 KB/sec)
2017-06-07\T\06:27:40.744 [INFO] Downloading: https://repo.maven.apache.org/maven2/com/data-artisans/flakka-slf4j_2.10/2.3-custom/flakka-slf4j_2.10-2.3-custom.jar
2017-06-07\T\06:27:40.770 [INFO] Downloaded: https://repo.maven.apache.org/maven2/com/data-artisans/flakka-slf4j_2.10/2.3-custom/flakka-slf4j_2.10-2.3-custom.jar
(16 KB at 22.2 KB/sec)
2017-06-07\T\06:27:40.770 [INFO] Downloading: https://repo.maven.apache.org/maven2/org/clapper/grizzled-slf4j_2.10/1.0.2/grizzled-slf4j_2.10-1.0.2.jar
2017-06-07\T\06:27:40.777 [INFO] Downloaded: https://repo.maven.apache.org/maven2/io/netty/netty/3.8.0.Final/netty-3.8.0.Final.jar
(1202 KB at 1741.1 KB/sec)
2017-06-07\T\06:27:40.777 [INFO] Downloading: https://repo.maven.apache.org/maven2/com/github/scopt/scopt_2.10/3.5.0/scopt_2.10-3.5.0.jar
2017-06-07\T\06:27:40.796 [INFO] Downloaded: https://repo.maven.apache.org/maven2/org/clapper/grizzled-slf4j_2.10/1.0.2/grizzled-slf4j_2.10-1.0.2.jar
(7 KB at 8.8 KB/sec)
2017-06-07\T\06:27:40.796 [INFO] Downloading: https://repo.maven.apache.org/maven2/jline/jline/0.9.94/jline-0.9.94.jar
2017-06-07\T\06:27:40.815 [INFO] Downloaded: https://repo.maven.apache.org/maven2/com/github/scopt/scopt_2.10/3.5.0/scopt_2.10-3.5.0.jar
(140 KB at 191.7 KB/sec)
2017-06-07\T\06:27:40.816 [INFO] Downloading: https://repo.maven.apache.org/maven2/com/twitter/chill_2.10/0.7.4/chill_2.10-0.7.4.jar
2017-06-07\T\06:27:40.827 [INFO] Downloaded: https://repo.maven.apache.org/maven2/jline/jline/0.9.94/jline-0.9.94.jar
(86 KB at 115.1 KB/sec)
2017-06-07\T\06:27:40.827 [INFO] Downloading: https://repo.maven.apache.org/maven2/com/twitter/chill-java/0.7.4/chill-java-0.7.4.jar
2017-06-07\T\06:27:40.862 [INFO] Downloaded: https://repo.maven.apache.org/maven2/com/twitter/chill_2.10/0.7.4/chill_2.10-0.7.4.jar
(217 KB at 278.4 KB/sec)
2017-06-07\T\06:27:40.862 [INFO] Downloaded: https://repo.maven.apache.org/maven2/com/twitter/chill-java/0.7.4/chill-java-0.7.4.jar
(50 KB at 63.4 KB/sec)
2017-06-07\T\06:27:40.862 [INFO] Downloading: https://repo.maven.apache.org/maven2/org/apache/flink/flink-streaming-java_2.10/1.3.0/flink-streaming-java_2.10-1.3.0.jar
2017-06-07\T\06:27:40.862 [INFO] Downloading: https://repo.maven.apache.org/maven2/org/apache/sling/org.apache.sling.commons.json/2.0.6/org.apache.sling.commons.json-2.0.6.jar
2017-06-07\T\06:27:40.890 [INFO] Downloaded: https://repo.maven.apache.org/maven2/org/apache/sling/org.apache.sling.commons.json/2.0.6/org.apache.sling.commons.json-2.0.6.jar
(47 KB at 58.2 KB/sec)
2017-06-07\T\06:27:40.890 [INFO] Downloading: https://repo.maven.apache.org/maven2/org/apache/flink/flink-core/1.3.0/flink-core-1.3.0-tests.jar
2017-06-07\T\06:27:40.943 [INFO] Downloaded: https://repo.maven.apache.org/maven2/org/scala-lang/scala-library/2.10.4/scala-library-2.10.4.jar
(6960 KB at 8120.6 KB/sec)
2017-06-07\T\06:27:40.943 [INFO] Downloading: https://repo.maven.apache.org/maven2/org/apache/flink/flink-runtime_2.10/1.3.0/flink-runtime_2.10-1.3.0-tests.jar
2017-06-07\T\06:27:40.966 [INFO] Downloaded: https://repo.maven.apache.org/maven2/org/apache/flink/flink-runtime_2.10/1.3.0/flink-runtime_2.10-1.3.0.jar
(9005 KB at 10231.9 KB/sec)
2017-06-07\T\06:27:40.966 [INFO] Downloading: https://repo.maven.apache.org/maven2/org/apache/flink/flink-streaming-java_2.10/1.3.0/flink-streaming-java_2.10-1.3.0-tests.jar
2017-06-07\T\06:27:40.978 [INFO] Downloaded: https://repo.maven.apache.org/maven2/org/apache/flink/flink-core/1.3.0/flink-core-1.3.0-tests.jar
(753 KB at 843.2 KB/sec)
2017-06-07\T\06:27:40.978 [INFO] Downloading: https://repo.maven.apache.org/maven2/org/apache/flink/flink-test-utils_2.10/1.3.0/flink-test-utils_2.10-1.3.0.jar
2017-06-07\T\06:27:41.080 [INFO] Downloaded: https://repo.maven.apache.org/maven2/org/apache/flink/flink-streaming-java_2.10/1.3.0/flink-streaming-java_2.10-1.3.0-tests.jar
(1133 KB at 1139.6 KB/sec)
2017-06-07\T\06:27:41.080 [INFO] Downloading: https://repo.maven.apache.org/maven2/org/apache/flink/flink-test-utils-junit/1.3.0/flink-test-utils-junit-1.3.0.jar
2017-06-07\T\06:27:41.108 [INFO] Downloaded: https://repo.maven.apache.org/maven2/org/apache/flink/flink-test-utils-junit/1.3.0/flink-test-utils-junit-1.3.0.jar
(26 KB at 24.8 KB/sec)
2017-06-07\T\06:27:41.108 [INFO] Downloading: https://repo.maven.apache.org/maven2/org/apache/curator/curator-test/2.12.0/curator-test-2.12.0.jar
2017-06-07\T\06:27:41.117 [INFO] Downloaded: https://repo.maven.apache.org/maven2/org/apache/flink/flink-streaming-java_2.10/1.3.0/flink-streaming-java_2.10-1.3.0.jar
(3128 KB at 3033.3 KB/sec)
2017-06-07\T\06:27:41.188 [INFO] Downloaded: https://repo.maven.apache.org/maven2/org/apache/flink/flink-runtime_2.10/1.3.0/flink-runtime_2.10-1.3.0-tests.jar
(2841 KB at 2577.6 KB/sec)
2017-06-07\T\06:27:41.209 [INFO] Downloaded: https://repo.maven.apache.org/maven2/org/apache/flink/flink-test-utils_2.10/1.3.0/flink-test-utils_2.10-1.3.0.jar
(2365 KB at 2105.4 KB/sec)
2017-06-07\T\06:27:41.252 [INFO] Downloaded: https://repo.maven.apache.org/maven2/org/apache/curator/curator-test/2.12.0/curator-test-2.12.0.jar
(2368 KB at 2030.5 KB/sec)
2017-06-07\T\06:27:41.279 [INFO] Downloaded: https://repo.maven.apache.org/maven2/org/apache/flink/flink-shaded-hadoop2/1.3.0/flink-shaded-hadoop2-1.3.0.jar
(16586 KB at 13902.2 KB/sec)
2017-06-07\T\06:27:41.290 [INFO] 
2017-06-07\T\06:27:41.290 [INFO] --- maven-clean-plugin:3.0.0:clean (default-clean) @ beam-runners-flink_2.10
---
2017-06-07\T\06:27:41.291 [INFO] Deleting <https://builds.apache.org/job/beam_PostCommit_Java_JDK_Versions_Test/jdk=JDK%201.7%20(latest),label=beam/ws/runners/flink>
(includes = [**/*.pyc, **/*.egg-info/, **/sdks/python/LICENSE, **/sdks/python/NOTICE, **/sdks/python/README.md],
excludes = [])
2017-06-07\T\06:27:41.294 [INFO] 
2017-06-07\T\06:27:41.294 [INFO] --- maven-enforcer-plugin:1.4.1:enforce (enforce) @ beam-runners-flink_2.10
---
2017-06-07\T\06:27:43.051 [INFO] 
2017-06-07\T\06:27:43.051 [INFO] --- maven-enforcer-plugin:1.4.1:enforce (enforce-banned-dependencies)
@ beam-runners-flink_2.10 ---
2017-06-07\T\06:27:43.068 [INFO] 
2017-06-07\T\06:27:43.068 [INFO] --- maven-remote-resources-plugin:1.5:process (process-resource-bundles)
@ beam-runners-flink_2.10 ---
2017-06-07\T\06:27:43.564 [INFO] 
2017-06-07\T\06:27:43.564 [INFO] --- maven-resources-plugin:3.0.2:resources (default-resources)
@ beam-runners-flink_2.10 ---
2017-06-07\T\06:27:43.565 [INFO] Using 'UTF-8' encoding to copy filtered resources.
2017-06-07\T\06:27:43.565 [INFO] Copying 1 resource
2017-06-07\T\06:27:43.566 [INFO] Copying 3 resources
2017-06-07\T\06:27:43.566 [INFO] 
2017-06-07\T\06:27:43.566 [INFO] --- maven-compiler-plugin:3.6.1:compile (default-compile)
@ beam-runners-flink_2.10 ---
2017-06-07\T\06:27:43.578 [INFO] Changes detected - recompiling the module!
2017-06-07\T\06:27:43.578 [INFO] Compiling 65 source files to <https://builds.apache.org/job/beam_PostCommit_Java_JDK_Versions_Test/jdk=JDK%201.7%20(latest),label=beam/ws/runners/flink/target/classes>
2017-06-07\T\06:27:45.571 [INFO] <https://builds.apache.org/job/beam_PostCommit_Java_JDK_Versions_Test/jdk=JDK%201.7%20(latest),label=beam/ws/runners/flink/src/main/java/org/apache/beam/runners/flink/FlinkStreamingTransformTranslators.java>:
Some input files use or override a deprecated API.
2017-06-07\T\06:27:45.571 [INFO] <https://builds.apache.org/job/beam_PostCommit_Java_JDK_Versions_Test/jdk=JDK%201.7%20(latest),label=beam/ws/runners/flink/src/main/java/org/apache/beam/runners/flink/FlinkStreamingTransformTranslators.java>:
Recompile with -Xlint:deprecation for details.
2017-06-07\T\06:27:45.571 [INFO] <https://builds.apache.org/job/beam_PostCommit_Java_JDK_Versions_Test/jdk=JDK%201.7%20(latest),label=beam/ws/runners/flink/src/main/java/org/apache/beam/runners/flink/translation/wrappers/streaming/DoFnOperator.java>:
Some input files use unchecked or unsafe operations.
2017-06-07\T\06:27:45.571 [INFO] <https://builds.apache.org/job/beam_PostCommit_Java_JDK_Versions_Test/jdk=JDK%201.7%20(latest),label=beam/ws/runners/flink/src/main/java/org/apache/beam/runners/flink/translation/wrappers/streaming/DoFnOperator.java>:
Recompile with -Xlint:unchecked for details.
2017-06-07\T\06:27:45.571 [INFO] -------------------------------------------------------------
2017-06-07\T\06:27:45.571 [ERROR] COMPILATION ERROR : 
2017-06-07\T\06:27:45.571 [INFO] -------------------------------------------------------------
2017-06-07\T\06:27:45.571 [ERROR] <https://builds.apache.org/job/beam_PostCommit_Java_JDK_Versions_Test/jdk=JDK%201.7%20(latest),label=beam/ws/runners/flink/src/main/java/org/apache/beam/runners/flink/FlinkStreamingTransformTranslators.java>:[366,27]
method put in interface java.util.Map<K,V> cannot be applied to given types;
  required: org.apache.beam.sdk.values.TupleTag<?>,org.apache.flink.util.OutputTag<org.apache.beam.sdk.util.WindowedValue<?>>
  found: org.apache.beam.sdk.values.TupleTag<capture#1 of ?>,org.apache.flink.util.OutputTag<java.lang.Object>
  reason: actual argument org.apache.flink.util.OutputTag<java.lang.Object> cannot be
converted to org.apache.flink.util.OutputTag<org.apache.beam.sdk.util.WindowedValue<?>>
by method invocation conversion
2017-06-07\T\06:27:45.571 [INFO] 1 error
2017-06-07\T\06:27:45.571 [INFO] -------------------------------------------------------------
2017-06-07\T\06:27:45.572 [INFO] ------------------------------------------------------------------------
2017-06-07\T\06:27:45.572 [INFO] Reactor Summary:
2017-06-07\T\06:27:45.572 [INFO] 
2017-06-07\T\06:27:45.572 [INFO] Apache Beam :: Parent .............................. SUCCESS
[ 21.140 s]
2017-06-07\T\06:27:45.572 [INFO] Apache Beam :: SDKs :: Java :: Build Tools ......... SUCCESS
[  6.623 s]
2017-06-07\T\06:27:45.572 [INFO] Apache Beam :: SDKs ................................ SUCCESS
[  0.517 s]
2017-06-07\T\06:27:45.572 [INFO] Apache Beam :: SDKs :: Common ...................... SUCCESS
[  0.520 s]
2017-06-07\T\06:27:45.572 [INFO] Apache Beam :: SDKs :: Common :: Runner API ........ SUCCESS
[  7.445 s]
2017-06-07\T\06:27:45.572 [INFO] Apache Beam :: SDKs :: Common :: Fn API ............ SUCCESS
[  4.709 s]
2017-06-07\T\06:27:45.572 [INFO] Apache Beam :: SDKs :: Java ........................ SUCCESS
[  0.429 s]
2017-06-07\T\06:27:45.572 [INFO] Apache Beam :: SDKs :: Java :: Core ................ SUCCESS
[01:17 min]
2017-06-07\T\06:27:45.572 [INFO] Apache Beam :: SDKs :: Java :: IO .................. SUCCESS
[  0.438 s]
2017-06-07\T\06:27:45.572 [INFO] Apache Beam :: SDKs :: Java :: IO :: Common ........ SUCCESS
[  2.921 s]
2017-06-07\T\06:27:45.572 [INFO] Apache Beam :: Runners ............................. SUCCESS
[  0.408 s]
2017-06-07\T\06:27:45.572 [INFO] Apache Beam :: Runners :: Core Construction Java ... SUCCESS
[ 11.352 s]
2017-06-07\T\06:27:45.572 [INFO] Apache Beam :: Runners :: Core Java ................ SUCCESS
[ 25.825 s]
2017-06-07\T\06:27:45.572 [INFO] Apache Beam :: Runners :: Direct Java .............. SUCCESS
[03:10 min]
2017-06-07\T\06:27:45.572 [INFO] Apache Beam :: SDKs :: Java :: IO :: Elasticsearch . SUCCESS
[ 27.189 s]
2017-06-07\T\06:27:45.572 [INFO] Apache Beam :: SDKs :: Java :: Extensions .......... SUCCESS
[  0.473 s]
2017-06-07\T\06:27:45.572 [INFO] Apache Beam :: SDKs :: Java :: Extensions :: Google Cloud
Platform Core SUCCESS [ 28.777 s]
2017-06-07\T\06:27:45.572 [INFO] Apache Beam :: SDKs :: Java :: Extensions :: Protobuf SUCCESS
[  9.020 s]
2017-06-07\T\06:27:45.572 [INFO] Apache Beam :: SDKs :: Java :: IO :: Google Cloud Platform
SUCCESS [01:05 min]
2017-06-07\T\06:27:45.572 [INFO] Apache Beam :: SDKs :: Java :: IO :: Hadoop Common . SUCCESS
[ 13.053 s]
2017-06-07\T\06:27:45.572 [INFO] Apache Beam :: SDKs :: Java :: IO :: Hadoop File System SUCCESS
[ 30.405 s]
2017-06-07\T\06:27:45.572 [INFO] Apache Beam :: SDKs :: Java :: IO :: Hadoop ........ SUCCESS
[  5.578 s]
2017-06-07\T\06:27:45.572 [INFO] Apache Beam :: SDKs :: Java :: IO :: Hadoop :: input-format
SUCCESS [ 18.657 s]
2017-06-07\T\06:27:45.572 [INFO] Apache Beam :: SDKs :: Java :: IO :: HBase ......... SUCCESS
[01:16 min]
2017-06-07\T\06:27:45.572 [INFO] Apache Beam :: Runners :: Google Cloud Dataflow .... SUCCESS
[05:55 min]
2017-06-07\T\06:27:45.572 [INFO] Apache Beam :: SDKs :: Java :: IO :: JDBC .......... SUCCESS
[ 27.076 s]
2017-06-07\T\06:27:45.572 [INFO] Apache Beam :: SDKs :: Java :: IO :: JMS ........... SUCCESS
[ 16.501 s]
2017-06-07\T\06:27:45.572 [INFO] Apache Beam :: SDKs :: Java :: IO :: Kafka ......... SUCCESS
[ 31.284 s]
2017-06-07\T\06:27:45.572 [INFO] Apache Beam :: SDKs :: Java :: IO :: Kinesis ....... SUCCESS
[ 17.750 s]
2017-06-07\T\06:27:45.572 [INFO] Apache Beam :: SDKs :: Java :: IO :: MongoDB ....... SUCCESS
[ 31.515 s]
2017-06-07\T\06:27:45.572 [INFO] Apache Beam :: SDKs :: Java :: IO :: MQTT .......... SUCCESS
[ 13.048 s]
2017-06-07\T\06:27:45.572 [INFO] Apache Beam :: SDKs :: Java :: IO :: XML ........... SUCCESS
[ 23.228 s]
2017-06-07\T\06:27:45.572 [INFO] Apache Beam :: SDKs :: Java :: Maven Archetypes .... SUCCESS
[  0.587 s]
2017-06-07\T\06:27:45.572 [INFO] Apache Beam :: SDKs :: Java :: Maven Archetypes :: Starter
SUCCESS [ 13.914 s]
2017-06-07\T\06:27:45.572 [INFO] Apache Beam :: Examples ............................ SUCCESS
[  0.499 s]
2017-06-07\T\06:27:45.572 [INFO] Apache Beam :: Examples :: Java .................... SUCCESS
[06:21 min]
2017-06-07\T\06:27:45.572 [INFO] Apache Beam :: SDKs :: Java :: Maven Archetypes :: Examples
SUCCESS [ 41.484 s]
2017-06-07\T\06:27:45.572 [INFO] Apache Beam :: SDKs :: Java :: Extensions :: Jackson SUCCESS
[ 11.286 s]
2017-06-07\T\06:27:45.573 [INFO] Apache Beam :: SDKs :: Java :: Extensions :: Join library
SUCCESS [ 11.795 s]
2017-06-07\T\06:27:45.573 [INFO] Apache Beam :: SDKs :: Java :: Extensions :: Sorter  SUCCESS
[ 22.690 s]
2017-06-07\T\06:27:45.573 [INFO] Apache Beam :: Runners :: Flink .................... FAILURE
[  6.938 s]
2017-06-07\T\06:27:45.573 [INFO] Apache Beam :: Runners :: Spark .................... SKIPPED
2017-06-07\T\06:27:45.573 [INFO] Apache Beam :: SDKs :: Java :: Aggregated Javadoc .. SKIPPED
2017-06-07\T\06:27:45.573 [INFO] ------------------------------------------------------------------------
2017-06-07\T\06:27:45.573 [INFO] BUILD FAILURE
2017-06-07\T\06:27:45.573 [INFO] ------------------------------------------------------------------------
2017-06-07\T\06:27:45.573 [INFO] Total time: 27:14 min
2017-06-07\T\06:27:45.573 [INFO] Finished at: 2017-06-07T06:27:45+00:00
2017-06-07\T\06:27:46.267 [INFO] Final Memory: 218M/1608M
2017-06-07\T\06:27:46.267 [INFO] ------------------------------------------------------------------------
2017-06-07\T\06:27:46.268 [ERROR] Failed to execute goal org.apache.maven.plugins:maven-compiler-plugin:3.6.1:compile
(default-compile) on project beam-runners-flink_2.10: Compilation failure
2017-06-07\T\06:27:46.268 [ERROR] <https://builds.apache.org/job/beam_PostCommit_Java_JDK_Versions_Test/jdk=JDK%201.7%20(latest),label=beam/ws/runners/flink/src/main/java/org/apache/beam/runners/flink/FlinkStreamingTransformTranslators.java>:[366,27]
method put in interface java.util.Map<K,V> cannot be applied to given types;
2017-06-07\T\06:27:46.268 [ERROR] required: org.apache.beam.sdk.values.TupleTag<?>,org.apache.flink.util.OutputTag<org.apache.beam.sdk.util.WindowedValue<?>>
2017-06-07\T\06:27:46.268 [ERROR] found: org.apache.beam.sdk.values.TupleTag<capture#1
of ?>,org.apache.flink.util.OutputTag<java.lang.Object>
2017-06-07\T\06:27:46.268 [ERROR] reason: actual argument org.apache.flink.util.OutputTag<java.lang.Object>
cannot be converted to org.apache.flink.util.OutputTag<org.apache.beam.sdk.util.WindowedValue<?>>
by method invocation conversion
2017-06-07\T\06:27:46.268 [ERROR] -> [Help 1]
org.apache.maven.lifecycle.LifecycleExecutionException: Failed to execute goal org.apache.maven.plugins:maven-compiler-plugin:3.6.1:compile
(default-compile) on project beam-runners-flink_2.10: Compilation failure
<https://builds.apache.org/job/beam_PostCommit_Java_JDK_Versions_Test/jdk=JDK%201.7%20(latest),label=beam/ws/runners/flink/src/main/java/org/apache/beam/runners/flink/FlinkStreamingTransformTranslators.java>:[366,27]
method put in interface java.util.Map<K,V> cannot be applied to given types;
  required: org.apache.beam.sdk.values.TupleTag<?>,org.apache.flink.util.OutputTag<org.apache.beam.sdk.util.WindowedValue<?>>
  found: org.apache.beam.sdk.values.TupleTag<capture#1 of ?>,org.apache.flink.util.OutputTag<java.lang.Object>
  reason: actual argument org.apache.flink.util.OutputTag<java.lang.Object> cannot be
converted to org.apache.flink.util.OutputTag<org.apache.beam.sdk.util.WindowedValue<?>>
by method invocation conversion

	at org.apache.maven.lifecycle.internal.MojoExecutor.execute(MojoExecutor.java:212)
	at org.apache.maven.lifecycle.internal.MojoExecutor.execute(MojoExecutor.java:153)
	at org.apache.maven.lifecycle.internal.MojoExecutor.execute(MojoExecutor.java:145)
	at org.apache.maven.lifecycle.internal.LifecycleModuleBuilder.buildProject(LifecycleModuleBuilder.java:116)
	at org.apache.maven.lifecycle.internal.LifecycleModuleBuilder.buildProject(LifecycleModuleBuilder.java:80)
	at org.apache.maven.lifecycle.internal.builder.singlethreaded.SingleThreadedBuilder.build(SingleThreadedBuilder.java:51)
	at org.apache.maven.lifecycle.internal.LifecycleStarter.execute(LifecycleStarter.java:128)
	at org.apache.maven.DefaultMaven.doExecute(DefaultMaven.java:307)
	at org.apache.maven.DefaultMaven.doExecute(DefaultMaven.java:193)
	at org.apache.maven.DefaultMaven.execute(DefaultMaven.java:106)
	at org.apache.maven.cli.MavenCli.execute(MavenCli.java:862)
	at org.apache.maven.cli.MavenCli.doMain(MavenCli.java:286)
	at org.apache.maven.cli.MavenCli.main(MavenCli.java:197)
	at sun.reflect.NativeMethodAccessorImpl.invoke0(Native Method)
	at sun.reflect.NativeMethodAccessorImpl.invoke(NativeMethodAccessorImpl.java:57)
	at sun.reflect.DelegatingMethodAccessorImpl.invoke(DelegatingMethodAccessorImpl.java:43)
	at java.lang.reflect.Method.invoke(Method.java:606)
	at org.codehaus.plexus.classworlds.launcher.Launcher.launchEnhanced(Launcher.java:289)
	at org.codehaus.plexus.classworlds.launcher.Launcher.launch(Launcher.java:229)
	at org.codehaus.plexus.classworlds.launcher.Launcher.mainWithExitCode(Launcher.java:415)
	at org.codehaus.plexus.classworlds.launcher.Launcher.main(Launcher.java:356)
Caused by: org.apache.maven.plugin.compiler.CompilationFailureException: Compilation failure
<https://builds.apache.org/job/beam_PostCommit_Java_JDK_Versions_Test/jdk=JDK%201.7%20(latest),label=beam/ws/runners/flink/src/main/java/org/apache/beam/runners/flink/FlinkStreamingTransformTranslators.java>:[366,27]
method put in interface java.util.Map<K,V> cannot be applied to given types;
  required: org.apache.beam.sdk.values.TupleTag<?>,org.apache.flink.util.OutputTag<org.apache.beam.sdk.util.WindowedValue<?>>
  found: org.apache.beam.sdk.values.TupleTag<capture#1 of ?>,org.apache.flink.util.OutputTag<java.lang.Object>
  reason: actual argument org.apache.flink.util.OutputTag<java.lang.Object> cannot be
converted to org.apache.flink.util.OutputTag<org.apache.beam.sdk.util.WindowedValue<?>>
by method invocation conversion

	at org.apache.maven.plugin.compiler.AbstractCompilerMojo.execute(AbstractCompilerMojo.java:1029)
	at org.apache.maven.plugin.compiler.CompilerMojo.execute(CompilerMojo.java:137)
	at org.apache.maven.plugin.DefaultBuildPluginManager.executeMojo(DefaultBuildPluginManager.java:134)
	at org.apache.maven.lifecycle.internal.MojoExecutor.execute(MojoExecutor.java:208)
	... 20 more
2017-06-07\T\06:27:46.268 [ERROR] 
2017-06-07\T\06:27:46.268 [ERROR] Re-run Maven using the -X switch to enable full debug logging.
2017-06-07\T\06:27:46.268 [ERROR] 
2017-06-07\T\06:27:46.268 [ERROR] For more information about the errors and possible solutions,
please read the following articles:
2017-06-07\T\06:27:46.268 [ERROR] [Help 1] http://cwiki.apache.org/confluence/display/MAVEN/MojoFailureException
2017-06-07\T\06:27:46.268 [ERROR] 
2017-06-07\T\06:27:46.268 [ERROR] After correcting the problems, you can resume the build
with the command
2017-06-07\T\06:27:46.268 [ERROR]   mvn <goals> -rf :beam-runners-flink_2.10
Build step 'Invoke top-level Maven targets' marked build as failure
Not sending mail to unregistered user kirpichov@google.com
Not sending mail to unregistered user aljoscha.krettek@gmail.com
Not sending mail to unregistered user klk@google.com
Not sending mail to unregistered user hepei.hp@alibaba-inc.com

Mime
View raw message