beam-commits mailing list archives

Site index · List index
Message view « Date » · « Thread »
Top « Date » · « Thread »
From Apache Jenkins Server <jenk...@builds.apache.org>
Subject Build failed in Jenkins: beam_PostCommit_Java_MavenInstall_Windows #99
Date Tue, 06 Jun 2017 06:37:46 GMT
See <https://builds.apache.org/job/beam_PostCommit_Java_MavenInstall_Windows/99/display/redirect?page=changes>

Changes:

[klk] Clarify javadoc on PTransformTranslation

[klk] Add CreatePCollectionView translation

------------------------------------------
[...truncated 2.53 MB...]
2017-06-06T06:36:11.709 [INFO] Downloaded: https://repo.maven.apache.org/maven2/org/codehaus/gmaven/groovy-maven-plugin/2.0/groovy-maven-plugin-2.0.jar
(48 KB at 1892.3 KB/sec)
2017-06-06T06:36:11.716 [INFO] 
2017-06-06T06:36:11.716 [INFO] --- groovy-maven-plugin:2.0:execute (find-supported-python-for-clean)
@ beam-sdks-python ---
2017-06-06T06:36:11.720 [INFO] Downloading: https://repo.maven.apache.org/maven2/org/sonatype/gossip/gossip-slf4j/1.8/gossip-slf4j-1.8.pom
2017-06-06T06:36:11.729 [INFO] Downloaded: https://repo.maven.apache.org/maven2/org/sonatype/gossip/gossip-slf4j/1.8/gossip-slf4j-1.8.pom
(2 KB at 160.8 KB/sec)
2017-06-06T06:36:11.733 [INFO] Downloading: https://repo.maven.apache.org/maven2/org/sonatype/gossip/gossip/1.8/gossip-1.8.pom
2017-06-06T06:36:11.745 [INFO] Downloaded: https://repo.maven.apache.org/maven2/org/sonatype/gossip/gossip/1.8/gossip-1.8.pom
(12 KB at 938.0 KB/sec)
2017-06-06T06:36:11.749 [INFO] Downloading: https://repo.maven.apache.org/maven2/org/sonatype/forge/forge-parent/9/forge-parent-9.pom
2017-06-06T06:36:11.760 [INFO] Downloaded: https://repo.maven.apache.org/maven2/org/sonatype/forge/forge-parent/9/forge-parent-9.pom
(13 KB at 1166.7 KB/sec)
2017-06-06T06:36:11.767 [INFO] Downloading: https://repo.maven.apache.org/maven2/org/sonatype/gossip/gossip-core/1.8/gossip-core-1.8.pom
2017-06-06T06:36:11.779 [INFO] Downloaded: https://repo.maven.apache.org/maven2/org/sonatype/gossip/gossip-core/1.8/gossip-core-1.8.pom
(3 KB at 181.1 KB/sec)
2017-06-06T06:36:11.783 [INFO] Downloading: https://repo.maven.apache.org/maven2/org/sonatype/gossip/gossip-bootstrap/1.8/gossip-bootstrap-1.8.pom
2017-06-06T06:36:11.795 [INFO] Downloaded: https://repo.maven.apache.org/maven2/org/sonatype/gossip/gossip-bootstrap/1.8/gossip-bootstrap-1.8.pom
(2 KB at 131.1 KB/sec)
2017-06-06T06:36:11.799 [INFO] Downloading: https://repo.maven.apache.org/maven2/com/google/guava/guava/14.0.1/guava-14.0.1.pom
2017-06-06T06:36:11.811 [INFO] Downloaded: https://repo.maven.apache.org/maven2/com/google/guava/guava/14.0.1/guava-14.0.1.pom
(6 KB at 437.5 KB/sec)
2017-06-06T06:36:11.815 [INFO] Downloading: https://repo.maven.apache.org/maven2/com/google/guava/guava-parent/14.0.1/guava-parent-14.0.1.pom
2017-06-06T06:36:11.823 [INFO] Downloaded: https://repo.maven.apache.org/maven2/com/google/guava/guava-parent/14.0.1/guava-parent-14.0.1.pom
(3 KB at 311.9 KB/sec)
2017-06-06T06:36:11.828 [INFO] Downloading: https://repo.maven.apache.org/maven2/org/codehaus/plexus/plexus-classworlds/2.4.2/plexus-classworlds-2.4.2.pom
2017-06-06T06:36:11.840 [INFO] Downloaded: https://repo.maven.apache.org/maven2/org/codehaus/plexus/plexus-classworlds/2.4.2/plexus-classworlds-2.4.2.pom
(4 KB at 285.6 KB/sec)
2017-06-06T06:36:11.845 [INFO] Downloading: https://repo.maven.apache.org/maven2/org/codehaus/plexus/plexus-interpolation/1.16/plexus-interpolation-1.16.pom
2017-06-06T06:36:11.855 [INFO] Downloaded: https://repo.maven.apache.org/maven2/org/codehaus/plexus/plexus-interpolation/1.16/plexus-interpolation-1.16.pom
(2 KB at 100.3 KB/sec)
2017-06-06T06:36:11.860 [INFO] Downloading: https://repo.maven.apache.org/maven2/org/eclipse/aether/aether-api/0.9.0.M2/aether-api-0.9.0.M2.pom
2017-06-06T06:36:11.960 [INFO] Downloaded: https://repo.maven.apache.org/maven2/org/eclipse/aether/aether-api/0.9.0.M2/aether-api-0.9.0.M2.pom
(2 KB at 17.0 KB/sec)
2017-06-06T06:36:11.967 [INFO] Downloading: https://repo.maven.apache.org/maven2/org/codehaus/gmaven/gmaven-adapter-api/2.0/gmaven-adapter-api-2.0.pom
2017-06-06T06:36:11.977 [INFO] Downloaded: https://repo.maven.apache.org/maven2/org/codehaus/gmaven/gmaven-adapter-api/2.0/gmaven-adapter-api-2.0.pom
(2 KB at 176.4 KB/sec)
2017-06-06T06:36:11.982 [INFO] Downloading: https://repo.maven.apache.org/maven2/org/codehaus/gmaven/gmaven-adapter-impl/2.0/gmaven-adapter-impl-2.0.pom
2017-06-06T06:36:11.994 [INFO] Downloaded: https://repo.maven.apache.org/maven2/org/codehaus/gmaven/gmaven-adapter-impl/2.0/gmaven-adapter-impl-2.0.pom
(3 KB at 221.2 KB/sec)
2017-06-06T06:36:11.999 [INFO] Downloading: https://repo.maven.apache.org/maven2/org/codehaus/groovy/groovy-all/2.1.5/groovy-all-2.1.5.pom
2017-06-06T06:36:12.013 [INFO] Downloaded: https://repo.maven.apache.org/maven2/org/codehaus/groovy/groovy-all/2.1.5/groovy-all-2.1.5.pom
(18 KB at 1258.3 KB/sec)
2017-06-06T06:36:12.017 [INFO] Downloading: https://repo.maven.apache.org/maven2/org/apache/ant/ant/1.8.4/ant-1.8.4.pom
2017-06-06T06:36:12.028 [INFO] Downloaded: https://repo.maven.apache.org/maven2/org/apache/ant/ant/1.8.4/ant-1.8.4.pom
(10 KB at 857.1 KB/sec)
2017-06-06T06:36:12.033 [INFO] Downloading: https://repo.maven.apache.org/maven2/org/apache/ant/ant-parent/1.8.4/ant-parent-1.8.4.pom
2017-06-06T06:36:12.045 [INFO] Downloaded: https://repo.maven.apache.org/maven2/org/apache/ant/ant-parent/1.8.4/ant-parent-1.8.4.pom
(5 KB at 371.2 KB/sec)
2017-06-06T06:36:12.050 [INFO] Downloading: https://repo.maven.apache.org/maven2/org/apache/ant/ant-launcher/1.8.4/ant-launcher-1.8.4.pom
2017-06-06T06:36:12.063 [INFO] Downloaded: https://repo.maven.apache.org/maven2/org/apache/ant/ant-launcher/1.8.4/ant-launcher-1.8.4.pom
(3 KB at 177.4 KB/sec)
2017-06-06T06:36:12.067 [INFO] Downloading: https://repo.maven.apache.org/maven2/org/fusesource/jansi/jansi/1.11/jansi-1.11.pom
2017-06-06T06:36:12.096 [INFO] Downloaded: https://repo.maven.apache.org/maven2/org/fusesource/jansi/jansi/1.11/jansi-1.11.pom
(4 KB at 121.3 KB/sec)
2017-06-06T06:36:12.101 [INFO] Downloading: https://repo.maven.apache.org/maven2/org/fusesource/jansi/jansi-project/1.11/jansi-project-1.11.pom
2017-06-06T06:36:12.112 [INFO] Downloaded: https://repo.maven.apache.org/maven2/org/fusesource/jansi/jansi-project/1.11/jansi-project-1.11.pom
(12 KB at 1016.2 KB/sec)
2017-06-06T06:36:12.119 [INFO] Downloading: https://repo.maven.apache.org/maven2/org/fusesource/fusesource-pom/1.8/fusesource-pom-1.8.pom
2017-06-06T06:36:12.133 [INFO] Downloaded: https://repo.maven.apache.org/maven2/org/fusesource/fusesource-pom/1.8/fusesource-pom-1.8.pom
(15 KB at 1022.3 KB/sec)
2017-06-06T06:36:12.150 [INFO] Downloading: https://repo.maven.apache.org/maven2/org/sonatype/gossip/gossip-bootstrap/1.8/gossip-bootstrap-1.8.jar
2017-06-06T06:36:12.152 [INFO] Downloading: https://repo.maven.apache.org/maven2/org/sonatype/gossip/gossip-core/1.8/gossip-core-1.8.jar
2017-06-06T06:36:12.155 [INFO] Downloading: https://repo.maven.apache.org/maven2/org/codehaus/plexus/plexus-classworlds/2.4.2/plexus-classworlds-2.4.2.jar
2017-06-06T06:36:12.156 [INFO] Downloading: https://repo.maven.apache.org/maven2/org/sonatype/gossip/gossip-slf4j/1.8/gossip-slf4j-1.8.jar
2017-06-06T06:36:12.157 [INFO] Downloading: https://repo.maven.apache.org/maven2/com/google/guava/guava/14.0.1/guava-14.0.1.jar
2017-06-06T06:36:12.176 [INFO] Downloaded: https://repo.maven.apache.org/maven2/org/codehaus/plexus/plexus-classworlds/2.4.2/plexus-classworlds-2.4.2.jar
(46 KB at 1638.1 KB/sec)
2017-06-06T06:36:12.176 [INFO] Downloading: https://repo.maven.apache.org/maven2/org/codehaus/plexus/plexus-interpolation/1.16/plexus-interpolation-1.16.jar
2017-06-06T06:36:12.177 [INFO] Downloaded: https://repo.maven.apache.org/maven2/org/sonatype/gossip/gossip-slf4j/1.8/gossip-slf4j-1.8.jar
(5 KB at 137.6 KB/sec)
2017-06-06T06:36:12.177 [INFO] Downloading: https://repo.maven.apache.org/maven2/org/eclipse/aether/aether-api/0.9.0.M2/aether-api-0.9.0.M2.jar
2017-06-06T06:36:12.212 [INFO] Downloaded: https://repo.maven.apache.org/maven2/org/eclipse/aether/aether-api/0.9.0.M2/aether-api-0.9.0.M2.jar
(131 KB at 2044.0 KB/sec)
2017-06-06T06:36:12.212 [INFO] Downloading: https://repo.maven.apache.org/maven2/org/codehaus/gmaven/gmaven-adapter-api/2.0/gmaven-adapter-api-2.0.jar
2017-06-06T06:36:12.213 [INFO] Downloaded: https://repo.maven.apache.org/maven2/org/codehaus/plexus/plexus-interpolation/1.16/plexus-interpolation-1.16.jar
(60 KB at 921.1 KB/sec)
2017-06-06T06:36:12.213 [INFO] Downloading: https://repo.maven.apache.org/maven2/org/codehaus/gmaven/gmaven-adapter-impl/2.0/gmaven-adapter-impl-2.0.jar
2017-06-06T06:36:12.220 [INFO] Downloaded: https://repo.maven.apache.org/maven2/org/sonatype/gossip/gossip-bootstrap/1.8/gossip-bootstrap-1.8.jar
(20 KB at 268.0 KB/sec)
2017-06-06T06:36:12.220 [INFO] Downloading: https://repo.maven.apache.org/maven2/org/codehaus/groovy/groovy-all/2.1.5/groovy-all-2.1.5.jar
2017-06-06T06:36:12.381 [INFO] Downloaded: https://repo.maven.apache.org/maven2/org/sonatype/gossip/gossip-core/1.8/gossip-core-1.8.jar
(57 KB at 241.3 KB/sec)
2017-06-06T06:36:12.381 [INFO] Downloading: https://repo.maven.apache.org/maven2/org/apache/ant/ant/1.8.4/ant-1.8.4.jar
2017-06-06T06:36:12.383 [INFO] Downloaded: https://repo.maven.apache.org/maven2/com/google/guava/guava/14.0.1/guava-14.0.1.jar
(2138 KB at 9097.1 KB/sec)
2017-06-06T06:36:12.383 [INFO] Downloading: https://repo.maven.apache.org/maven2/org/apache/ant/ant-launcher/1.8.4/ant-launcher-1.8.4.jar
2017-06-06T06:36:12.385 [INFO] Downloaded: https://repo.maven.apache.org/maven2/org/codehaus/gmaven/gmaven-adapter-api/2.0/gmaven-adapter-api-2.0.jar
(7 KB at 29.3 KB/sec)
2017-06-06T06:36:12.385 [INFO] Downloading: https://repo.maven.apache.org/maven2/org/fusesource/jansi/jansi/1.11/jansi-1.11.jar
2017-06-06T06:36:12.386 [INFO] Downloaded: https://repo.maven.apache.org/maven2/org/codehaus/gmaven/gmaven-adapter-impl/2.0/gmaven-adapter-impl-2.0.jar
(16 KB at 66.4 KB/sec)
2017-06-06T06:36:12.407 [INFO] Downloaded: https://repo.maven.apache.org/maven2/org/apache/ant/ant-launcher/1.8.4/ant-launcher-1.8.4.jar
(18 KB at 69.5 KB/sec)
2017-06-06T06:36:12.411 [INFO] Downloaded: https://repo.maven.apache.org/maven2/org/fusesource/jansi/jansi/1.11/jansi-1.11.jar
(112 KB at 424.8 KB/sec)
2017-06-06T06:36:12.591 [INFO] Downloaded: https://repo.maven.apache.org/maven2/org/apache/ant/ant/1.8.4/ant-1.8.4.jar
(1897 KB at 4280.4 KB/sec)
2017-06-06T06:36:12.806 [INFO] Downloaded: https://repo.maven.apache.org/maven2/org/codehaus/groovy/groovy-all/2.1.5/groovy-all-2.1.5.jar
(6219 KB at 9450.3 KB/sec)
[JENKINS] Archiving disabled
2017-06-06T06:36:15.935 [INFO]                                                           
             
2017-06-06T06:36:15.935 [INFO] ------------------------------------------------------------------------
2017-06-06T06:36:15.935 [INFO] Skipping Apache Beam :: Parent
2017-06-06T06:36:15.935 [INFO] This project has been banned from the build due to previous
failures.
2017-06-06T06:36:15.935 [INFO] ------------------------------------------------------------------------
[JENKINS] Archiving disabled
[JENKINS] Archiving disabled
[JENKINS] Archiving disabled
[JENKINS] Archiving disabled
[JENKINS] Archiving disabled
[JENKINS] Archiving disabled
[JENKINS] Archiving disabled
[JENKINS] Archiving disabled
[JENKINS] Archiving disabled
[JENKINS] Archiving disabled
[JENKINS] Archiving disabled
[JENKINS] Archiving disabled
[JENKINS] Archiving disabled
[JENKINS] Archiving disabled
[JENKINS] Archiving disabled
[JENKINS] Archiving disabled
[JENKINS] Archiving disabled
[JENKINS] Archiving disabled
[JENKINS] Archiving disabled
[JENKINS] Archiving disabled
[JENKINS] Archiving disabled
[JENKINS] Archiving disabled
[JENKINS] Archiving disabled
[JENKINS] Archiving disabled
[JENKINS] Archiving disabled
[JENKINS] Archiving disabled
[JENKINS] Archiving disabled
[JENKINS] Archiving disabled
[JENKINS] Archiving disabled
[JENKINS] Archiving disabled
[JENKINS] Archiving disabled
[JENKINS] Archiving disabled
[JENKINS] Archiving disabled
[JENKINS] Archiving disabled
[JENKINS] Archiving disabled
[JENKINS] Archiving disabled
[JENKINS] Archiving disabled
[JENKINS] Archiving disabled
[JENKINS] Archiving disabled
[JENKINS] Archiving disabled
[JENKINS] Archiving disabled
[JENKINS] Archiving disabled
[JENKINS] Archiving disabled
[JENKINS] Archiving disabled
[JENKINS] Archiving disabled
[JENKINS] Archiving disabled
[JENKINS] Archiving disabled
2017-06-06T06:37:25.192 [INFO] ------------------------------------------------------------------------
2017-06-06T06:37:25.192 [INFO] Reactor Summary:
2017-06-06T06:37:25.192 [INFO] 
2017-06-06T06:37:25.193 [INFO] Apache Beam :: Parent .............................. SUCCESS
[ 30.319 s]
2017-06-06T06:37:25.193 [INFO] Apache Beam :: SDKs :: Java :: Build Tools ......... SUCCESS
[ 18.547 s]
2017-06-06T06:37:25.193 [INFO] Apache Beam :: SDKs ................................ SUCCESS
[ 10.429 s]
2017-06-06T06:37:25.194 [INFO] Apache Beam :: SDKs :: Common ...................... SUCCESS
[  5.383 s]
2017-06-06T06:37:25.194 [INFO] Apache Beam :: SDKs :: Common :: Runner API ........ SUCCESS
[ 27.462 s]
2017-06-06T06:37:25.194 [INFO] Apache Beam :: SDKs :: Common :: Fn API ............ SUCCESS
[ 26.220 s]
2017-06-06T06:37:25.194 [INFO] Apache Beam :: SDKs :: Java ........................ SUCCESS
[  6.103 s]
2017-06-06T06:37:25.194 [INFO] Apache Beam :: SDKs :: Java :: Core ................ SUCCESS
[04:35 min]
2017-06-06T06:37:25.195 [INFO] Apache Beam :: SDKs :: Java :: IO .................. SUCCESS
[  6.671 s]
2017-06-06T06:37:25.195 [INFO] Apache Beam :: SDKs :: Java :: IO :: Common ........ SUCCESS
[ 13.760 s]
2017-06-06T06:37:25.195 [INFO] Apache Beam :: Runners ............................. SUCCESS
[  5.943 s]
2017-06-06T06:37:25.195 [INFO] Apache Beam :: Runners :: Core Construction Java ... SUCCESS
[ 55.480 s]
2017-06-06T06:37:25.195 [INFO] Apache Beam :: Runners :: Core Java ................ SUCCESS
[01:28 min]
2017-06-06T06:37:25.196 [INFO] Apache Beam :: Runners :: Direct Java .............. SUCCESS
[04:17 min]
2017-06-06T06:37:25.196 [INFO] Apache Beam :: SDKs :: Java :: IO :: Elasticsearch . SUCCESS
[01:10 min]
2017-06-06T06:37:25.196 [INFO] Apache Beam :: SDKs :: Java :: Extensions .......... SUCCESS
[  5.896 s]
[JENKINS] Archiving disabled
2017-06-06T06:37:25.196 [INFO] Apache Beam :: SDKs :: Java :: Extensions :: Google Cloud Platform
Core SUCCESS [01:09 min]
2017-06-06T06:37:25.196 [INFO] Apache Beam :: SDKs :: Java :: Extensions :: Protobuf SUCCESS
[ 36.198 s]
2017-06-06T06:37:25.196 [INFO] Apache Beam :: SDKs :: Java :: IO :: Google Cloud Platform
SUCCESS [01:45 min]
2017-06-06T06:37:25.197 [INFO] Apache Beam :: SDKs :: Java :: IO :: Hadoop Common . SUCCESS
[ 34.452 s]
2017-06-06T06:37:25.197 [INFO] Apache Beam :: SDKs :: Java :: IO :: Hadoop File System SUCCESS
[ 43.271 s]
2017-06-06T06:37:25.197 [INFO] Apache Beam :: SDKs :: Java :: IO :: Hadoop ........ SUCCESS
[  8.819 s]
2017-06-06T06:37:25.197 [INFO] Apache Beam :: SDKs :: Java :: IO :: Hadoop :: input-format
SUCCESS [ 37.971 s]
2017-06-06T06:37:25.197 [INFO] Apache Beam :: SDKs :: Java :: IO :: Hadoop :: jdk1.8-tests
SUCCESS [01:51 min]
2017-06-06T06:37:25.197 [INFO] Apache Beam :: SDKs :: Java :: IO :: HBase ......... SUCCESS
[ 48.571 s]
2017-06-06T06:37:25.197 [INFO] Apache Beam :: SDKs :: Java :: IO :: JDBC .......... SUCCESS
[ 45.438 s]
2017-06-06T06:37:25.197 [INFO] Apache Beam :: SDKs :: Java :: IO :: JMS ........... SUCCESS
[ 44.793 s]
2017-06-06T06:37:25.197 [INFO] Apache Beam :: SDKs :: Java :: IO :: Kafka ......... SUCCESS
[ 53.104 s]
2017-06-06T06:37:25.197 [INFO] Apache Beam :: SDKs :: Java :: IO :: Kinesis ....... SUCCESS
[ 46.397 s]
2017-06-06T06:37:25.197 [INFO] Apache Beam :: SDKs :: Java :: IO :: MongoDB ....... SUCCESS
[ 54.632 s]
2017-06-06T06:37:25.197 [INFO] Apache Beam :: SDKs :: Java :: IO :: MQTT .......... SUCCESS
[ 39.376 s]
2017-06-06T06:37:25.197 [INFO] Apache Beam :: SDKs :: Java :: IO :: XML ........... SUCCESS
[ 36.403 s]
2017-06-06T06:37:25.197 [INFO] Apache Beam :: SDKs :: Java :: Maven Archetypes .... SUCCESS
[  6.156 s]
2017-06-06T06:37:25.197 [INFO] Apache Beam :: SDKs :: Java :: Maven Archetypes :: Starter
SUCCESS [ 28.099 s]
2017-06-06T06:37:25.197 [INFO] Apache Beam :: SDKs :: Java :: Extensions :: Jackson SUCCESS
[ 35.268 s]
2017-06-06T06:37:25.198 [INFO] Apache Beam :: SDKs :: Java :: Extensions :: Join library SUCCESS
[ 33.382 s]
2017-06-06T06:37:25.198 [INFO] Apache Beam :: SDKs :: Java :: Extensions :: Sorter  SUCCESS
[ 43.648 s]
2017-06-06T06:37:25.198 [INFO] Apache Beam :: Runners :: Google Cloud Dataflow .... SUCCESS
[01:03 min]
2017-06-06T06:37:25.198 [INFO] Apache Beam :: SDKs :: Java :: Harness ............. SUCCESS
[01:04 min]
2017-06-06T06:37:25.198 [INFO] Apache Beam :: SDKs :: Java :: Java 8 Tests ........ SUCCESS
[ 29.712 s]
2017-06-06T06:37:25.198 [INFO] Apache Beam :: SDKs :: Python ...................... FAILURE
[  4.055 s]
2017-06-06T06:37:25.198 [INFO] Apache Beam :: Runners :: Flink .................... SKIPPED
2017-06-06T06:37:25.198 [INFO] Apache Beam :: Runners :: Spark .................... SKIPPED
2017-06-06T06:37:25.198 [INFO] Apache Beam :: Runners :: Apex ..................... SKIPPED
2017-06-06T06:37:25.198 [INFO] Apache Beam :: Examples ............................ SKIPPED
2017-06-06T06:37:25.198 [INFO] Apache Beam :: Examples :: Java .................... SKIPPED
2017-06-06T06:37:25.198 [INFO] Apache Beam :: Examples :: Java 8 .................. SKIPPED
2017-06-06T06:37:25.198 [INFO] Apache Beam :: SDKs :: Java :: Aggregated Javadoc .. SKIPPED
2017-06-06T06:37:25.198 [INFO] ------------------------------------------------------------------------
2017-06-06T06:37:25.198 [INFO] BUILD FAILURE
2017-06-06T06:37:25.198 [INFO] ------------------------------------------------------------------------
2017-06-06T06:37:25.199 [INFO] Total time: 36:44 min
2017-06-06T06:37:25.199 [INFO] Finished at: 2017-06-06T06:37:25+00:00
2017-06-06T06:37:27.034 [INFO] Final Memory: 305M/2691M
2017-06-06T06:37:27.034 [INFO] ------------------------------------------------------------------------
2017-06-06T06:37:27.048 [ERROR] Failed to execute goal org.codehaus.gmaven:groovy-maven-plugin:2.0:execute
(find-supported-python-for-clean) on project beam-sdks-python: Unable to find Python 2.7 in
path -> [Help 1]
org.apache.maven.lifecycle.LifecycleExecutionException: Failed to execute goal org.codehaus.gmaven:groovy-maven-plugin:2.0:execute
(find-supported-python-for-clean) on project beam-sdks-python: Unable to find Python 2.7 in
path
	at org.apache.maven.lifecycle.internal.MojoExecutor.execute(MojoExecutor.java:212)
	at org.apache.maven.lifecycle.internal.MojoExecutor.execute(MojoExecutor.java:153)
	at org.apache.maven.lifecycle.internal.MojoExecutor.execute(MojoExecutor.java:145)
	at org.apache.maven.lifecycle.internal.LifecycleModuleBuilder.buildProject(LifecycleModuleBuilder.java:116)
	at org.apache.maven.lifecycle.internal.LifecycleModuleBuilder.buildProject(LifecycleModuleBuilder.java:80)
	at org.apache.maven.lifecycle.internal.builder.singlethreaded.SingleThreadedBuilder.build(SingleThreadedBuilder.java:51)
	at org.apache.maven.lifecycle.internal.LifecycleStarter.execute(LifecycleStarter.java:128)
	at org.apache.maven.DefaultMaven.doExecute(DefaultMaven.java:307)
	at org.apache.maven.DefaultMaven.doExecute(DefaultMaven.java:193)
	at org.apache.maven.DefaultMaven.execute(DefaultMaven.java:106)
	at org.jvnet.hudson.maven3.launcher.Maven33Launcher.main(Maven33Launcher.java:129)
	at sun.reflect.NativeMethodAccessorImpl.invoke0(Native Method)
	at sun.reflect.NativeMethodAccessorImpl.invoke(NativeMethodAccessorImpl.java:62)
	at sun.reflect.DelegatingMethodAccessorImpl.invoke(DelegatingMethodAccessorImpl.java:43)
	at java.lang.reflect.Method.invoke(Method.java:498)
	at org.codehaus.plexus.classworlds.launcher.Launcher.launchStandard(Launcher.java:330)
	at org.codehaus.plexus.classworlds.launcher.Launcher.launch(Launcher.java:238)
	at jenkins.maven3.agent.Maven33Main.launch(Maven33Main.java:176)
	at sun.reflect.NativeMethodAccessorImpl.invoke0(Native Method)
	at sun.reflect.NativeMethodAccessorImpl.invoke(NativeMethodAccessorImpl.java:62)
	at sun.reflect.DelegatingMethodAccessorImpl.invoke(DelegatingMethodAccessorImpl.java:43)
	at java.lang.reflect.Method.invoke(Method.java:498)
	at hudson.maven.Maven3Builder.call(Maven3Builder.java:139)
	at hudson.maven.Maven3Builder.call(Maven3Builder.java:70)
	at hudson.remoting.UserRequest.perform(UserRequest.java:120)
	at hudson.remoting.UserRequest.perform(UserRequest.java:48)
	at hudson.remoting.Request$2.run(Request.java:326)
	at hudson.remoting.InterceptingExecutorService$1.call(InterceptingExecutorService.java:68)
	at java.util.concurrent.FutureTask.run(FutureTask.java:266)
	at java.util.concurrent.ThreadPoolExecutor.runWorker(ThreadPoolExecutor.java:1142)
	at java.util.concurrent.ThreadPoolExecutor$Worker.run(ThreadPoolExecutor.java:617)
	at java.lang.Thread.run(Thread.java:745)
Caused by: org.apache.maven.plugin.MojoFailureException: Unable to find Python 2.7 in path
	at sun.reflect.NativeConstructorAccessorImpl.newInstance0(Native Method)
	at sun.reflect.NativeConstructorAccessorImpl.newInstance(NativeConstructorAccessorImpl.java:62)
	at sun.reflect.DelegatingConstructorAccessorImpl.newInstance(DelegatingConstructorAccessorImpl.java:45)
	at java.lang.reflect.Constructor.newInstance(Constructor.java:423)
	at org.codehaus.groovy.reflection.CachedConstructor.invoke(CachedConstructor.java:77)
	at org.codehaus.groovy.runtime.callsite.ConstructorSite$ConstructorSiteNoUnwrapNoCoerce.callConstructor(ConstructorSite.java:102)
	at org.codehaus.groovy.runtime.callsite.CallSiteArray.defaultCallConstructor(CallSiteArray.java:57)
	at org.codehaus.groovy.runtime.callsite.AbstractCallSite.callConstructor(AbstractCallSite.java:182)
	at org.codehaus.groovy.runtime.callsite.AbstractCallSite.callConstructor(AbstractCallSite.java:190)
	at findSupportedPython.run(findSupportedPython.groovy:70)
	at groovy.lang.GroovyShell.evaluate(GroovyShell.java:518)
	at org.codehaus.gmaven.adapter.impl.ScriptExecutorImpl.execute(ScriptExecutorImpl.java:80)
	at org.codehaus.gmaven.plugin.ExecuteMojo$1.run(ExecuteMojo.java:100)
	at org.codehaus.gmaven.plugin.util.SystemNoExitGuard.run(SystemNoExitGuard.java:45)
	at org.codehaus.gmaven.plugin.ExecuteMojo.run(ExecuteMojo.java:96)
	at org.codehaus.gmaven.plugin.MojoSupport.execute(MojoSupport.java:45)
	at org.apache.maven.plugin.DefaultBuildPluginManager.executeMojo(DefaultBuildPluginManager.java:134)
	at org.apache.maven.lifecycle.internal.MojoExecutor.execute(MojoExecutor.java:208)
	... 31 more
2017-06-06T06:37:27.051 [ERROR] 
2017-06-06T06:37:27.051 [ERROR] Re-run Maven using the -X switch to enable full debug logging.
2017-06-06T06:37:27.051 [ERROR] 
2017-06-06T06:37:27.051 [ERROR] For more information about the errors and possible solutions,
please read the following articles:
2017-06-06T06:37:27.051 [ERROR] [Help 1] http://cwiki.apache.org/confluence/display/MAVEN/MojoFailureException
2017-06-06T06:37:27.053 [ERROR] 
2017-06-06T06:37:27.053 [ERROR] After correcting the problems, you can resume the build with
the command
2017-06-06T06:37:27.053 [ERROR]   mvn <goals> -rf :beam-sdks-python
channel stopped
Not sending mail to unregistered user github@nakomis.com
Not sending mail to unregistered user mingmxu@ebay.com
Not sending mail to unregistered user kirpichov@google.com
Not sending mail to unregistered user aljoscha.krettek@gmail.com
Not sending mail to unregistered user klk@google.com
Not sending mail to unregistered user sourabhbajaj@google.com
Not sending mail to unregistered user hepei.hp@alibaba-inc.com

Mime
View raw message