beam-commits mailing list archives

Site index · List index
Message view « Date » · « Thread »
Top « Date » · « Thread »
From Apache Jenkins Server <jenk...@builds.apache.org>
Subject Build failed in Jenkins: beam_PostCommit_Java_MavenInstall_Windows #156
Date Tue, 20 Jun 2017 12:41:34 GMT
See <https://builds.apache.org/job/beam_PostCommit_Java_MavenInstall_Windows/156/display/redirect?page=changes>

Changes:

[iemejia] [BEAM-2411] Make the write transform of HBaseIO simpler

[iemejia] [BEAM-2411] Add HBaseCoderProviderRegistrar for better coder inference

------------------------------------------
[...truncated 2.65 MB...]
2017-06-20T12:39:53.184 [INFO] Downloaded: https://repo.maven.apache.org/maven2/org/sonatype/gossip/gossip/1.8/gossip-1.8.pom
(12 KB at 938.0 KB/sec)
2017-06-20T12:39:53.188 [INFO] Downloading: https://repo.maven.apache.org/maven2/org/sonatype/forge/forge-parent/9/forge-parent-9.pom
2017-06-20T12:39:53.198 [INFO] Downloaded: https://repo.maven.apache.org/maven2/org/sonatype/forge/forge-parent/9/forge-parent-9.pom
(13 KB at 1283.4 KB/sec)
2017-06-20T12:39:53.202 [INFO] Downloading: https://repo.maven.apache.org/maven2/org/sonatype/gossip/gossip-core/1.8/gossip-core-1.8.pom
2017-06-20T12:39:53.210 [INFO] Downloaded: https://repo.maven.apache.org/maven2/org/sonatype/gossip/gossip-core/1.8/gossip-core-1.8.pom
(3 KB at 271.6 KB/sec)
2017-06-20T12:39:53.214 [INFO] Downloading: https://repo.maven.apache.org/maven2/org/sonatype/gossip/gossip-bootstrap/1.8/gossip-bootstrap-1.8.pom
2017-06-20T12:39:53.223 [INFO] Downloaded: https://repo.maven.apache.org/maven2/org/sonatype/gossip/gossip-bootstrap/1.8/gossip-bootstrap-1.8.pom
(2 KB at 174.8 KB/sec)
2017-06-20T12:39:53.227 [INFO] Downloading: https://repo.maven.apache.org/maven2/com/google/guava/guava/14.0.1/guava-14.0.1.pom
2017-06-20T12:39:53.240 [INFO] Downloaded: https://repo.maven.apache.org/maven2/com/google/guava/guava/14.0.1/guava-14.0.1.pom
(6 KB at 403.8 KB/sec)
2017-06-20T12:39:53.243 [INFO] Downloading: https://repo.maven.apache.org/maven2/com/google/guava/guava-parent/14.0.1/guava-parent-14.0.1.pom
2017-06-20T12:39:53.251 [INFO] Downloaded: https://repo.maven.apache.org/maven2/com/google/guava/guava-parent/14.0.1/guava-parent-14.0.1.pom
(3 KB at 311.9 KB/sec)
2017-06-20T12:39:53.256 [INFO] Downloading: https://repo.maven.apache.org/maven2/org/codehaus/plexus/plexus-classworlds/2.4.2/plexus-classworlds-2.4.2.pom
2017-06-20T12:39:53.265 [INFO] Downloaded: https://repo.maven.apache.org/maven2/org/codehaus/plexus/plexus-classworlds/2.4.2/plexus-classworlds-2.4.2.pom
(4 KB at 380.8 KB/sec)
2017-06-20T12:39:53.270 [INFO] Downloading: https://repo.maven.apache.org/maven2/org/codehaus/plexus/plexus-interpolation/1.16/plexus-interpolation-1.16.pom
2017-06-20T12:39:53.282 [INFO] Downloaded: https://repo.maven.apache.org/maven2/org/codehaus/plexus/plexus-interpolation/1.16/plexus-interpolation-1.16.pom
(2 KB at 83.6 KB/sec)
2017-06-20T12:39:53.287 [INFO] Downloading: https://repo.maven.apache.org/maven2/org/eclipse/aether/aether-api/0.9.0.M2/aether-api-0.9.0.M2.pom
2017-06-20T12:39:53.297 [INFO] Downloaded: https://repo.maven.apache.org/maven2/org/eclipse/aether/aether-api/0.9.0.M2/aether-api-0.9.0.M2.pom
(2 KB at 169.6 KB/sec)
2017-06-20T12:39:53.303 [INFO] Downloading: https://repo.maven.apache.org/maven2/org/codehaus/gmaven/gmaven-adapter-api/2.0/gmaven-adapter-api-2.0.pom
2017-06-20T12:39:53.312 [INFO] Downloaded: https://repo.maven.apache.org/maven2/org/codehaus/gmaven/gmaven-adapter-api/2.0/gmaven-adapter-api-2.0.pom
(2 KB at 196.0 KB/sec)
2017-06-20T12:39:53.316 [INFO] Downloading: https://repo.maven.apache.org/maven2/org/codehaus/gmaven/gmaven-adapter-impl/2.0/gmaven-adapter-impl-2.0.pom
2017-06-20T12:39:53.326 [INFO] Downloaded: https://repo.maven.apache.org/maven2/org/codehaus/gmaven/gmaven-adapter-impl/2.0/gmaven-adapter-impl-2.0.pom
(3 KB at 265.4 KB/sec)
2017-06-20T12:39:53.330 [INFO] Downloading: https://repo.maven.apache.org/maven2/org/codehaus/groovy/groovy-all/2.1.5/groovy-all-2.1.5.pom
2017-06-20T12:39:53.340 [INFO] Downloaded: https://repo.maven.apache.org/maven2/org/codehaus/groovy/groovy-all/2.1.5/groovy-all-2.1.5.pom
(18 KB at 1761.6 KB/sec)
2017-06-20T12:39:53.345 [INFO] Downloading: https://repo.maven.apache.org/maven2/org/apache/ant/ant/1.8.4/ant-1.8.4.pom
2017-06-20T12:39:53.355 [INFO] Downloaded: https://repo.maven.apache.org/maven2/org/apache/ant/ant/1.8.4/ant-1.8.4.pom
(10 KB at 942.8 KB/sec)
2017-06-20T12:39:53.360 [INFO] Downloading: https://repo.maven.apache.org/maven2/org/apache/ant/ant-parent/1.8.4/ant-parent-1.8.4.pom
2017-06-20T12:39:53.367 [INFO] Downloaded: https://repo.maven.apache.org/maven2/org/apache/ant/ant-parent/1.8.4/ant-parent-1.8.4.pom
(5 KB at 636.3 KB/sec)
2017-06-20T12:39:53.371 [INFO] Downloading: https://repo.maven.apache.org/maven2/org/apache/ant/ant-launcher/1.8.4/ant-launcher-1.8.4.pom
2017-06-20T12:39:53.381 [INFO] Downloaded: https://repo.maven.apache.org/maven2/org/apache/ant/ant-launcher/1.8.4/ant-launcher-1.8.4.pom
(3 KB at 230.6 KB/sec)
2017-06-20T12:39:53.385 [INFO] Downloading: https://repo.maven.apache.org/maven2/org/fusesource/jansi/jansi/1.11/jansi-1.11.pom
2017-06-20T12:39:53.400 [INFO] Downloaded: https://repo.maven.apache.org/maven2/org/fusesource/jansi/jansi/1.11/jansi-1.11.pom
(4 KB at 234.4 KB/sec)
2017-06-20T12:39:53.405 [INFO] Downloading: https://repo.maven.apache.org/maven2/org/fusesource/jansi/jansi-project/1.11/jansi-project-1.11.pom
2017-06-20T12:39:53.419 [INFO] Downloaded: https://repo.maven.apache.org/maven2/org/fusesource/jansi/jansi-project/1.11/jansi-project-1.11.pom
(12 KB at 798.5 KB/sec)
2017-06-20T12:39:53.424 [INFO] Downloading: https://repo.maven.apache.org/maven2/org/fusesource/fusesource-pom/1.8/fusesource-pom-1.8.pom
2017-06-20T12:39:53.436 [INFO] Downloaded: https://repo.maven.apache.org/maven2/org/fusesource/fusesource-pom/1.8/fusesource-pom-1.8.pom
(15 KB at 1192.6 KB/sec)
2017-06-20T12:39:53.452 [INFO] Downloading: https://repo.maven.apache.org/maven2/org/sonatype/gossip/gossip-slf4j/1.8/gossip-slf4j-1.8.jar
2017-06-20T12:39:53.452 [INFO] Downloading: https://repo.maven.apache.org/maven2/org/sonatype/gossip/gossip-bootstrap/1.8/gossip-bootstrap-1.8.jar
2017-06-20T12:39:53.452 [INFO] Downloading: https://repo.maven.apache.org/maven2/org/sonatype/gossip/gossip-core/1.8/gossip-core-1.8.jar
2017-06-20T12:39:53.454 [INFO] Downloading: https://repo.maven.apache.org/maven2/org/codehaus/plexus/plexus-classworlds/2.4.2/plexus-classworlds-2.4.2.jar
2017-06-20T12:39:53.454 [INFO] Downloading: https://repo.maven.apache.org/maven2/com/google/guava/guava/14.0.1/guava-14.0.1.jar
2017-06-20T12:39:53.467 [INFO] Downloaded: https://repo.maven.apache.org/maven2/org/sonatype/gossip/gossip-slf4j/1.8/gossip-slf4j-1.8.jar
(5 KB at 258.0 KB/sec)
2017-06-20T12:39:53.467 [INFO] Downloading: https://repo.maven.apache.org/maven2/org/codehaus/plexus/plexus-interpolation/1.16/plexus-interpolation-1.16.jar
2017-06-20T12:39:53.472 [INFO] Downloaded: https://repo.maven.apache.org/maven2/org/codehaus/plexus/plexus-classworlds/2.4.2/plexus-classworlds-2.4.2.jar
(46 KB at 2293.4 KB/sec)
2017-06-20T12:39:53.472 [INFO] Downloading: https://repo.maven.apache.org/maven2/org/eclipse/aether/aether-api/0.9.0.M2/aether-api-0.9.0.M2.jar
2017-06-20T12:39:53.473 [INFO] Downloaded: https://repo.maven.apache.org/maven2/org/sonatype/gossip/gossip-bootstrap/1.8/gossip-bootstrap-1.8.jar
(20 KB at 918.8 KB/sec)
2017-06-20T12:39:53.474 [INFO] Downloading: https://repo.maven.apache.org/maven2/org/codehaus/gmaven/gmaven-adapter-api/2.0/gmaven-adapter-api-2.0.jar
2017-06-20T12:39:53.477 [INFO] Downloaded: https://repo.maven.apache.org/maven2/org/sonatype/gossip/gossip-core/1.8/gossip-core-1.8.jar
(57 KB at 2258.4 KB/sec)
2017-06-20T12:39:53.477 [INFO] Downloading: https://repo.maven.apache.org/maven2/org/codehaus/gmaven/gmaven-adapter-impl/2.0/gmaven-adapter-impl-2.0.jar
2017-06-20T12:39:53.488 [INFO] Downloaded: https://repo.maven.apache.org/maven2/org/codehaus/plexus/plexus-interpolation/1.16/plexus-interpolation-1.16.jar
(60 KB at 1710.6 KB/sec)
2017-06-20T12:39:53.488 [INFO] Downloading: https://repo.maven.apache.org/maven2/org/codehaus/groovy/groovy-all/2.1.5/groovy-all-2.1.5.jar
2017-06-20T12:39:53.489 [INFO] Downloaded: https://repo.maven.apache.org/maven2/org/codehaus/gmaven/gmaven-adapter-api/2.0/gmaven-adapter-api-2.0.jar
(7 KB at 192.0 KB/sec)
2017-06-20T12:39:53.489 [INFO] Downloading: https://repo.maven.apache.org/maven2/org/apache/ant/ant/1.8.4/ant-1.8.4.jar
2017-06-20T12:39:53.490 [INFO] Downloaded: https://repo.maven.apache.org/maven2/org/codehaus/gmaven/gmaven-adapter-impl/2.0/gmaven-adapter-impl-2.0.jar
(16 KB at 426.8 KB/sec)
2017-06-20T12:39:53.490 [INFO] Downloading: https://repo.maven.apache.org/maven2/org/apache/ant/ant-launcher/1.8.4/ant-launcher-1.8.4.jar
2017-06-20T12:39:53.506 [INFO] Downloaded: https://repo.maven.apache.org/maven2/org/eclipse/aether/aether-api/0.9.0.M2/aether-api-0.9.0.M2.jar
(131 KB at 2468.3 KB/sec)
2017-06-20T12:39:53.506 [INFO] Downloading: https://repo.maven.apache.org/maven2/org/fusesource/jansi/jansi/1.11/jansi-1.11.jar
2017-06-20T12:39:53.527 [INFO] Downloaded: https://repo.maven.apache.org/maven2/org/apache/ant/ant-launcher/1.8.4/ant-launcher-1.8.4.jar
(18 KB at 243.2 KB/sec)
2017-06-20T12:39:53.533 [INFO] Downloaded: https://repo.maven.apache.org/maven2/org/fusesource/jansi/jansi/1.11/jansi-1.11.jar
(112 KB at 1396.7 KB/sec)
2017-06-20T12:39:53.665 [INFO] Downloaded: https://repo.maven.apache.org/maven2/com/google/guava/guava/14.0.1/guava-14.0.1.jar
(2138 KB at 10036.7 KB/sec)
2017-06-20T12:39:53.684 [INFO] Downloaded: https://repo.maven.apache.org/maven2/org/apache/ant/ant/1.8.4/ant-1.8.4.jar
(1897 KB at 8208.8 KB/sec)
2017-06-20T12:39:54.098 [INFO] Downloaded: https://repo.maven.apache.org/maven2/org/codehaus/groovy/groovy-all/2.1.5/groovy-all-2.1.5.jar
(6219 KB at 9640.7 KB/sec)
[JENKINS] Archiving disabled
2017-06-20T12:39:57.499 [INFO]                                                           
             
2017-06-20T12:39:57.499 [INFO] ------------------------------------------------------------------------
2017-06-20T12:39:57.499 [INFO] Skipping Apache Beam :: Parent
2017-06-20T12:39:57.499 [INFO] This project has been banned from the build due to previous
failures.
2017-06-20T12:39:57.499 [INFO] ------------------------------------------------------------------------
[JENKINS] Archiving disabled
[JENKINS] Archiving disabled
[JENKINS] Archiving disabled
[JENKINS] Archiving disabled
[JENKINS] Archiving disabled
[JENKINS] Archiving disabled
[JENKINS] Archiving disabled
[JENKINS] Archiving disabled
[JENKINS] Archiving disabled
[JENKINS] Archiving disabled
[JENKINS] Archiving disabled
[JENKINS] Archiving disabled
[JENKINS] Archiving disabled
[JENKINS] Archiving disabled
[JENKINS] Archiving disabled
[JENKINS] Archiving disabled
[JENKINS] Archiving disabled
[JENKINS] Archiving disabled
[JENKINS] Archiving disabled
[JENKINS] Archiving disabled
[JENKINS] Archiving disabled
[JENKINS] Archiving disabled
[JENKINS] Archiving disabled
[JENKINS] Archiving disabled
[JENKINS] Archiving disabled
[JENKINS] Archiving disabled
[JENKINS] Archiving disabled
[JENKINS] Archiving disabled
[JENKINS] Archiving disabled
[JENKINS] Archiving disabled
[JENKINS] Archiving disabled
[JENKINS] Archiving disabled
[JENKINS] Archiving disabled
[JENKINS] Archiving disabled
[JENKINS] Archiving disabled
[JENKINS] Archiving disabled
[JENKINS] Archiving disabled
[JENKINS] Archiving disabled
[JENKINS] Archiving disabled
[JENKINS] Archiving disabled
[JENKINS] Archiving disabled
[JENKINS] Archiving disabled
[JENKINS] Archiving disabled
[JENKINS] Archiving disabled
[JENKINS] Archiving disabled
[JENKINS] Archiving disabled
[JENKINS] Archiving disabled
[JENKINS] Archiving disabled
[JENKINS] Archiving disabled
[JENKINS] Archiving disabled
2017-06-20T12:41:04.122 [INFO] ------------------------------------------------------------------------
2017-06-20T12:41:04.122 [INFO] Reactor Summary:
2017-06-20T12:41:04.122 [INFO] 
2017-06-20T12:41:04.122 [INFO] Apache Beam :: Parent .............................. SUCCESS
[ 27.035 s]
2017-06-20T12:41:04.122 [INFO] Apache Beam :: SDKs :: Java :: Build Tools ......... SUCCESS
[ 17.474 s]
2017-06-20T12:41:04.122 [INFO] Apache Beam :: SDKs ................................ SUCCESS
[ 11.696 s]
2017-06-20T12:41:04.122 [INFO] Apache Beam :: SDKs :: Common ...................... SUCCESS
[  7.988 s]
2017-06-20T12:41:04.122 [INFO] Apache Beam :: SDKs :: Common :: Runner API ........ SUCCESS
[ 27.264 s]
2017-06-20T12:41:04.122 [INFO] Apache Beam :: SDKs :: Common :: Fn API ............ SUCCESS
[ 25.589 s]
2017-06-20T12:41:04.123 [INFO] Apache Beam :: SDKs :: Java ........................ SUCCESS
[  6.132 s]
2017-06-20T12:41:04.123 [INFO] Apache Beam :: SDKs :: Java :: Core ................ SUCCESS
[05:29 min]
2017-06-20T12:41:04.123 [INFO] Apache Beam :: Runners ............................. SUCCESS
[  7.149 s]
2017-06-20T12:41:04.123 [INFO] Apache Beam :: Runners :: Core Construction Java ... SUCCESS
[02:51 min]
2017-06-20T12:41:04.123 [INFO] Apache Beam :: Runners :: Core Java ................ SUCCESS
[01:36 min]
2017-06-20T12:41:04.123 [INFO] Apache Beam :: Runners :: Direct Java .............. SUCCESS
[03:52 min]
2017-06-20T12:41:04.123 [INFO] Apache Beam :: SDKs :: Java :: IO .................. SUCCESS
[ 10.319 s]
2017-06-20T12:41:04.123 [INFO] Apache Beam :: SDKs :: Java :: IO :: Common ........ SUCCESS
[ 13.595 s]
2017-06-20T12:41:04.123 [INFO] Apache Beam :: SDKs :: Java :: IO :: Cassandra ..... SUCCESS
[ 40.299 s]
2017-06-20T12:41:04.123 [INFO] Apache Beam :: SDKs :: Java :: IO :: Elasticsearch . SUCCESS
[ 54.873 s]
2017-06-20T12:41:04.123 [INFO] Apache Beam :: SDKs :: Java :: Extensions .......... SUCCESS
[  5.822 s]
2017-06-20T12:41:04.123 [INFO] Apache Beam :: SDKs :: Java :: Extensions :: Google Cloud Platform
Core SUCCESS [ 56.908 s]
2017-06-20T12:41:04.123 [INFO] Apache Beam :: SDKs :: Java :: Extensions :: Protobuf SUCCESS
[ 33.343 s]
2017-06-20T12:41:04.123 [INFO] Apache Beam :: SDKs :: Java :: IO :: Google Cloud Platform
SUCCESS [01:34 min]
2017-06-20T12:41:04.123 [INFO] Apache Beam :: SDKs :: Java :: IO :: Hadoop Common . SUCCESS
[ 31.429 s]
2017-06-20T12:41:04.123 [INFO] Apache Beam :: SDKs :: Java :: IO :: Hadoop File System SUCCESS
[ 44.579 s]
2017-06-20T12:41:04.123 [INFO] Apache Beam :: SDKs :: Java :: IO :: Hadoop ........ SUCCESS
[ 10.033 s]
2017-06-20T12:41:04.123 [INFO] Apache Beam :: SDKs :: Java :: IO :: Hadoop :: input-format
SUCCESS [ 35.282 s]
2017-06-20T12:41:04.123 [INFO] Apache Beam :: SDKs :: Java :: IO :: Hadoop :: jdk1.8-tests
SUCCESS [01:46 min]
2017-06-20T12:41:04.124 [INFO] Apache Beam :: SDKs :: Java :: IO :: HBase ......... SUCCESS
[ 40.980 s]
2017-06-20T12:41:04.124 [INFO] Apache Beam :: SDKs :: Java :: IO :: HCatalog ...... SUCCESS
[01:07 min]
2017-06-20T12:41:04.124 [INFO] Apache Beam :: SDKs :: Java :: IO :: JDBC .......... SUCCESS
[ 38.654 s]
2017-06-20T12:41:04.124 [INFO] Apache Beam :: SDKs :: Java :: IO :: JMS ........... SUCCESS
[ 33.560 s]
2017-06-20T12:41:04.124 [INFO] Apache Beam :: SDKs :: Java :: IO :: Kafka ......... SUCCESS
[ 45.760 s]
2017-06-20T12:41:04.124 [INFO] Apache Beam :: SDKs :: Java :: IO :: Kinesis ....... SUCCESS
[ 37.829 s]
2017-06-20T12:41:04.124 [INFO] Apache Beam :: SDKs :: Java :: IO :: MongoDB ....... SUCCESS
[ 51.871 s]
2017-06-20T12:41:04.124 [INFO] Apache Beam :: SDKs :: Java :: IO :: MQTT .......... SUCCESS
[ 31.446 s]
2017-06-20T12:41:04.124 [INFO] Apache Beam :: SDKs :: Java :: IO :: XML ........... SUCCESS
[ 31.588 s]
2017-06-20T12:41:04.124 [INFO] Apache Beam :: SDKs :: Java :: Maven Archetypes .... SUCCESS
[  7.814 s]
2017-06-20T12:41:04.124 [INFO] Apache Beam :: SDKs :: Java :: Maven Archetypes :: Starter
SUCCESS [ 27.072 s]
2017-06-20T12:41:04.124 [INFO] Apache Beam :: SDKs :: Java :: Extensions :: Jackson SUCCESS
[ 29.119 s]
2017-06-20T12:41:04.124 [INFO] Apache Beam :: SDKs :: Java :: Extensions :: Join library SUCCESS
[ 29.524 s]
2017-06-20T12:41:04.124 [INFO] Apache Beam :: SDKs :: Java :: Extensions :: Sorter  SUCCESS
[ 39.169 s]
2017-06-20T12:41:04.124 [INFO] Apache Beam :: Runners :: Google Cloud Dataflow .... SUCCESS
[ 53.111 s]
2017-06-20T12:41:04.124 [INFO] Apache Beam :: SDKs :: Java :: Harness ............. SUCCESS
[ 58.143 s]
2017-06-20T12:41:04.124 [INFO] Apache Beam :: SDKs :: Java :: Java 8 Tests ........ SUCCESS
[ 23.806 s]
2017-06-20T12:41:04.125 [INFO] Apache Beam :: SDKs :: Python ...................... FAILURE
[  3.461 s]
2017-06-20T12:41:04.125 [INFO] Apache Beam :: Runners :: Flink .................... SKIPPED
2017-06-20T12:41:04.125 [INFO] Apache Beam :: Runners :: Spark .................... SKIPPED
2017-06-20T12:41:04.125 [INFO] Apache Beam :: Runners :: Apex ..................... SKIPPED
2017-06-20T12:41:04.125 [INFO] Apache Beam :: Examples ............................ SKIPPED
2017-06-20T12:41:04.125 [INFO] Apache Beam :: Examples :: Java .................... SKIPPED
2017-06-20T12:41:04.125 [INFO] Apache Beam :: Examples :: Java 8 .................. SKIPPED
2017-06-20T12:41:04.125 [INFO] Apache Beam :: SDKs :: Java :: Aggregated Javadoc .. SKIPPED
2017-06-20T12:41:04.125 [INFO] ------------------------------------------------------------------------
2017-06-20T12:41:04.125 [INFO] BUILD FAILURE
2017-06-20T12:41:04.125 [INFO] ------------------------------------------------------------------------
2017-06-20T12:41:04.125 [INFO] Total time: 39:17 min
2017-06-20T12:41:04.125 [INFO] Finished at: 2017-06-20T12:41:04+00:00
2017-06-20T12:41:05.399 [INFO] Final Memory: 356M/2812M
2017-06-20T12:41:05.400 [INFO] ------------------------------------------------------------------------
Waiting for Jenkins to finish collecting data
2017-06-20T12:41:09.972 [ERROR] Failed to execute goal org.codehaus.gmaven:groovy-maven-plugin:2.0:execute
(find-supported-python-for-clean) on project beam-sdks-python: Unable to find Python 2.7 in
path -> [Help 1]
org.apache.maven.lifecycle.LifecycleExecutionException: Failed to execute goal org.codehaus.gmaven:groovy-maven-plugin:2.0:execute
(find-supported-python-for-clean) on project beam-sdks-python: Unable to find Python 2.7 in
path
	at org.apache.maven.lifecycle.internal.MojoExecutor.execute(MojoExecutor.java:212)
	at org.apache.maven.lifecycle.internal.MojoExecutor.execute(MojoExecutor.java:153)
	at org.apache.maven.lifecycle.internal.MojoExecutor.execute(MojoExecutor.java:145)
	at org.apache.maven.lifecycle.internal.LifecycleModuleBuilder.buildProject(LifecycleModuleBuilder.java:116)
	at org.apache.maven.lifecycle.internal.LifecycleModuleBuilder.buildProject(LifecycleModuleBuilder.java:80)
	at org.apache.maven.lifecycle.internal.builder.singlethreaded.SingleThreadedBuilder.build(SingleThreadedBuilder.java:51)
	at org.apache.maven.lifecycle.internal.LifecycleStarter.execute(LifecycleStarter.java:128)
	at org.apache.maven.DefaultMaven.doExecute(DefaultMaven.java:307)
	at org.apache.maven.DefaultMaven.doExecute(DefaultMaven.java:193)
	at org.apache.maven.DefaultMaven.execute(DefaultMaven.java:106)
	at org.jvnet.hudson.maven3.launcher.Maven33Launcher.main(Maven33Launcher.java:129)
	at sun.reflect.NativeMethodAccessorImpl.invoke0(Native Method)
	at sun.reflect.NativeMethodAccessorImpl.invoke(NativeMethodAccessorImpl.java:62)
	at sun.reflect.DelegatingMethodAccessorImpl.invoke(DelegatingMethodAccessorImpl.java:43)
	at java.lang.reflect.Method.invoke(Method.java:498)
	at org.codehaus.plexus.classworlds.launcher.Launcher.launchStandard(Launcher.java:330)
	at org.codehaus.plexus.classworlds.launcher.Launcher.launch(Launcher.java:238)
	at jenkins.maven3.agent.Maven33Main.launch(Maven33Main.java:176)
	at sun.reflect.NativeMethodAccessorImpl.invoke0(Native Method)
	at sun.reflect.NativeMethodAccessorImpl.invoke(NativeMethodAccessorImpl.java:62)
	at sun.reflect.DelegatingMethodAccessorImpl.invoke(DelegatingMethodAccessorImpl.java:43)
	at java.lang.reflect.Method.invoke(Method.java:498)
	at hudson.maven.Maven3Builder.call(Maven3Builder.java:139)
	at hudson.maven.Maven3Builder.call(Maven3Builder.java:70)
	at hudson.remoting.UserRequest.perform(UserRequest.java:120)
	at hudson.remoting.UserRequest.perform(UserRequest.java:48)
	at hudson.remoting.Request$2.run(Request.java:326)
	at hudson.remoting.InterceptingExecutorService$1.call(InterceptingExecutorService.java:68)
	at java.util.concurrent.FutureTask.run(FutureTask.java:266)
	at java.util.concurrent.ThreadPoolExecutor.runWorker(ThreadPoolExecutor.java:1142)
	at java.util.concurrent.ThreadPoolExecutor$Worker.run(ThreadPoolExecutor.java:617)
	at java.lang.Thread.run(Thread.java:745)
Caused by: org.apache.maven.plugin.MojoFailureException: Unable to find Python 2.7 in path
	at sun.reflect.NativeConstructorAccessorImpl.newInstance0(Native Method)
	at sun.reflect.NativeConstructorAccessorImpl.newInstance(NativeConstructorAccessorImpl.java:62)
	at sun.reflect.DelegatingConstructorAccessorImpl.newInstance(DelegatingConstructorAccessorImpl.java:45)
	at java.lang.reflect.Constructor.newInstance(Constructor.java:423)
	at org.codehaus.groovy.reflection.CachedConstructor.invoke(CachedConstructor.java:77)
	at org.codehaus.groovy.runtime.callsite.ConstructorSite$ConstructorSiteNoUnwrapNoCoerce.callConstructor(ConstructorSite.java:102)
	at org.codehaus.groovy.runtime.callsite.CallSiteArray.defaultCallConstructor(CallSiteArray.java:57)
	at org.codehaus.groovy.runtime.callsite.AbstractCallSite.callConstructor(AbstractCallSite.java:182)
	at org.codehaus.groovy.runtime.callsite.AbstractCallSite.callConstructor(AbstractCallSite.java:190)
	at findSupportedPython.run(findSupportedPython.groovy:70)
	at groovy.lang.GroovyShell.evaluate(GroovyShell.java:518)
	at org.codehaus.gmaven.adapter.impl.ScriptExecutorImpl.execute(ScriptExecutorImpl.java:80)
	at org.codehaus.gmaven.plugin.ExecuteMojo$1.run(ExecuteMojo.java:100)
	at org.codehaus.gmaven.plugin.util.SystemNoExitGuard.run(SystemNoExitGuard.java:45)
	at org.codehaus.gmaven.plugin.ExecuteMojo.run(ExecuteMojo.java:96)
	at org.codehaus.gmaven.plugin.MojoSupport.execute(MojoSupport.java:45)
	at org.apache.maven.plugin.DefaultBuildPluginManager.executeMojo(DefaultBuildPluginManager.java:134)
	at org.apache.maven.lifecycle.internal.MojoExecutor.execute(MojoExecutor.java:208)
	... 31 more
2017-06-20T12:41:09.976 [ERROR] 
2017-06-20T12:41:09.976 [ERROR] Re-run Maven using the -X switch to enable full debug logging.
2017-06-20T12:41:09.976 [ERROR] 
2017-06-20T12:41:09.976 [ERROR] For more information about the errors and possible solutions,
please read the following articles:
2017-06-20T12:41:09.976 [ERROR] [Help 1] http://cwiki.apache.org/confluence/display/MAVEN/MojoFailureException
2017-06-20T12:41:09.977 [ERROR] 
2017-06-20T12:41:09.977 [ERROR] After correcting the problems, you can resume the build with
the command
2017-06-20T12:41:09.977 [ERROR]   mvn <goals> -rf :beam-sdks-python
channel stopped
Not sending mail to unregistered user aljoscha.krettek@gmail.com
Not sending mail to unregistered user github@nakomis.com
Not sending mail to unregistered user hepei.hp@alibaba-inc.com
Not sending mail to unregistered user sourabhbajaj@google.com
Not sending mail to unregistered user klk@google.com
Not sending mail to unregistered user ccy@google.com
Not sending mail to unregistered user kirpichov@google.com
Not sending mail to unregistered user mingmxu@ebay.com

Mime
View raw message