beam-commits mailing list archives

Site index · List index
Message view « Date » · « Thread »
Top « Date » · « Thread »
From Apache Jenkins Server <jenk...@builds.apache.org>
Subject Build failed in Jenkins: beam_PostCommit_Java_ValidatesRunner_Spark #2242
Date Fri, 02 Jun 2017 12:02:33 GMT
See <https://builds.apache.org/job/beam_PostCommit_Java_ValidatesRunner_Spark/2242/display/redirect>

------------------------------------------
[...truncated 68.06 KB...]
2017-06-02T12:02:12.693 [INFO] Downloaded: https://repo.maven.apache.org/maven2/org/beanshell/beanshell/2.0b4/beanshell-2.0b4.pom
(2 KB at 53.0 KB/sec)
2017-06-02T12:02:12.695 [INFO] Downloading: https://repo.maven.apache.org/maven2/org/codehaus/plexus/plexus-i18n/1.0-beta-6/plexus-i18n-1.0-beta-6.pom
2017-06-02T12:02:12.720 [INFO] Downloaded: https://repo.maven.apache.org/maven2/org/codehaus/plexus/plexus-i18n/1.0-beta-6/plexus-i18n-1.0-beta-6.pom
(771 B at 30.1 KB/sec)
2017-06-02T12:02:12.722 [INFO] Downloading: https://repo.maven.apache.org/maven2/org/codehaus/plexus/plexus-components/1.1.4/plexus-components-1.1.4.pom
2017-06-02T12:02:12.748 [INFO] Downloaded: https://repo.maven.apache.org/maven2/org/codehaus/plexus/plexus-components/1.1.4/plexus-components-1.1.4.pom
(3 KB at 77.8 KB/sec)
2017-06-02T12:02:12.750 [INFO] Downloading: https://repo.maven.apache.org/maven2/org/codehaus/plexus/plexus-container-default/1.0-alpha-8/plexus-container-default-1.0-alpha-8.pom
2017-06-02T12:02:12.777 [INFO] Downloaded: https://repo.maven.apache.org/maven2/org/codehaus/plexus/plexus-container-default/1.0-alpha-8/plexus-container-default-1.0-alpha-8.pom
(8 KB at 262.7 KB/sec)
2017-06-02T12:02:12.779 [INFO] Downloading: https://repo.maven.apache.org/maven2/org/apache/maven/plugin-testing/maven-plugin-testing-harness/1.3/maven-plugin-testing-harness-1.3.pom
2017-06-02T12:02:12.806 [INFO] Downloaded: https://repo.maven.apache.org/maven2/org/apache/maven/plugin-testing/maven-plugin-testing-harness/1.3/maven-plugin-testing-harness-1.3.pom
(4 KB at 124.7 KB/sec)
2017-06-02T12:02:12.808 [INFO] Downloading: https://repo.maven.apache.org/maven2/org/apache/maven/plugin-testing/maven-plugin-testing/1.3/maven-plugin-testing-1.3.pom
2017-06-02T12:02:12.833 [INFO] Downloaded: https://repo.maven.apache.org/maven2/org/apache/maven/plugin-testing/maven-plugin-testing/1.3/maven-plugin-testing-1.3.pom
(10 KB at 358.0 KB/sec)
2017-06-02T12:02:12.837 [INFO] Downloading: https://repo.maven.apache.org/maven2/org/codehaus/plexus/plexus-archiver/2.2/plexus-archiver-2.2.pom
2017-06-02T12:02:12.862 [INFO] Downloaded: https://repo.maven.apache.org/maven2/org/codehaus/plexus/plexus-archiver/2.2/plexus-archiver-2.2.pom
(4 KB at 125.5 KB/sec)
2017-06-02T12:02:12.864 [INFO] Downloading: https://repo.maven.apache.org/maven2/org/codehaus/plexus/plexus-components/1.1.20/plexus-components-1.1.20.pom
2017-06-02T12:02:12.890 [INFO] Downloaded: https://repo.maven.apache.org/maven2/org/codehaus/plexus/plexus-components/1.1.20/plexus-components-1.1.20.pom
(3 KB at 113.3 KB/sec)
2017-06-02T12:02:12.892 [INFO] Downloading: https://repo.maven.apache.org/maven2/org/codehaus/plexus/plexus/3.1/plexus-3.1.pom
2017-06-02T12:02:12.919 [INFO] Downloaded: https://repo.maven.apache.org/maven2/org/codehaus/plexus/plexus/3.1/plexus-3.1.pom
(19 KB at 673.3 KB/sec)
2017-06-02T12:02:12.923 [INFO] Downloading: https://repo.maven.apache.org/maven2/org/codehaus/plexus/plexus-io/2.0.4/plexus-io-2.0.4.pom
2017-06-02T12:02:12.949 [INFO] Downloaded: https://repo.maven.apache.org/maven2/org/codehaus/plexus/plexus-io/2.0.4/plexus-io-2.0.4.pom
(2 KB at 65.1 KB/sec)
2017-06-02T12:02:12.951 [INFO] Downloading: https://repo.maven.apache.org/maven2/org/codehaus/plexus/plexus-components/1.1.19/plexus-components-1.1.19.pom
2017-06-02T12:02:12.976 [INFO] Downloaded: https://repo.maven.apache.org/maven2/org/codehaus/plexus/plexus-components/1.1.19/plexus-components-1.1.19.pom
(3 KB at 109.8 KB/sec)
2017-06-02T12:02:12.977 [INFO] Downloading: https://repo.maven.apache.org/maven2/org/codehaus/plexus/plexus/3.0.1/plexus-3.0.1.pom
2017-06-02T12:02:13.005 [INFO] Downloaded: https://repo.maven.apache.org/maven2/org/codehaus/plexus/plexus/3.0.1/plexus-3.0.1.pom
(19 KB at 649.2 KB/sec)
2017-06-02T12:02:13.016 [INFO] Downloading: https://repo.maven.apache.org/maven2/org/codehaus/mojo/extra-enforcer-rules/1.0-beta-6/extra-enforcer-rules-1.0-beta-6.jar
2017-06-02T12:02:13.016 [INFO] Downloading: https://repo.maven.apache.org/maven2/org/apache/maven/maven-model/2.0.9/maven-model-2.0.9.jar
2017-06-02T12:02:13.017 [INFO] Downloading: https://repo.maven.apache.org/maven2/org/apache/maven/shared/maven-dependency-tree/2.2/maven-dependency-tree-2.2.jar
2017-06-02T12:02:13.017 [INFO] Downloading: https://repo.maven.apache.org/maven2/org/eclipse/aether/aether-util/0.9.0.M2/aether-util-0.9.0.M2.jar
2017-06-02T12:02:13.018 [INFO] Downloading: https://repo.maven.apache.org/maven2/org/codehaus/plexus/plexus-container-default/1.0-alpha-9/plexus-container-default-1.0-alpha-9.jar
2017-06-02T12:02:13.053 [INFO] Downloaded: https://repo.maven.apache.org/maven2/org/apache/maven/maven-model/2.0.9/maven-model-2.0.9.jar
(86 KB at 2304.7 KB/sec)
2017-06-02T12:02:13.054 [INFO] Downloading: https://repo.maven.apache.org/maven2/org/apache/maven/shared/maven-common-artifact-filters/1.4/maven-common-artifact-filters-1.4.jar
2017-06-02T12:02:13.054 [INFO] Downloaded: https://repo.maven.apache.org/maven2/org/apache/maven/shared/maven-dependency-tree/2.2/maven-dependency-tree-2.2.jar
(63 KB at 1633.6 KB/sec)
2017-06-02T12:02:13.054 [INFO] Downloading: https://repo.maven.apache.org/maven2/com/ibm/icu/icu4j/56.1/icu4j-56.1.jar
2017-06-02T12:02:13.055 [INFO] Downloaded: https://repo.maven.apache.org/maven2/org/codehaus/mojo/extra-enforcer-rules/1.0-beta-6/extra-enforcer-rules-1.0-beta-6.jar
(36 KB at 912.7 KB/sec)
2017-06-02T12:02:13.055 [INFO] Downloading: https://repo.maven.apache.org/maven2/org/apache/maven/maven-artifact/2.2.1/maven-artifact-2.2.1.jar
2017-06-02T12:02:13.069 [INFO] Downloaded: https://repo.maven.apache.org/maven2/org/codehaus/plexus/plexus-container-default/1.0-alpha-9/plexus-container-default-1.0-alpha-9.jar
(191 KB at 3669.5 KB/sec)
2017-06-02T12:02:13.069 [INFO] Downloading: https://repo.maven.apache.org/maven2/org/apache/maven/maven-plugin-api/2.2.1/maven-plugin-api-2.2.1.jar
2017-06-02T12:02:13.073 [INFO] Downloaded: https://repo.maven.apache.org/maven2/org/eclipse/aether/aether-util/0.9.0.M2/aether-util-0.9.0.M2.jar
(131 KB at 2329.6 KB/sec)
2017-06-02T12:02:13.073 [INFO] Downloading: https://repo.maven.apache.org/maven2/org/apache/maven/maven-project/2.2.1/maven-project-2.2.1.jar
2017-06-02T12:02:13.084 [INFO] Downloaded: https://repo.maven.apache.org/maven2/org/apache/maven/shared/maven-common-artifact-filters/1.4/maven-common-artifact-filters-1.4.jar
(31 KB at 467.5 KB/sec)
2017-06-02T12:02:13.084 [INFO] Downloading: https://repo.maven.apache.org/maven2/org/apache/maven/maven-settings/2.2.1/maven-settings-2.2.1.jar
2017-06-02T12:02:13.091 [INFO] Downloaded: https://repo.maven.apache.org/maven2/org/apache/maven/maven-artifact/2.2.1/maven-artifact-2.2.1.jar
(79 KB at 1074.5 KB/sec)
2017-06-02T12:02:13.091 [INFO] Downloading: https://repo.maven.apache.org/maven2/org/apache/maven/maven-profile/2.2.1/maven-profile-2.2.1.jar
2017-06-02T12:02:13.096 [INFO] Downloaded: https://repo.maven.apache.org/maven2/org/apache/maven/maven-plugin-api/2.2.1/maven-plugin-api-2.2.1.jar
(13 KB at 154.9 KB/sec)
2017-06-02T12:02:13.097 [INFO] Downloading: https://repo.maven.apache.org/maven2/org/apache/maven/maven-artifact-manager/2.2.1/maven-artifact-manager-2.2.1.jar
2017-06-02T12:02:13.115 [INFO] Downloaded: https://repo.maven.apache.org/maven2/org/apache/maven/maven-settings/2.2.1/maven-settings-2.2.1.jar
(48 KB at 493.7 KB/sec)
2017-06-02T12:02:13.115 [INFO] Downloading: https://repo.maven.apache.org/maven2/backport-util-concurrent/backport-util-concurrent/3.1/backport-util-concurrent-3.1.jar
2017-06-02T12:02:13.120 [INFO] Downloaded: https://repo.maven.apache.org/maven2/org/apache/maven/maven-profile/2.2.1/maven-profile-2.2.1.jar
(35 KB at 338.6 KB/sec)
2017-06-02T12:02:13.120 [INFO] Downloading: https://repo.maven.apache.org/maven2/org/apache/maven/maven-plugin-registry/2.2.1/maven-plugin-registry-2.2.1.jar
2017-06-02T12:02:13.124 [INFO] Downloaded: https://repo.maven.apache.org/maven2/org/apache/maven/maven-project/2.2.1/maven-project-2.2.1.jar
(153 KB at 1439.8 KB/sec)
2017-06-02T12:02:13.124 [INFO] Downloading: https://repo.maven.apache.org/maven2/org/codehaus/plexus/plexus-interpolation/1.11/plexus-interpolation-1.11.jar
2017-06-02T12:02:13.135 [INFO] Downloaded: https://repo.maven.apache.org/maven2/org/apache/maven/maven-artifact-manager/2.2.1/maven-artifact-manager-2.2.1.jar
(66 KB at 564.0 KB/sec)
2017-06-02T12:02:13.135 [INFO] Downloading: https://repo.maven.apache.org/maven2/org/apache/maven/maven-core/2.2.1/maven-core-2.2.1.jar
2017-06-02T12:02:13.153 [INFO] Downloaded: https://repo.maven.apache.org/maven2/org/apache/maven/maven-plugin-registry/2.2.1/maven-plugin-registry-2.2.1.jar
(30 KB at 214.9 KB/sec)
2017-06-02T12:02:13.153 [INFO] Downloading: https://repo.maven.apache.org/maven2/org/apache/maven/maven-plugin-parameter-documenter/2.2.1/maven-plugin-parameter-documenter-2.2.1.jar
2017-06-02T12:02:13.160 [INFO] Downloaded: https://repo.maven.apache.org/maven2/org/codehaus/plexus/plexus-interpolation/1.11/plexus-interpolation-1.11.jar
(50 KB at 350.3 KB/sec)
2017-06-02T12:02:13.160 [INFO] Downloading: https://repo.maven.apache.org/maven2/org/slf4j/slf4j-jdk14/1.5.6/slf4j-jdk14-1.5.6.jar
2017-06-02T12:02:13.171 [INFO] Downloaded: https://repo.maven.apache.org/maven2/backport-util-concurrent/backport-util-concurrent/3.1/backport-util-concurrent-3.1.jar
(324 KB at 2117.3 KB/sec)
2017-06-02T12:02:13.171 [INFO] Downloading: https://repo.maven.apache.org/maven2/org/slf4j/slf4j-api/1.5.6/slf4j-api-1.5.6.jar
2017-06-02T12:02:13.182 [INFO] Downloaded: https://repo.maven.apache.org/maven2/org/apache/maven/maven-plugin-parameter-documenter/2.2.1/maven-plugin-parameter-documenter-2.2.1.jar
(22 KB at 132.1 KB/sec)
2017-06-02T12:02:13.182 [INFO] Downloading: https://repo.maven.apache.org/maven2/org/slf4j/jcl-over-slf4j/1.5.6/jcl-over-slf4j-1.5.6.jar
2017-06-02T12:02:13.190 [INFO] Downloaded: https://repo.maven.apache.org/maven2/org/apache/maven/maven-core/2.2.1/maven-core-2.2.1.jar
(174 KB at 1010.0 KB/sec)
2017-06-02T12:02:13.190 [INFO] Downloading: https://repo.maven.apache.org/maven2/org/apache/maven/reporting/maven-reporting-api/2.2.1/maven-reporting-api-2.2.1.jar
2017-06-02T12:02:13.194 [INFO] Downloaded: https://repo.maven.apache.org/maven2/org/slf4j/slf4j-jdk14/1.5.6/slf4j-jdk14-1.5.6.jar
(9 KB at 48.9 KB/sec)
2017-06-02T12:02:13.194 [INFO] Downloading: https://repo.maven.apache.org/maven2/org/apache/maven/doxia/doxia-sink-api/1.1/doxia-sink-api-1.1.jar
2017-06-02T12:02:13.199 [INFO] Downloaded: https://repo.maven.apache.org/maven2/org/slf4j/slf4j-api/1.5.6/slf4j-api-1.5.6.jar
(22 KB at 121.2 KB/sec)
2017-06-02T12:02:13.199 [INFO] Downloading: https://repo.maven.apache.org/maven2/org/apache/maven/doxia/doxia-logging-api/1.1/doxia-logging-api-1.1.jar
2017-06-02T12:02:13.209 [INFO] Downloaded: https://repo.maven.apache.org/maven2/org/slf4j/jcl-over-slf4j/1.5.6/jcl-over-slf4j-1.5.6.jar
(17 KB at 85.5 KB/sec)
2017-06-02T12:02:13.209 [INFO] Downloading: https://repo.maven.apache.org/maven2/org/apache/maven/maven-repository-metadata/2.2.1/maven-repository-metadata-2.2.1.jar
2017-06-02T12:02:13.217 [INFO] Downloaded: https://repo.maven.apache.org/maven2/org/apache/maven/reporting/maven-reporting-api/2.2.1/maven-reporting-api-2.2.1.jar
(10 KB at 48.0 KB/sec)
2017-06-02T12:02:13.217 [INFO] Downloading: https://repo.maven.apache.org/maven2/org/apache/maven/maven-error-diagnostics/2.2.1/maven-error-diagnostics-2.2.1.jar
2017-06-02T12:02:13.223 [INFO] Downloaded: https://repo.maven.apache.org/maven2/org/apache/maven/doxia/doxia-sink-api/1.1/doxia-sink-api-1.1.jar
(13 KB at 61.3 KB/sec)
2017-06-02T12:02:13.223 [INFO] Downloading: https://repo.maven.apache.org/maven2/commons-cli/commons-cli/1.2/commons-cli-1.2.jar
2017-06-02T12:02:13.224 [INFO] Downloaded: https://repo.maven.apache.org/maven2/org/apache/maven/doxia/doxia-logging-api/1.1/doxia-logging-api-1.1.jar
(12 KB at 53.7 KB/sec)
2017-06-02T12:02:13.225 [INFO] Downloading: https://repo.maven.apache.org/maven2/org/apache/maven/maven-plugin-descriptor/2.2.1/maven-plugin-descriptor-2.2.1.jar
2017-06-02T12:02:13.239 [INFO] Downloaded: https://repo.maven.apache.org/maven2/org/apache/maven/maven-repository-metadata/2.2.1/maven-repository-metadata-2.2.1.jar
(26 KB at 113.4 KB/sec)
2017-06-02T12:02:13.239 [INFO] Downloading: https://repo.maven.apache.org/maven2/org/codehaus/plexus/plexus-interactivity-api/1.0-alpha-4/plexus-interactivity-api-1.0-alpha-4.jar
2017-06-02T12:02:13.244 [INFO] Downloaded: https://repo.maven.apache.org/maven2/org/apache/maven/maven-error-diagnostics/2.2.1/maven-error-diagnostics-2.2.1.jar
(13 KB at 56.3 KB/sec)
2017-06-02T12:02:13.244 [INFO] Downloading: https://repo.maven.apache.org/maven2/org/apache/maven/maven-monitor/2.2.1/maven-monitor-2.2.1.jar
2017-06-02T12:02:13.252 [INFO] Downloaded: https://repo.maven.apache.org/maven2/commons-cli/commons-cli/1.2/commons-cli-1.2.jar
(41 KB at 171.6 KB/sec)
2017-06-02T12:02:13.253 [INFO] Downloaded: https://repo.maven.apache.org/maven2/org/apache/maven/maven-plugin-descriptor/2.2.1/maven-plugin-descriptor-2.2.1.jar
(39 KB at 163.9 KB/sec)
2017-06-02T12:02:13.255 [INFO] Downloading: https://repo.maven.apache.org/maven2/classworlds/classworlds/1.1/classworlds-1.1.jar
2017-06-02T12:02:13.255 [INFO] Downloading: https://repo.maven.apache.org/maven2/org/sonatype/plexus/plexus-sec-dispatcher/1.3/plexus-sec-dispatcher-1.3.jar
2017-06-02T12:02:13.269 [INFO] Downloaded: https://repo.maven.apache.org/maven2/org/codehaus/plexus/plexus-interactivity-api/1.0-alpha-4/plexus-interactivity-api-1.0-alpha-4.jar
(14 KB at 52.2 KB/sec)
2017-06-02T12:02:13.270 [INFO] Downloading: https://repo.maven.apache.org/maven2/org/sonatype/plexus/plexus-cipher/1.4/plexus-cipher-1.4.jar
2017-06-02T12:02:13.273 [INFO] Downloaded: https://repo.maven.apache.org/maven2/org/apache/maven/maven-monitor/2.2.1/maven-monitor-2.2.1.jar
(11 KB at 40.2 KB/sec)
2017-06-02T12:02:13.273 [INFO] Downloading: https://repo.maven.apache.org/maven2/org/codehaus/plexus/plexus-utils/3.0.22/plexus-utils-3.0.22.jar
[INFO] I/O exception (java.net.SocketException) caught when processing request to {s}->https://repo.maven.apache.org:443:
Connection reset
[INFO] Retrying request to {s}->https://repo.maven.apache.org:443
[INFO] I/O exception (java.net.SocketException) caught when processing request to {s}->https://repo.maven.apache.org:443:
Connection reset
[INFO] Retrying request to {s}->https://repo.maven.apache.org:443
2017-06-02T12:02:13.298 [INFO] Downloaded: https://repo.maven.apache.org/maven2/org/sonatype/plexus/plexus-cipher/1.4/plexus-cipher-1.4.jar
(14 KB at 47.2 KB/sec)
2017-06-02T12:02:13.299 [INFO] Downloading: https://repo.maven.apache.org/maven2/commons-lang/commons-lang/2.3/commons-lang-2.3.jar
2017-06-02T12:02:13.345 [INFO] Downloaded: https://repo.maven.apache.org/maven2/org/codehaus/plexus/plexus-utils/3.0.22/plexus-utils-3.0.22.jar
(240 KB at 733.6 KB/sec)
2017-06-02T12:02:13.345 [INFO] Downloading: https://repo.maven.apache.org/maven2/org/apache/maven/enforcer/enforcer-api/1.4.1/enforcer-api-1.4.1.jar
2017-06-02T12:02:13.361 [INFO] Downloaded: https://repo.maven.apache.org/maven2/org/sonatype/plexus/plexus-sec-dispatcher/1.3/plexus-sec-dispatcher-1.3.jar
(28 KB at 81.5 KB/sec)
2017-06-02T12:02:13.362 [INFO] Downloading: https://repo.maven.apache.org/maven2/org/apache/maven/enforcer/enforcer-rules/1.4.1/enforcer-rules-1.4.1.jar
2017-06-02T12:02:13.365 [INFO] Downloaded: https://repo.maven.apache.org/maven2/classworlds/classworlds/1.1/classworlds-1.1.jar
(37 KB at 106.8 KB/sec)
2017-06-02T12:02:13.365 [INFO] Downloading: https://repo.maven.apache.org/maven2/org/beanshell/bsh/2.0b4/bsh-2.0b4.jar
2017-06-02T12:02:13.367 [INFO] Downloaded: https://repo.maven.apache.org/maven2/commons-lang/commons-lang/2.3/commons-lang-2.3.jar
(240 KB at 688.3 KB/sec)
2017-06-02T12:02:13.368 [INFO] Downloading: https://repo.maven.apache.org/maven2/org/codehaus/plexus/plexus-i18n/1.0-beta-6/plexus-i18n-1.0-beta-6.jar
2017-06-02T12:02:13.373 [INFO] Downloaded: https://repo.maven.apache.org/maven2/org/apache/maven/enforcer/enforcer-api/1.4.1/enforcer-api-1.4.1.jar
(12 KB at 31.3 KB/sec)
2017-06-02T12:02:13.373 [INFO] Downloading: https://repo.maven.apache.org/maven2/org/apache/maven/plugin-testing/maven-plugin-testing-harness/1.3/maven-plugin-testing-harness-1.3.jar
2017-06-02T12:02:13.386 [INFO] Downloading: https://repo.maven.apache.org/maven2/org/codehaus/plexus/plexus-archiver/2.2/plexus-archiver-2.2.jar
2017-06-02T12:02:13.395 [INFO] Downloaded: https://repo.maven.apache.org/maven2/org/codehaus/plexus/plexus-i18n/1.0-beta-6/plexus-i18n-1.0-beta-6.jar
(12 KB at 31.2 KB/sec)
2017-06-02T12:02:13.395 [INFO] Downloading: https://repo.maven.apache.org/maven2/org/codehaus/plexus/plexus-io/2.0.4/plexus-io-2.0.4.jar
2017-06-02T12:02:13.404 [INFO] Downloaded: https://repo.maven.apache.org/maven2/org/apache/maven/plugin-testing/maven-plugin-testing-harness/1.3/maven-plugin-testing-harness-1.3.jar
(35 KB at 89.6 KB/sec)
2017-06-02T12:02:13.404 [INFO] Downloading: https://repo.maven.apache.org/maven2/junit/junit/4.11/junit-4.11.jar
2017-06-02T12:02:13.421 [INFO] Downloaded: https://repo.maven.apache.org/maven2/org/apache/maven/enforcer/enforcer-rules/1.4.1/enforcer-rules-1.4.1.jar
(97 KB at 240.2 KB/sec)
2017-06-02T12:02:13.421 [INFO] Downloading: https://repo.maven.apache.org/maven2/org/hamcrest/hamcrest-core/1.3/hamcrest-core-1.3.jar
2017-06-02T12:02:13.435 [INFO] Downloaded: https://repo.maven.apache.org/maven2/org/codehaus/plexus/plexus-io/2.0.4/plexus-io-2.0.4.jar
(57 KB at 136.8 KB/sec)
2017-06-02T12:02:13.455 [INFO] Downloaded: https://repo.maven.apache.org/maven2/org/hamcrest/hamcrest-core/1.3/hamcrest-core-1.3.jar
(44 KB at 100.8 KB/sec)
2017-06-02T12:02:13.458 [INFO] Downloaded: https://repo.maven.apache.org/maven2/org/beanshell/bsh/2.0b4/bsh-2.0b4.jar
(276 KB at 628.1 KB/sec)
2017-06-02T12:02:13.463 [INFO] Downloaded: https://repo.maven.apache.org/maven2/junit/junit/4.11/junit-4.11.jar
(240 KB at 540.2 KB/sec)
2017-06-02T12:02:13.475 [INFO] Downloaded: https://repo.maven.apache.org/maven2/org/codehaus/plexus/plexus-archiver/2.2/plexus-archiver-2.2.jar
(181 KB at 396.1 KB/sec)
[WARNING] Failed to getClass for org.apache.maven.plugins.enforcer.EnforceMojo
[JENKINS] Archiving disabled
[JENKINS] Archiving disabled
[JENKINS] Archiving disabled
[JENKINS] Archiving disabled
[JENKINS] Archiving disabled
[JENKINS] Archiving disabled
[JENKINS] Archiving disabled
[JENKINS] Archiving disabled
[JENKINS] Archiving disabled
[JENKINS] Archiving disabled
[JENKINS] Archiving disabled
[JENKINS] Archiving disabled
[JENKINS] Archiving disabled
[JENKINS] Archiving disabled
[JENKINS] Archiving disabled
[JENKINS] Archiving disabled
2017-06-02T12:02:17.866 [INFO] ------------------------------------------------------------------------
2017-06-02T12:02:17.866 [INFO] Reactor Summary:
2017-06-02T12:02:17.866 [INFO] 
2017-06-02T12:02:17.866 [INFO] Apache Beam :: Parent .............................. FAILURE
[  8.423 s]
2017-06-02T12:02:17.866 [INFO] Apache Beam :: SDKs :: Java :: Build Tools ......... SKIPPED
2017-06-02T12:02:17.866 [INFO] Apache Beam :: SDKs ................................ SKIPPED
2017-06-02T12:02:17.866 [INFO] Apache Beam :: SDKs :: Common ...................... SKIPPED
2017-06-02T12:02:17.866 [INFO] Apache Beam :: SDKs :: Common :: Fn API ............ SKIPPED
2017-06-02T12:02:17.866 [INFO] Apache Beam :: SDKs :: Common :: Runner API ........ SKIPPED
2017-06-02T12:02:17.866 [INFO] Apache Beam :: SDKs :: Java ........................ SKIPPED
2017-06-02T12:02:17.866 [INFO] Apache Beam :: SDKs :: Java :: Core ................ SKIPPED
2017-06-02T12:02:17.866 [INFO] Apache Beam :: SDKs :: Java :: IO .................. SKIPPED
2017-06-02T12:02:17.866 [INFO] Apache Beam :: Runners ............................. SKIPPED
2017-06-02T12:02:17.866 [INFO] Apache Beam :: Runners :: Core Construction Java ... SKIPPED
2017-06-02T12:02:17.866 [INFO] Apache Beam :: Runners :: Core Java ................ SKIPPED
2017-06-02T12:02:17.866 [INFO] Apache Beam :: Runners :: Direct Java .............. SKIPPED
2017-06-02T12:02:17.866 [INFO] Apache Beam :: SDKs :: Java :: IO :: Kafka ......... SKIPPED
2017-06-02T12:02:17.866 [INFO] Apache Beam :: Runners :: Spark .................... SKIPPED
2017-06-02T12:02:17.866 [INFO] ------------------------------------------------------------------------
2017-06-02T12:02:17.866 [INFO] BUILD FAILURE
2017-06-02T12:02:17.866 [INFO] ------------------------------------------------------------------------
2017-06-02T12:02:17.866 [INFO] Total time: 49.991 s
2017-06-02T12:02:17.866 [INFO] Finished at: 2017-06-02T12:02:17+00:00
2017-06-02T12:02:18.143 [INFO] Final Memory: 45M/614M
2017-06-02T12:02:18.143 [INFO] ------------------------------------------------------------------------
2017-06-02T12:02:18.143 [WARNING] The requested profile "validates-runner-tests" could not
be activated because it does not exist.
Waiting for Jenkins to finish collecting data
2017-06-02T12:02:19.786 [ERROR] Failed to execute goal org.apache.maven.plugins:maven-enforcer-plugin:1.4.1:enforce
(enforce) on project beam-parent: Execution enforce of goal org.apache.maven.plugins:maven-enforcer-plugin:1.4.1:enforce
failed: Plugin org.apache.maven.plugins:maven-enforcer-plugin:1.4.1 or one of its dependencies
could not be resolved: Could not transfer artifact com.ibm.icu:icu4j:jar:56.1 from/to central
(https://repo.maven.apache.org/maven2): GET request of: com/ibm/icu/icu4j/56.1/icu4j-56.1.jar
from central failed: Connection reset -> [Help 1]
org.apache.maven.lifecycle.LifecycleExecutionException: Failed to execute goal org.apache.maven.plugins:maven-enforcer-plugin:1.4.1:enforce
(enforce) on project beam-parent: Execution enforce of goal org.apache.maven.plugins:maven-enforcer-plugin:1.4.1:enforce
failed: Plugin org.apache.maven.plugins:maven-enforcer-plugin:1.4.1 or one of its dependencies
could not be resolved: Could not transfer artifact com.ibm.icu:icu4j:jar:56.1 from/to central
(https://repo.maven.apache.org/maven2): GET request of: com/ibm/icu/icu4j/56.1/icu4j-56.1.jar
from central failed
	at org.apache.maven.lifecycle.internal.MojoExecutor.execute(MojoExecutor.java:224)
	at org.apache.maven.lifecycle.internal.MojoExecutor.execute(MojoExecutor.java:153)
	at org.apache.maven.lifecycle.internal.MojoExecutor.execute(MojoExecutor.java:145)
	at org.apache.maven.lifecycle.internal.LifecycleModuleBuilder.buildProject(LifecycleModuleBuilder.java:116)
	at org.apache.maven.lifecycle.internal.LifecycleModuleBuilder.buildProject(LifecycleModuleBuilder.java:80)
	at org.apache.maven.lifecycle.internal.builder.singlethreaded.SingleThreadedBuilder.build(SingleThreadedBuilder.java:51)
	at org.apache.maven.lifecycle.internal.LifecycleStarter.execute(LifecycleStarter.java:128)
	at org.apache.maven.DefaultMaven.doExecute(DefaultMaven.java:307)
	at org.apache.maven.DefaultMaven.doExecute(DefaultMaven.java:193)
	at org.apache.maven.DefaultMaven.execute(DefaultMaven.java:106)
	at org.jvnet.hudson.maven3.launcher.Maven33Launcher.main(Maven33Launcher.java:129)
	at sun.reflect.NativeMethodAccessorImpl.invoke0(Native Method)
	at sun.reflect.NativeMethodAccessorImpl.invoke(NativeMethodAccessorImpl.java:62)
	at sun.reflect.DelegatingMethodAccessorImpl.invoke(DelegatingMethodAccessorImpl.java:43)
	at java.lang.reflect.Method.invoke(Method.java:498)
	at org.codehaus.plexus.classworlds.launcher.Launcher.launchStandard(Launcher.java:330)
	at org.codehaus.plexus.classworlds.launcher.Launcher.launch(Launcher.java:238)
	at jenkins.maven3.agent.Maven33Main.launch(Maven33Main.java:176)
	at sun.reflect.NativeMethodAccessorImpl.invoke0(Native Method)
	at sun.reflect.NativeMethodAccessorImpl.invoke(NativeMethodAccessorImpl.java:62)
	at sun.reflect.DelegatingMethodAccessorImpl.invoke(DelegatingMethodAccessorImpl.java:43)
	at java.lang.reflect.Method.invoke(Method.java:498)
	at hudson.maven.Maven3Builder.call(Maven3Builder.java:139)
	at hudson.maven.Maven3Builder.call(Maven3Builder.java:70)
	at hudson.remoting.UserRequest.perform(UserRequest.java:153)
	at hudson.remoting.UserRequest.perform(UserRequest.java:50)
	at hudson.remoting.Request$2.run(Request.java:336)
	at hudson.remoting.InterceptingExecutorService$1.call(InterceptingExecutorService.java:68)
	at java.util.concurrent.FutureTask.run(FutureTask.java:266)
	at java.util.concurrent.ThreadPoolExecutor.runWorker(ThreadPoolExecutor.java:1142)
	at java.util.concurrent.ThreadPoolExecutor$Worker.run(ThreadPoolExecutor.java:617)
	at java.lang.Thread.run(Thread.java:745)
Caused by: org.apache.maven.plugin.PluginExecutionException: Execution enforce of goal org.apache.maven.plugins:maven-enforcer-plugin:1.4.1:enforce
failed: Plugin org.apache.maven.plugins:maven-enforcer-plugin:1.4.1 or one of its dependencies
could not be resolved: Could not transfer artifact com.ibm.icu:icu4j:jar:56.1 from/to central
(https://repo.maven.apache.org/maven2): GET request of: com/ibm/icu/icu4j/56.1/icu4j-56.1.jar
from central failed
	at org.apache.maven.plugin.DefaultBuildPluginManager.executeMojo(DefaultBuildPluginManager.java:106)
	at org.apache.maven.lifecycle.internal.MojoExecutor.execute(MojoExecutor.java:208)
	... 31 more
Caused by: org.apache.maven.plugin.PluginResolutionException: Plugin org.apache.maven.plugins:maven-enforcer-plugin:1.4.1
or one of its dependencies could not be resolved: Could not transfer artifact com.ibm.icu:icu4j:jar:56.1
from/to central (https://repo.maven.apache.org/maven2): GET request of: com/ibm/icu/icu4j/56.1/icu4j-56.1.jar
from central failed
	at org.apache.maven.plugin.internal.DefaultPluginDependenciesResolver.resolveInternal(DefaultPluginDependenciesResolver.java:218)
	at org.apache.maven.plugin.internal.DefaultPluginDependenciesResolver.resolve(DefaultPluginDependenciesResolver.java:149)
	at org.apache.maven.plugin.internal.DefaultMavenPluginManager.createPluginRealm(DefaultMavenPluginManager.java:422)
	at org.apache.maven.plugin.internal.DefaultMavenPluginManager.setupPluginRealm(DefaultMavenPluginManager.java:385)
	at org.apache.maven.plugin.DefaultBuildPluginManager.getPluginRealm(DefaultBuildPluginManager.java:231)
	at org.apache.maven.plugin.DefaultBuildPluginManager.executeMojo(DefaultBuildPluginManager.java:102)
	... 32 more
Caused by: org.eclipse.aether.resolution.ArtifactResolutionException: Could not transfer artifact
com.ibm.icu:icu4j:jar:56.1 from/to central (https://repo.maven.apache.org/maven2): GET request
of: com/ibm/icu/icu4j/56.1/icu4j-56.1.jar from central failed
	at org.eclipse.aether.internal.impl.DefaultArtifactResolver.resolve(DefaultArtifactResolver.java:444)
	at org.eclipse.aether.internal.impl.DefaultArtifactResolver.resolveArtifacts(DefaultArtifactResolver.java:246)
	at org.eclipse.aether.internal.impl.DefaultRepositorySystem.resolveDependencies(DefaultRepositorySystem.java:367)
	at org.apache.maven.plugin.internal.DefaultPluginDependenciesResolver.resolveInternal(DefaultPluginDependenciesResolver.java:210)
	... 37 more
Caused by: org.eclipse.aether.transfer.ArtifactTransferException: Could not transfer artifact
com.ibm.icu:icu4j:jar:56.1 from/to central (https://repo.maven.apache.org/maven2): GET request
of: com/ibm/icu/icu4j/56.1/icu4j-56.1.jar from central failed
	at org.eclipse.aether.connector.basic.ArtifactTransportListener.transferFailed(ArtifactTransportListener.java:43)
	at org.eclipse.aether.connector.basic.BasicRepositoryConnector$TaskRunner.run(BasicRepositoryConnector.java:355)
	at org.eclipse.aether.util.concurrency.RunnableErrorForwarder$1.run(RunnableErrorForwarder.java:67)
	... 3 more
Caused by: org.apache.maven.wagon.TransferFailedException: GET request of: com/ibm/icu/icu4j/56.1/icu4j-56.1.jar
from central failed
	at org.apache.maven.wagon.AbstractWagon.getTransfer(AbstractWagon.java:363)
	at org.apache.maven.wagon.AbstractWagon.getTransfer(AbstractWagon.java:316)
	at org.apache.maven.wagon.AbstractWagon.getTransfer(AbstractWagon.java:285)
	at org.apache.maven.wagon.StreamWagon.getIfNewer(StreamWagon.java:97)
	at org.apache.maven.wagon.StreamWagon.get(StreamWagon.java:61)
	at org.eclipse.aether.transport.wagon.WagonTransporter$GetTaskRunner.run(WagonTransporter.java:560)
	at org.eclipse.aether.transport.wagon.WagonTransporter.execute(WagonTransporter.java:427)
	at org.eclipse.aether.transport.wagon.WagonTransporter.get(WagonTransporter.java:404)
	at org.eclipse.aether.connector.basic.BasicRepositoryConnector$GetTaskRunner.runTask(BasicRepositoryConnector.java:447)
	at org.eclipse.aether.connector.basic.BasicRepositoryConnector$TaskRunner.run(BasicRepositoryConnector.java:350)
	... 4 more
Caused by: java.net.SocketException: Connection reset
	at java.net.SocketInputStream.read(SocketInputStream.java:210)
	at java.net.SocketInputStream.read(SocketInputStream.java:141)
	at sun.security.ssl.InputRecord.readFully(InputRecord.java:465)
	at sun.security.ssl.InputRecord.readV3Record(InputRecord.java:593)
	at sun.security.ssl.InputRecord.read(InputRecord.java:532)
	at sun.security.ssl.SSLSocketImpl.readRecord(SSLSocketImpl.java:973)
	at sun.security.ssl.SSLSocketImpl.readDataRecord(SSLSocketImpl.java:930)
	at sun.security.ssl.AppInputStream.read(AppInputStream.java:105)
	at org.apache.maven.wagon.providers.http.httpclient.impl.io.SessionInputBufferImpl.streamRead(SessionInputBufferImpl.java:136)
	at org.apache.maven.wagon.providers.http.httpclient.impl.io.SessionInputBufferImpl.read(SessionInputBufferImpl.java:195)
	at org.apache.maven.wagon.providers.http.httpclient.impl.io.ContentLengthInputStream.read(ContentLengthInputStream.java:178)
	at org.apache.maven.wagon.providers.http.httpclient.conn.EofSensorInputStream.read(EofSensorInputStream.java:137)
	at org.apache.maven.wagon.AbstractWagon.transfer(AbstractWagon.java:531)
	at org.apache.maven.wagon.AbstractWagon.getTransfer(AbstractWagon.java:353)
	... 13 more
2017-06-02T12:02:19.787 [ERROR] 
2017-06-02T12:02:19.787 [ERROR] Re-run Maven using the -X switch to enable full debug logging.
2017-06-02T12:02:19.787 [ERROR] 
2017-06-02T12:02:19.787 [ERROR] For more information about the errors and possible solutions,
please read the following articles:
2017-06-02T12:02:19.787 [ERROR] [Help 1] http://cwiki.apache.org/confluence/display/MAVEN/PluginResolutionException
channel stopped

Mime
View raw message