beam-commits mailing list archives

Site index · List index
Message view « Date » · « Thread »
Top « Date » · « Thread »
From Apache Jenkins Server <jenk...@builds.apache.org>
Subject Build failed in Jenkins: beam_PostCommit_Java_MavenInstall_Windows #102
Date Wed, 07 Jun 2017 00:45:33 GMT
See <https://builds.apache.org/job/beam_PostCommit_Java_MavenInstall_Windows/102/display/redirect?page=changes>

Changes:

[altay] Do not fail when gen_protos cannot be imported

[klk] Fix RawPTransform translation

[klk] Improve Splittable ParDo translation

[altay] Migrate Python tests to not depend on fix sharding for file output

[altay] soft-enable the use of streaming flag

[chamikara] [BEAM-2405] Write to BQ using the streaming API

[altay] Whitelist find for tox environments

[davor] Generate a random table name. Assume Spanner database exists.

[altay] Fix imports in sdk_worker.

[altay] Fix the staging directory path in copying from GCS

------------------------------------------
[...truncated 2.53 MB...]
2017-06-07T00:35:37.683 [INFO] 
2017-06-07T00:35:37.683 [INFO] --- groovy-maven-plugin:2.0:execute (find-supported-python-for-clean)
@ beam-sdks-python ---
2017-06-07T00:35:37.688 [INFO] Downloading: https://repo.maven.apache.org/maven2/org/sonatype/gossip/gossip-slf4j/1.8/gossip-slf4j-1.8.pom
2017-06-07T00:35:37.698 [INFO] Downloaded: https://repo.maven.apache.org/maven2/org/sonatype/gossip/gossip-slf4j/1.8/gossip-slf4j-1.8.pom
(2 KB at 144.7 KB/sec)
2017-06-07T00:35:37.701 [INFO] Downloading: https://repo.maven.apache.org/maven2/org/sonatype/gossip/gossip/1.8/gossip-1.8.pom
2017-06-07T00:35:37.714 [INFO] Downloaded: https://repo.maven.apache.org/maven2/org/sonatype/gossip/gossip/1.8/gossip-1.8.pom
(12 KB at 865.8 KB/sec)
2017-06-07T00:35:37.718 [INFO] Downloading: https://repo.maven.apache.org/maven2/org/sonatype/forge/forge-parent/9/forge-parent-9.pom
2017-06-07T00:35:37.726 [INFO] Downloaded: https://repo.maven.apache.org/maven2/org/sonatype/forge/forge-parent/9/forge-parent-9.pom
(13 KB at 1604.2 KB/sec)
2017-06-07T00:35:37.730 [INFO] Downloading: https://repo.maven.apache.org/maven2/org/sonatype/gossip/gossip-core/1.8/gossip-core-1.8.pom
2017-06-07T00:35:37.740 [INFO] Downloaded: https://repo.maven.apache.org/maven2/org/sonatype/gossip/gossip-core/1.8/gossip-core-1.8.pom
(3 KB at 217.3 KB/sec)
2017-06-07T00:35:37.744 [INFO] Downloading: https://repo.maven.apache.org/maven2/org/sonatype/gossip/gossip-bootstrap/1.8/gossip-bootstrap-1.8.pom
2017-06-07T00:35:37.754 [INFO] Downloaded: https://repo.maven.apache.org/maven2/org/sonatype/gossip/gossip-bootstrap/1.8/gossip-bootstrap-1.8.pom
(2 KB at 157.3 KB/sec)
2017-06-07T00:35:37.758 [INFO] Downloading: https://repo.maven.apache.org/maven2/com/google/guava/guava/14.0.1/guava-14.0.1.pom
2017-06-07T00:35:37.767 [INFO] Downloaded: https://repo.maven.apache.org/maven2/com/google/guava/guava/14.0.1/guava-14.0.1.pom
(6 KB at 583.3 KB/sec)
2017-06-07T00:35:37.770 [INFO] Downloading: https://repo.maven.apache.org/maven2/com/google/guava/guava-parent/14.0.1/guava-parent-14.0.1.pom
2017-06-07T00:35:37.778 [INFO] Downloaded: https://repo.maven.apache.org/maven2/com/google/guava/guava-parent/14.0.1/guava-parent-14.0.1.pom
(3 KB at 311.9 KB/sec)
2017-06-07T00:35:37.782 [INFO] Downloading: https://repo.maven.apache.org/maven2/org/codehaus/plexus/plexus-classworlds/2.4.2/plexus-classworlds-2.4.2.pom
2017-06-07T00:35:37.792 [INFO] Downloaded: https://repo.maven.apache.org/maven2/org/codehaus/plexus/plexus-classworlds/2.4.2/plexus-classworlds-2.4.2.pom
(4 KB at 342.7 KB/sec)
2017-06-07T00:35:37.797 [INFO] Downloading: https://repo.maven.apache.org/maven2/org/codehaus/plexus/plexus-interpolation/1.16/plexus-interpolation-1.16.pom
2017-06-07T00:35:37.805 [INFO] Downloaded: https://repo.maven.apache.org/maven2/org/codehaus/plexus/plexus-interpolation/1.16/plexus-interpolation-1.16.pom
(2 KB at 125.4 KB/sec)
2017-06-07T00:35:37.810 [INFO] Downloading: https://repo.maven.apache.org/maven2/org/eclipse/aether/aether-api/0.9.0.M2/aether-api-0.9.0.M2.pom
2017-06-07T00:35:37.819 [INFO] Downloaded: https://repo.maven.apache.org/maven2/org/eclipse/aether/aether-api/0.9.0.M2/aether-api-0.9.0.M2.pom
(2 KB at 188.5 KB/sec)
2017-06-07T00:35:37.823 [INFO] Downloading: https://repo.maven.apache.org/maven2/org/codehaus/gmaven/gmaven-adapter-api/2.0/gmaven-adapter-api-2.0.pom
2017-06-07T00:35:37.842 [INFO] Downloaded: https://repo.maven.apache.org/maven2/org/codehaus/gmaven/gmaven-adapter-api/2.0/gmaven-adapter-api-2.0.pom
(2 KB at 92.8 KB/sec)
2017-06-07T00:35:37.846 [INFO] Downloading: https://repo.maven.apache.org/maven2/org/codehaus/gmaven/gmaven-adapter-impl/2.0/gmaven-adapter-impl-2.0.pom
2017-06-07T00:35:37.856 [INFO] Downloaded: https://repo.maven.apache.org/maven2/org/codehaus/gmaven/gmaven-adapter-impl/2.0/gmaven-adapter-impl-2.0.pom
(3 KB at 265.4 KB/sec)
2017-06-07T00:35:37.880 [INFO] Downloading: https://repo.maven.apache.org/maven2/org/codehaus/groovy/groovy-all/2.1.5/groovy-all-2.1.5.pom
2017-06-07T00:35:37.892 [INFO] Downloaded: https://repo.maven.apache.org/maven2/org/codehaus/groovy/groovy-all/2.1.5/groovy-all-2.1.5.pom
(18 KB at 1468.0 KB/sec)
2017-06-07T00:35:37.896 [INFO] Downloading: https://repo.maven.apache.org/maven2/org/apache/ant/ant/1.8.4/ant-1.8.4.pom
2017-06-07T00:35:37.907 [INFO] Downloaded: https://repo.maven.apache.org/maven2/org/apache/ant/ant/1.8.4/ant-1.8.4.pom
(10 KB at 857.1 KB/sec)
2017-06-07T00:35:37.910 [INFO] Downloading: https://repo.maven.apache.org/maven2/org/apache/ant/ant-parent/1.8.4/ant-parent-1.8.4.pom
2017-06-07T00:35:37.920 [INFO] Downloaded: https://repo.maven.apache.org/maven2/org/apache/ant/ant-parent/1.8.4/ant-parent-1.8.4.pom
(5 KB at 445.4 KB/sec)
2017-06-07T00:35:37.924 [INFO] Downloading: https://repo.maven.apache.org/maven2/org/apache/ant/ant-launcher/1.8.4/ant-launcher-1.8.4.pom
2017-06-07T00:35:37.933 [INFO] Downloaded: https://repo.maven.apache.org/maven2/org/apache/ant/ant-launcher/1.8.4/ant-launcher-1.8.4.pom
(3 KB at 256.2 KB/sec)
2017-06-07T00:35:37.936 [INFO] Downloading: https://repo.maven.apache.org/maven2/org/fusesource/jansi/jansi/1.11/jansi-1.11.pom
2017-06-07T00:35:37.948 [INFO] Downloaded: https://repo.maven.apache.org/maven2/org/fusesource/jansi/jansi/1.11/jansi-1.11.pom
(4 KB at 293.1 KB/sec)
2017-06-07T00:35:37.952 [INFO] Downloading: https://repo.maven.apache.org/maven2/org/fusesource/jansi/jansi-project/1.11/jansi-project-1.11.pom
2017-06-07T00:35:37.959 [INFO] Downloaded: https://repo.maven.apache.org/maven2/org/fusesource/jansi/jansi-project/1.11/jansi-project-1.11.pom
(12 KB at 1597.0 KB/sec)
2017-06-07T00:35:37.963 [INFO] Downloading: https://repo.maven.apache.org/maven2/org/fusesource/fusesource-pom/1.8/fusesource-pom-1.8.pom
2017-06-07T00:35:37.972 [INFO] Downloaded: https://repo.maven.apache.org/maven2/org/fusesource/fusesource-pom/1.8/fusesource-pom-1.8.pom
(15 KB at 1590.2 KB/sec)
2017-06-07T00:35:37.987 [INFO] Downloading: https://repo.maven.apache.org/maven2/org/sonatype/gossip/gossip-core/1.8/gossip-core-1.8.jar
2017-06-07T00:35:37.987 [INFO] Downloading: https://repo.maven.apache.org/maven2/org/sonatype/gossip/gossip-slf4j/1.8/gossip-slf4j-1.8.jar
2017-06-07T00:35:37.987 [INFO] Downloading: https://repo.maven.apache.org/maven2/com/google/guava/guava/14.0.1/guava-14.0.1.jar
2017-06-07T00:35:37.987 [INFO] Downloading: https://repo.maven.apache.org/maven2/org/sonatype/gossip/gossip-bootstrap/1.8/gossip-bootstrap-1.8.jar
2017-06-07T00:35:37.988 [INFO] Downloading: https://repo.maven.apache.org/maven2/org/codehaus/plexus/plexus-classworlds/2.4.2/plexus-classworlds-2.4.2.jar
2017-06-07T00:35:38.005 [INFO] Downloaded: https://repo.maven.apache.org/maven2/org/sonatype/gossip/gossip-bootstrap/1.8/gossip-bootstrap-1.8.jar
(20 KB at 964.7 KB/sec)
2017-06-07T00:35:38.005 [INFO] Downloading: https://repo.maven.apache.org/maven2/org/codehaus/plexus/plexus-interpolation/1.16/plexus-interpolation-1.16.jar
2017-06-07T00:35:38.005 [INFO] Downloaded: https://repo.maven.apache.org/maven2/org/sonatype/gossip/gossip-slf4j/1.8/gossip-slf4j-1.8.jar
(5 KB at 206.4 KB/sec)
2017-06-07T00:35:38.005 [INFO] Downloading: https://repo.maven.apache.org/maven2/org/eclipse/aether/aether-api/0.9.0.M2/aether-api-0.9.0.M2.jar
2017-06-07T00:35:38.010 [INFO] Downloaded: https://repo.maven.apache.org/maven2/org/sonatype/gossip/gossip-core/1.8/gossip-core-1.8.jar
(57 KB at 2258.4 KB/sec)
2017-06-07T00:35:38.010 [INFO] Downloading: https://repo.maven.apache.org/maven2/org/codehaus/gmaven/gmaven-adapter-api/2.0/gmaven-adapter-api-2.0.jar
2017-06-07T00:35:38.014 [INFO] Downloaded: https://repo.maven.apache.org/maven2/org/codehaus/plexus/plexus-classworlds/2.4.2/plexus-classworlds-2.4.2.jar
(46 KB at 1638.1 KB/sec)
2017-06-07T00:35:38.015 [INFO] Downloading: https://repo.maven.apache.org/maven2/org/codehaus/gmaven/gmaven-adapter-impl/2.0/gmaven-adapter-impl-2.0.jar
2017-06-07T00:35:38.026 [INFO] Downloaded: https://repo.maven.apache.org/maven2/org/codehaus/gmaven/gmaven-adapter-api/2.0/gmaven-adapter-api-2.0.jar
(7 KB at 172.8 KB/sec)
2017-06-07T00:35:38.026 [INFO] Downloading: https://repo.maven.apache.org/maven2/org/codehaus/groovy/groovy-all/2.1.5/groovy-all-2.1.5.jar
2017-06-07T00:35:38.028 [INFO] Downloaded: https://repo.maven.apache.org/maven2/org/codehaus/plexus/plexus-interpolation/1.16/plexus-interpolation-1.16.jar
(60 KB at 1425.5 KB/sec)
2017-06-07T00:35:38.028 [INFO] Downloading: https://repo.maven.apache.org/maven2/org/apache/ant/ant/1.8.4/ant-1.8.4.jar
2017-06-07T00:35:38.029 [INFO] Downloaded: https://repo.maven.apache.org/maven2/org/codehaus/gmaven/gmaven-adapter-impl/2.0/gmaven-adapter-impl-2.0.jar
(16 KB at 367.3 KB/sec)
2017-06-07T00:35:38.029 [INFO] Downloading: https://repo.maven.apache.org/maven2/org/apache/ant/ant-launcher/1.8.4/ant-launcher-1.8.4.jar
2017-06-07T00:35:38.029 [INFO] Downloaded: https://repo.maven.apache.org/maven2/org/eclipse/aether/aether-api/0.9.0.M2/aether-api-0.9.0.M2.jar
(131 KB at 3042.3 KB/sec)
2017-06-07T00:35:38.029 [INFO] Downloading: https://repo.maven.apache.org/maven2/org/fusesource/jansi/jansi/1.11/jansi-1.11.jar
2017-06-07T00:35:38.054 [INFO] Downloaded: https://repo.maven.apache.org/maven2/org/apache/ant/ant-launcher/1.8.4/ant-launcher-1.8.4.jar
(18 KB at 264.7 KB/sec)
2017-06-07T00:35:38.061 [INFO] Downloaded: https://repo.maven.apache.org/maven2/org/fusesource/jansi/jansi/1.11/jansi-1.11.jar
(112 KB at 1489.8 KB/sec)
2017-06-07T00:35:38.213 [INFO] Downloaded: https://repo.maven.apache.org/maven2/com/google/guava/guava/14.0.1/guava-14.0.1.jar
(2138 KB at 9376.4 KB/sec)
2017-06-07T00:35:38.223 [INFO] Downloaded: https://repo.maven.apache.org/maven2/org/apache/ant/ant/1.8.4/ant-1.8.4.jar
(1897 KB at 8000.9 KB/sec)
2017-06-07T00:35:38.585 [INFO] Downloaded: https://repo.maven.apache.org/maven2/org/codehaus/groovy/groovy-all/2.1.5/groovy-all-2.1.5.jar
(6219 KB at 10381.1 KB/sec)
[JENKINS] Archiving disabled
2017-06-07T00:35:42.872 [INFO]                                                           
             
2017-06-07T00:35:42.872 [INFO] ------------------------------------------------------------------------
2017-06-07T00:35:42.872 [INFO] Skipping Apache Beam :: Parent
2017-06-07T00:35:42.872 [INFO] This project has been banned from the build due to previous
failures.
2017-06-07T00:35:42.872 [INFO] ------------------------------------------------------------------------
[JENKINS] Archiving disabled
[JENKINS] Archiving disabled
[JENKINS] Archiving disabled
[JENKINS] Archiving disabled
[JENKINS] Archiving disabled
[JENKINS] Archiving disabled
[JENKINS] Archiving disabled
[JENKINS] Archiving disabled
[JENKINS] Archiving disabled
[JENKINS] Archiving disabled
[JENKINS] Archiving disabled
[JENKINS] Archiving disabled
[JENKINS] Archiving disabled
[JENKINS] Archiving disabled
[JENKINS] Archiving disabled
[JENKINS] Archiving disabled
[JENKINS] Archiving disabled
[JENKINS] Archiving disabled
[JENKINS] Archiving disabled
[JENKINS] Archiving disabled
[JENKINS] Archiving disabled
[JENKINS] Archiving disabled
[JENKINS] Archiving disabled
[JENKINS] Archiving disabled
[JENKINS] Archiving disabled
[JENKINS] Archiving disabled
[JENKINS] Archiving disabled
[JENKINS] Archiving disabled
[JENKINS] Archiving disabled
[JENKINS] Archiving disabled
[JENKINS] Archiving disabled
[JENKINS] Archiving disabled
[JENKINS] Archiving disabled
[JENKINS] Archiving disabled
[JENKINS] Archiving disabled
[JENKINS] Archiving disabled
[JENKINS] Archiving disabled
[JENKINS] Archiving disabled
[JENKINS] Archiving disabled
[JENKINS] Archiving disabled
[JENKINS] Archiving disabled
[JENKINS] Archiving disabled
[JENKINS] Archiving disabled
[JENKINS] Archiving disabled
[JENKINS] Archiving disabled
[JENKINS] Archiving disabled
[JENKINS] Archiving disabled
[JENKINS] Archiving disabled
2017-06-07T00:36:45.189 [INFO] ------------------------------------------------------------------------
2017-06-07T00:36:45.190 [INFO] Reactor Summary:
2017-06-07T00:36:45.190 [INFO] 
2017-06-07T00:36:45.190 [INFO] Apache Beam :: Parent .............................. SUCCESS
[ 25.892 s]
2017-06-07T00:36:45.190 [INFO] Apache Beam :: SDKs :: Java :: Build Tools ......... SUCCESS
[ 17.715 s]
2017-06-07T00:36:45.190 [INFO] Apache Beam :: SDKs ................................ SUCCESS
[  8.332 s]
2017-06-07T00:36:45.191 [INFO] Apache Beam :: SDKs :: Common ...................... SUCCESS
[  5.386 s]
2017-06-07T00:36:45.191 [INFO] Apache Beam :: SDKs :: Common :: Runner API ........ SUCCESS
[ 24.948 s]
2017-06-07T00:36:45.191 [INFO] Apache Beam :: SDKs :: Common :: Fn API ............ SUCCESS
[ 23.679 s]
2017-06-07T00:36:45.191 [INFO] Apache Beam :: SDKs :: Java ........................ SUCCESS
[  6.290 s]
2017-06-07T00:36:45.191 [INFO] Apache Beam :: SDKs :: Java :: Core ................ SUCCESS
[04:17 min]
2017-06-07T00:36:45.191 [INFO] Apache Beam :: SDKs :: Java :: IO .................. SUCCESS
[  6.134 s]
2017-06-07T00:36:45.191 [INFO] Apache Beam :: SDKs :: Java :: IO :: Common ........ SUCCESS
[ 10.172 s]
2017-06-07T00:36:45.191 [INFO] Apache Beam :: Runners ............................. SUCCESS
[  6.689 s]
2017-06-07T00:36:45.191 [INFO] Apache Beam :: Runners :: Core Construction Java ... SUCCESS
[ 47.857 s]
2017-06-07T00:36:45.191 [INFO] Apache Beam :: Runners :: Core Java ................ SUCCESS
[01:10 min]
2017-06-07T00:36:45.191 [INFO] Apache Beam :: Runners :: Direct Java .............. SUCCESS
[03:25 min]
2017-06-07T00:36:45.191 [INFO] Apache Beam :: SDKs :: Java :: IO :: Elasticsearch . SUCCESS
[ 58.578 s]
2017-06-07T00:36:45.191 [INFO] Apache Beam :: SDKs :: Java :: Extensions .......... SUCCESS
[  6.815 s]
2017-06-07T00:36:45.191 [INFO] Apache Beam :: SDKs :: Java :: Extensions :: Google Cloud Platform
Core SUCCESS [ 56.011 s]
2017-06-07T00:36:45.191 [INFO] Apache Beam :: SDKs :: Java :: Extensions :: Protobuf SUCCESS
[ 32.611 s]
2017-06-07T00:36:45.191 [INFO] Apache Beam :: SDKs :: Java :: IO :: Google Cloud Platform
SUCCESS [01:34 min]
2017-06-07T00:36:45.191 [INFO] Apache Beam :: SDKs :: Java :: IO :: Hadoop Common . SUCCESS
[ 31.824 s]
2017-06-07T00:36:45.192 [INFO] Apache Beam :: SDKs :: Java :: IO :: Hadoop File System SUCCESS
[ 48.856 s]
2017-06-07T00:36:45.192 [INFO] Apache Beam :: SDKs :: Java :: IO :: Hadoop ........ SUCCESS
[  9.431 s]
2017-06-07T00:36:45.192 [INFO] Apache Beam :: SDKs :: Java :: IO :: Hadoop :: input-format
SUCCESS [ 34.977 s]
2017-06-07T00:36:45.192 [INFO] Apache Beam :: SDKs :: Java :: IO :: Hadoop :: jdk1.8-tests
SUCCESS [01:40 min]
2017-06-07T00:36:45.192 [INFO] Apache Beam :: SDKs :: Java :: IO :: HBase ......... SUCCESS
[ 44.032 s]
2017-06-07T00:36:45.192 [INFO] Apache Beam :: SDKs :: Java :: IO :: JDBC .......... SUCCESS
[ 43.862 s]
2017-06-07T00:36:45.192 [INFO] Apache Beam :: SDKs :: Java :: IO :: JMS ........... SUCCESS
[ 40.340 s]
2017-06-07T00:36:45.192 [INFO] Apache Beam :: SDKs :: Java :: IO :: Kafka ......... SUCCESS
[ 50.145 s]
2017-06-07T00:36:45.192 [INFO] Apache Beam :: SDKs :: Java :: IO :: Kinesis ....... SUCCESS
[ 46.242 s]
2017-06-07T00:36:45.192 [INFO] Apache Beam :: SDKs :: Java :: IO :: MongoDB ....... SUCCESS
[ 52.594 s]
2017-06-07T00:36:45.192 [INFO] Apache Beam :: SDKs :: Java :: IO :: MQTT .......... SUCCESS
[ 39.796 s]
2017-06-07T00:36:45.192 [INFO] Apache Beam :: SDKs :: Java :: IO :: XML ........... SUCCESS
[ 33.124 s]
2017-06-07T00:36:45.192 [INFO] Apache Beam :: SDKs :: Java :: Maven Archetypes .... SUCCESS
[  7.026 s]
2017-06-07T00:36:45.192 [INFO] Apache Beam :: SDKs :: Java :: Maven Archetypes :: Starter
SUCCESS [ 26.838 s]
2017-06-07T00:36:45.192 [INFO] Apache Beam :: SDKs :: Java :: Extensions :: Jackson SUCCESS
[ 30.362 s]
2017-06-07T00:36:45.192 [INFO] Apache Beam :: SDKs :: Java :: Extensions :: Join library SUCCESS
[ 35.603 s]
2017-06-07T00:36:45.192 [INFO] Apache Beam :: SDKs :: Java :: Extensions :: Sorter  SUCCESS
[ 43.767 s]
2017-06-07T00:36:45.192 [INFO] Apache Beam :: Runners :: Google Cloud Dataflow .... SUCCESS
[ 55.504 s]
2017-06-07T00:36:45.192 [INFO] Apache Beam :: SDKs :: Java :: Harness ............. SUCCESS
[01:01 min]
2017-06-07T00:36:45.192 [INFO] Apache Beam :: SDKs :: Java :: Java 8 Tests ........ SUCCESS
[ 30.027 s]
2017-06-07T00:36:45.192 [INFO] Apache Beam :: SDKs :: Python ...................... FAILURE
[  5.553 s]
2017-06-07T00:36:45.193 [INFO] Apache Beam :: Runners :: Flink .................... SKIPPED
2017-06-07T00:36:45.193 [INFO] Apache Beam :: Runners :: Spark .................... SKIPPED
2017-06-07T00:36:45.193 [INFO] Apache Beam :: Runners :: Apex ..................... SKIPPED
2017-06-07T00:36:45.193 [INFO] Apache Beam :: Examples ............................ SKIPPED
2017-06-07T00:36:45.193 [INFO] Apache Beam :: Examples :: Java .................... SKIPPED
2017-06-07T00:36:45.193 [INFO] Apache Beam :: Examples :: Java 8 .................. SKIPPED
2017-06-07T00:36:45.193 [INFO] Apache Beam :: SDKs :: Java :: Aggregated Javadoc .. SKIPPED
2017-06-07T00:36:45.193 [INFO] ------------------------------------------------------------------------
2017-06-07T00:36:45.193 [INFO] BUILD FAILURE
2017-06-07T00:36:45.193 [INFO] ------------------------------------------------------------------------
2017-06-07T00:36:45.193 [INFO] Total time: 34:57 min
2017-06-07T00:36:45.193 [INFO] Finished at: 2017-06-07T00:36:45+00:00
2017-06-07T00:36:46.587 [INFO] Final Memory: 380M/3218M
2017-06-07T00:36:46.587 [INFO] ------------------------------------------------------------------------
Waiting for Jenkins to finish collecting data
2017-06-07T00:44:50.155 [ERROR] Failed to execute goal org.codehaus.gmaven:groovy-maven-plugin:2.0:execute
(find-supported-python-for-clean) on project beam-sdks-python: Unable to find Python 2.7 in
path -> [Help 1]
org.apache.maven.lifecycle.LifecycleExecutionException: Failed to execute goal org.codehaus.gmaven:groovy-maven-plugin:2.0:execute
(find-supported-python-for-clean) on project beam-sdks-python: Unable to find Python 2.7 in
path
	at org.apache.maven.lifecycle.internal.MojoExecutor.execute(MojoExecutor.java:212)
	at org.apache.maven.lifecycle.internal.MojoExecutor.execute(MojoExecutor.java:153)
	at org.apache.maven.lifecycle.internal.MojoExecutor.execute(MojoExecutor.java:145)
	at org.apache.maven.lifecycle.internal.LifecycleModuleBuilder.buildProject(LifecycleModuleBuilder.java:116)
	at org.apache.maven.lifecycle.internal.LifecycleModuleBuilder.buildProject(LifecycleModuleBuilder.java:80)
	at org.apache.maven.lifecycle.internal.builder.singlethreaded.SingleThreadedBuilder.build(SingleThreadedBuilder.java:51)
	at org.apache.maven.lifecycle.internal.LifecycleStarter.execute(LifecycleStarter.java:128)
	at org.apache.maven.DefaultMaven.doExecute(DefaultMaven.java:307)
	at org.apache.maven.DefaultMaven.doExecute(DefaultMaven.java:193)
	at org.apache.maven.DefaultMaven.execute(DefaultMaven.java:106)
	at org.jvnet.hudson.maven3.launcher.Maven33Launcher.main(Maven33Launcher.java:129)
	at sun.reflect.NativeMethodAccessorImpl.invoke0(Native Method)
	at sun.reflect.NativeMethodAccessorImpl.invoke(NativeMethodAccessorImpl.java:62)
	at sun.reflect.DelegatingMethodAccessorImpl.invoke(DelegatingMethodAccessorImpl.java:43)
	at java.lang.reflect.Method.invoke(Method.java:498)
	at org.codehaus.plexus.classworlds.launcher.Launcher.launchStandard(Launcher.java:330)
	at org.codehaus.plexus.classworlds.launcher.Launcher.launch(Launcher.java:238)
	at jenkins.maven3.agent.Maven33Main.launch(Maven33Main.java:176)
	at sun.reflect.NativeMethodAccessorImpl.invoke0(Native Method)
	at sun.reflect.NativeMethodAccessorImpl.invoke(NativeMethodAccessorImpl.java:62)
	at sun.reflect.DelegatingMethodAccessorImpl.invoke(DelegatingMethodAccessorImpl.java:43)
	at java.lang.reflect.Method.invoke(Method.java:498)
	at hudson.maven.Maven3Builder.call(Maven3Builder.java:139)
	at hudson.maven.Maven3Builder.call(Maven3Builder.java:70)
	at hudson.remoting.UserRequest.perform(UserRequest.java:120)
	at hudson.remoting.UserRequest.perform(UserRequest.java:48)
	at hudson.remoting.Request$2.run(Request.java:326)
	at hudson.remoting.InterceptingExecutorService$1.call(InterceptingExecutorService.java:68)
	at java.util.concurrent.FutureTask.run(FutureTask.java:266)
	at java.util.concurrent.ThreadPoolExecutor.runWorker(ThreadPoolExecutor.java:1142)
	at java.util.concurrent.ThreadPoolExecutor$Worker.run(ThreadPoolExecutor.java:617)
	at java.lang.Thread.run(Thread.java:745)
Caused by: org.apache.maven.plugin.MojoFailureException: Unable to find Python 2.7 in path
	at sun.reflect.NativeConstructorAccessorImpl.newInstance0(Native Method)
	at sun.reflect.NativeConstructorAccessorImpl.newInstance(NativeConstructorAccessorImpl.java:62)
	at sun.reflect.DelegatingConstructorAccessorImpl.newInstance(DelegatingConstructorAccessorImpl.java:45)
	at java.lang.reflect.Constructor.newInstance(Constructor.java:423)
	at org.codehaus.groovy.reflection.CachedConstructor.invoke(CachedConstructor.java:77)
	at org.codehaus.groovy.runtime.callsite.ConstructorSite$ConstructorSiteNoUnwrapNoCoerce.callConstructor(ConstructorSite.java:102)
	at org.codehaus.groovy.runtime.callsite.CallSiteArray.defaultCallConstructor(CallSiteArray.java:57)
	at org.codehaus.groovy.runtime.callsite.AbstractCallSite.callConstructor(AbstractCallSite.java:182)
	at org.codehaus.groovy.runtime.callsite.AbstractCallSite.callConstructor(AbstractCallSite.java:190)
	at findSupportedPython.run(findSupportedPython.groovy:70)
	at groovy.lang.GroovyShell.evaluate(GroovyShell.java:518)
	at org.codehaus.gmaven.adapter.impl.ScriptExecutorImpl.execute(ScriptExecutorImpl.java:80)
	at org.codehaus.gmaven.plugin.ExecuteMojo$1.run(ExecuteMojo.java:100)
	at org.codehaus.gmaven.plugin.util.SystemNoExitGuard.run(SystemNoExitGuard.java:45)
	at org.codehaus.gmaven.plugin.ExecuteMojo.run(ExecuteMojo.java:96)
	at org.codehaus.gmaven.plugin.MojoSupport.execute(MojoSupport.java:45)
	at org.apache.maven.plugin.DefaultBuildPluginManager.executeMojo(DefaultBuildPluginManager.java:134)
	at org.apache.maven.lifecycle.internal.MojoExecutor.execute(MojoExecutor.java:208)
	... 31 more
2017-06-07T00:44:50.160 [ERROR] 
2017-06-07T00:44:50.160 [ERROR] Re-run Maven using the -X switch to enable full debug logging.
2017-06-07T00:44:50.160 [ERROR] 
2017-06-07T00:44:50.160 [ERROR] For more information about the errors and possible solutions,
please read the following articles:
2017-06-07T00:44:50.160 [ERROR] [Help 1] http://cwiki.apache.org/confluence/display/MAVEN/MojoFailureException
2017-06-07T00:44:50.161 [ERROR] 
2017-06-07T00:44:50.161 [ERROR] After correcting the problems, you can resume the build with
the command
2017-06-07T00:44:50.161 [ERROR]   mvn <goals> -rf :beam-sdks-python
channel stopped
Not sending mail to unregistered user github@nakomis.com
Not sending mail to unregistered user mingmxu@ebay.com
Not sending mail to unregistered user kirpichov@google.com
Not sending mail to unregistered user aljoscha.krettek@gmail.com
Not sending mail to unregistered user klk@google.com
Not sending mail to unregistered user sourabhbajaj@google.com
Not sending mail to unregistered user hepei.hp@alibaba-inc.com

Mime
View raw message