beam-commits mailing list archives

Site index · List index
Message view « Date » · « Thread »
Top « Date » · « Thread »
From "Mark Liu (JIRA)" <j...@apache.org>
Subject [jira] [Updated] (BEAM-2157) HadoopFileSystemModuleTest Failed in Some JDK Versions on Jenkins
Date Wed, 03 May 2017 20:35:04 GMT

     [ https://issues.apache.org/jira/browse/BEAM-2157?page=com.atlassian.jira.plugin.system.issuetabpanels:all-tabpanel
]

Mark Liu updated BEAM-2157:
---------------------------
    Description: 
I'm running Java Postcommit test in multiple JDK versions and HadoopFileSystemModuleTest failed
in the following JDK versions:

JDK 1.7
OpenJDK 7 (on Ubuntu only)
OpenJDK 8 (on Ubuntu only)

Error log:
{code}
estConfigurationSerializationDeserialization(org.apache.beam.sdk.io.hdfs.HadoopFileSystemModuleTest)
 Time elapsed: 0.022 s  <<< FAILURE!
java.lang.AssertionError: 

Expected: iterable containing [<testPropertyA=A>, <testPropertyB=B>, <testPropertyC=baseC>]
     but: item 0: was <testPropertyC=baseC>
	at org.hamcrest.MatcherAssert.assertThat(MatcherAssert.java:20)
	at org.junit.Assert.assertThat(Assert.java:956)
	at org.junit.Assert.assertThat(Assert.java:923)
	at org.apache.beam.sdk.io.hdfs.HadoopFileSystemModuleTest.testConfigurationSerializationDeserialization(HadoopFileSystemModuleTest.java:60)
{code}

Jenkins build link is [here|https://builds.apache.org/view/Beam/job/beam_PostCommit_Java_JDK_Versions_Test/6/]

However, this test was passed in JDK 1.8 which is the one we are currently used in all pre/post-commit.

Note: This Jenkins branch is still not published, but environment should be set up correctly.
Build (total 4 JDK versions) can be triggered by commenting "Run Java JDK Versions Test" in
PR.

  was:
I'm running Java Postcommit test in multiple JDK versions and HadoopFileSystemModuleTest failed
in the following JDK versions:

JDK 1.7
OpenJDK 7 (on Ubuntu only)
OpenJDK 8 (on Ubuntu only)

However, this test was passed in JDK 1.8 which is the one we are currently used in all pre/post-commit.

Jenkins build link is [here|https://builds.apache.org/view/Beam/job/beam_PostCommit_Java_JDK_Versions_Test/6/]

Note: This Jenkins branch is still not published, but environment should be set up correctly.
Build (total 4 JDK versions) can be triggered by commenting "Run Java JDK Versions Test" in
PR.


> HadoopFileSystemModuleTest Failed in Some JDK Versions on Jenkins
> -----------------------------------------------------------------
>
>                 Key: BEAM-2157
>                 URL: https://issues.apache.org/jira/browse/BEAM-2157
>             Project: Beam
>          Issue Type: Bug
>          Components: testing
>            Reporter: Mark Liu
>
> I'm running Java Postcommit test in multiple JDK versions and HadoopFileSystemModuleTest
failed in the following JDK versions:
> JDK 1.7
> OpenJDK 7 (on Ubuntu only)
> OpenJDK 8 (on Ubuntu only)
> Error log:
> {code}
> estConfigurationSerializationDeserialization(org.apache.beam.sdk.io.hdfs.HadoopFileSystemModuleTest)
 Time elapsed: 0.022 s  <<< FAILURE!
> java.lang.AssertionError: 
> Expected: iterable containing [<testPropertyA=A>, <testPropertyB=B>, <testPropertyC=baseC>]
>      but: item 0: was <testPropertyC=baseC>
> 	at org.hamcrest.MatcherAssert.assertThat(MatcherAssert.java:20)
> 	at org.junit.Assert.assertThat(Assert.java:956)
> 	at org.junit.Assert.assertThat(Assert.java:923)
> 	at org.apache.beam.sdk.io.hdfs.HadoopFileSystemModuleTest.testConfigurationSerializationDeserialization(HadoopFileSystemModuleTest.java:60)
> {code}
> Jenkins build link is [here|https://builds.apache.org/view/Beam/job/beam_PostCommit_Java_JDK_Versions_Test/6/]
> However, this test was passed in JDK 1.8 which is the one we are currently used in all
pre/post-commit.
> Note: This Jenkins branch is still not published, but environment should be set up correctly.
Build (total 4 JDK versions) can be triggered by commenting "Run Java JDK Versions Test" in
PR.



--
This message was sent by Atlassian JIRA
(v6.3.15#6346)

Mime
View raw message