beam-commits mailing list archives

Site index · List index
Message view « Date » · « Thread »
Top « Date » · « Thread »
From Apache Jenkins Server <jenk...@builds.apache.org>
Subject Build failed in Jenkins: beam_PostCommit_Java_MavenInstall #3970
Date Wed, 31 May 2017 08:26:29 GMT
See <https://builds.apache.org/job/beam_PostCommit_Java_MavenInstall/3970/display/redirect?page=changes>

Changes:

[iemejia] Refactor HadoopInputFormatIO to use SerializableConfiguration from

[iemejia] Make SerializableConfiguration more robust by using Hadoop based

------------------------------------------
[...truncated 3.07 MB...]
2017-05-31T08:24:59.784 [INFO] Downloaded: https://repo.maven.apache.org/maven2/org/apache/sling/org.apache.sling.commons.json/2.0.6/org.apache.sling.commons.json-2.0.6.jar
(47 KB at 55.8 KB/sec)
2017-05-31T08:24:59.784 [INFO] Downloading: https://repo.maven.apache.org/maven2/org/apache/flink/flink-runtime_2.10/1.2.1/flink-runtime_2.10-1.2.1-tests.jar
2017-05-31T08:24:59.840 [INFO] Downloaded: https://repo.maven.apache.org/maven2/org/apache/flink/flink-core/1.2.1/flink-core-1.2.1-tests.jar
(716 KB at 800.7 KB/sec)
2017-05-31T08:24:59.840 [INFO] Downloading: https://repo.maven.apache.org/maven2/org/apache/flink/flink-streaming-java_2.10/1.2.1/flink-streaming-java_2.10-1.2.1-tests.jar
2017-05-31T08:24:59.971 [INFO] Downloaded: https://repo.maven.apache.org/maven2/org/scala-lang/scala-library/2.10.4/scala-library-2.10.4.jar
(6960 KB at 6789.6 KB/sec)
2017-05-31T08:24:59.972 [INFO] Downloading: https://repo.maven.apache.org/maven2/org/apache/flink/flink-test-utils_2.10/1.2.1/flink-test-utils_2.10-1.2.1.jar
2017-05-31T08:24:59.979 [INFO] Downloaded: https://repo.maven.apache.org/maven2/org/apache/flink/flink-streaming-java_2.10/1.2.1/flink-streaming-java_2.10-1.2.1-tests.jar
(953 KB at 922.4 KB/sec)
2017-05-31T08:24:59.979 [INFO] Downloading: https://repo.maven.apache.org/maven2/org/apache/flink/flink-test-utils-junit/1.2.1/flink-test-utils-junit-1.2.1.jar
2017-05-31T08:24:59.987 [INFO] Downloaded: https://repo.maven.apache.org/maven2/org/apache/flink/flink-streaming-java_2.10/1.2.1/flink-streaming-java_2.10-1.2.1.jar
(3035 KB at 2914.7 KB/sec)
2017-05-31T08:24:59.987 [INFO] Downloading: https://repo.maven.apache.org/maven2/org/apache/curator/curator-test/2.8.0/curator-test-2.8.0.jar
2017-05-31T08:24:59.992 [INFO] Downloaded: https://repo.maven.apache.org/maven2/org/apache/flink/flink-runtime_2.10/1.2.1/flink-runtime_2.10-1.2.1-tests.jar
(2432 KB at 2324.7 KB/sec)
2017-05-31T08:25:00.005 [INFO] Downloaded: https://repo.maven.apache.org/maven2/org/apache/flink/flink-test-utils-junit/1.2.1/flink-test-utils-junit-1.2.1.jar
(24 KB at 21.7 KB/sec)
2017-05-31T08:25:00.016 [INFO] Downloaded: https://repo.maven.apache.org/maven2/org/apache/curator/curator-test/2.8.0/curator-test-2.8.0.jar
(39 KB at 36.4 KB/sec)
2017-05-31T08:25:00.159 [INFO] Downloaded: https://repo.maven.apache.org/maven2/org/apache/flink/flink-test-utils_2.10/1.2.1/flink-test-utils_2.10-1.2.1.jar
(2366 KB at 1950.3 KB/sec)
2017-05-31T08:25:00.607 [INFO] Downloaded: https://repo.maven.apache.org/maven2/org/apache/flink/flink-shaded-hadoop2/1.2.1/flink-shaded-hadoop2-1.2.1.jar
(17860 KB at 10745.7 KB/sec)
2017-05-31T08:25:00.618 [INFO] 
2017-05-31T08:25:00.618 [INFO] --- maven-clean-plugin:3.0.0:clean (default-clean) @ beam-runners-flink_2.10
---
2017-05-31T08:25:00.621 [INFO] Deleting <https://builds.apache.org/job/beam_PostCommit_Java_MavenInstall/ws/runners/flink>
(includes = [**/*.pyc, **/*.egg-info/, **/sdks/python/LICENSE, **/sdks/python/NOTICE, **/sdks/python/README.md],
excludes = [])
2017-05-31T08:25:00.795 [INFO] 
2017-05-31T08:25:00.795 [INFO] --- maven-enforcer-plugin:1.4.1:enforce (enforce) @ beam-runners-flink_2.10
---
2017-05-31T08:25:03.047 [INFO] 
2017-05-31T08:25:03.047 [INFO] --- maven-enforcer-plugin:1.4.1:enforce (enforce-banned-dependencies)
@ beam-runners-flink_2.10 ---
2017-05-31T08:25:03.116 [INFO] 
2017-05-31T08:25:03.116 [INFO] --- maven-remote-resources-plugin:1.5:process (process-resource-bundles)
@ beam-runners-flink_2.10 ---
2017-05-31T08:25:03.759 [INFO] 
2017-05-31T08:25:03.759 [INFO] --- maven-resources-plugin:3.0.2:resources (default-resources)
@ beam-runners-flink_2.10 ---
2017-05-31T08:25:03.761 [INFO] Using 'UTF-8' encoding to copy filtered resources.
2017-05-31T08:25:03.761 [INFO] Copying 1 resource
2017-05-31T08:25:03.762 [INFO] Copying 3 resources
2017-05-31T08:25:03.854 [INFO] 
2017-05-31T08:25:03.854 [INFO] --- maven-compiler-plugin:3.6.1:compile (default-compile) @
beam-runners-flink_2.10 ---
2017-05-31T08:25:03.866 [INFO] Changes detected - recompiling the module!
2017-05-31T08:25:03.867 [INFO] Compiling 75 source files to <https://builds.apache.org/job/beam_PostCommit_Java_MavenInstall/ws/runners/flink/target/classes>
2017-05-31T08:25:04.622 [WARNING] bootstrap class path not set in conjunction with -source
1.7
2017-05-31T08:25:04.622 [INFO] <https://builds.apache.org/job/beam_PostCommit_Java_MavenInstall/ws/runners/flink/src/main/java/org/apache/beam/runners/flink/FlinkStreamingTransformTranslators.java>:
Some input files use or override a deprecated API.
2017-05-31T08:25:04.622 [INFO] <https://builds.apache.org/job/beam_PostCommit_Java_MavenInstall/ws/runners/flink/src/main/java/org/apache/beam/runners/flink/FlinkStreamingTransformTranslators.java>:
Recompile with -Xlint:deprecation for details.
2017-05-31T08:25:04.622 [INFO] <https://builds.apache.org/job/beam_PostCommit_Java_MavenInstall/ws/runners/flink/src/main/java/org/apache/beam/runners/flink/translation/wrappers/streaming/state/FlinkKeyGroupStateInternals.java>:
Some input files use unchecked or unsafe operations.
2017-05-31T08:25:04.622 [INFO] <https://builds.apache.org/job/beam_PostCommit_Java_MavenInstall/ws/runners/flink/src/main/java/org/apache/beam/runners/flink/translation/wrappers/streaming/state/FlinkKeyGroupStateInternals.java>:
Recompile with -Xlint:unchecked for details.
2017-05-31T08:25:04.714 [INFO] 
2017-05-31T08:25:04.714 [INFO] --- maven-resources-plugin:3.0.2:testResources (default-testResources)
@ beam-runners-flink_2.10 ---
2017-05-31T08:25:04.715 [INFO] Using 'UTF-8' encoding to copy filtered resources.
2017-05-31T08:25:04.715 [INFO] Copying 1 resource
2017-05-31T08:25:04.716 [INFO] Copying 3 resources
2017-05-31T08:25:04.805 [INFO] 
2017-05-31T08:25:04.805 [INFO] --- maven-compiler-plugin:3.6.1:testCompile (default-testCompile)
@ beam-runners-flink_2.10 ---
2017-05-31T08:25:04.815 [INFO] Changes detected - recompiling the module!
2017-05-31T08:25:04.816 [INFO] Compiling 17 source files to <https://builds.apache.org/job/beam_PostCommit_Java_MavenInstall/ws/runners/flink/target/test-classes>
2017-05-31T08:25:05.306 [INFO] <https://builds.apache.org/job/beam_PostCommit_Java_MavenInstall/ws/runners/flink/src/test/java/org/apache/beam/runners/flink/streaming/FlinkKeyGroupStateInternalsTest.java>:
Some input files use unchecked or unsafe operations.
2017-05-31T08:25:05.306 [INFO] <https://builds.apache.org/job/beam_PostCommit_Java_MavenInstall/ws/runners/flink/src/test/java/org/apache/beam/runners/flink/streaming/FlinkKeyGroupStateInternalsTest.java>:
Recompile with -Xlint:unchecked for details.
2017-05-31T08:25:05.357 [INFO] 
2017-05-31T08:25:05.357 [INFO] --- maven-checkstyle-plugin:2.17:check (default) @ beam-runners-flink_2.10
---
2017-05-31T08:25:06.695 [INFO] Starting audit...
Audit done.
2017-05-31T08:25:06.819 [INFO] 
2017-05-31T08:25:06.819 [INFO] >>> findbugs-maven-plugin:3.0.4:check (default) >
:findbugs @ beam-runners-flink_2.10 >>>
2017-05-31T08:25:06.838 [INFO] 
2017-05-31T08:25:06.838 [INFO] --- findbugs-maven-plugin:3.0.4:findbugs (findbugs) @ beam-runners-flink_2.10
---
2017-05-31T08:25:06.843 [INFO] Fork Value is true
     [java] Warnings generated: 2
2017-05-31T08:25:22.471 [INFO] Done FindBugs Analysis....
2017-05-31T08:25:22.625 [INFO] 
2017-05-31T08:25:22.625 [INFO] <<< findbugs-maven-plugin:3.0.4:check (default) <
:findbugs @ beam-runners-flink_2.10 <<<
2017-05-31T08:25:22.625 [INFO] 
2017-05-31T08:25:22.625 [INFO] --- findbugs-maven-plugin:3.0.4:check (default) @ beam-runners-flink_2.10
---
2017-05-31T08:25:22.634 [INFO] BugInstance size is 2
2017-05-31T08:25:22.634 [INFO] Error size is 0
2017-05-31T08:25:22.637 [INFO] Total bugs: 2
2017-05-31T08:25:22.643 [INFO] Possible null pointer dereference of FlinkDoFnFunction.outputMap
in org.apache.beam.runners.flink.translation.functions.FlinkDoFnFunction.mapPartition(Iterable,
Collector) [org.apache.beam.runners.flink.translation.functions.FlinkDoFnFunction, org.apache.beam.runners.flink.translation.functions.FlinkDoFnFunction,
org.apache.beam.runners.flink.translation.functions.FlinkDoFnFunction] Dereferenced at FlinkDoFnFunction.java:[line
101]Null value at FlinkDoFnFunction.java:[line 93]Known null at FlinkDoFnFunction.java:[line
94] NP_NULL_ON_SOME_PATH
2017-05-31T08:25:22.643 [INFO] Possible null pointer dereference of FlinkStatefulDoFnFunction.outputMap
in org.apache.beam.runners.flink.translation.functions.FlinkStatefulDoFnFunction.reduce(Iterable,
Collector) [org.apache.beam.runners.flink.translation.functions.FlinkStatefulDoFnFunction,
org.apache.beam.runners.flink.translation.functions.FlinkStatefulDoFnFunction, org.apache.beam.runners.flink.translation.functions.FlinkStatefulDoFnFunction]
Dereferenced at FlinkStatefulDoFnFunction.java:[line 118]Null value at FlinkStatefulDoFnFunction.java:[line
94]Known null at FlinkStatefulDoFnFunction.java:[line 95] NP_NULL_ON_SOME_PATH
2017-05-31T08:25:22.643 [INFO] 


To see bug detail using the Findbugs GUI, use the following command "mvn findbugs:gui"



[JENKINS] Archiving disabled
2017-05-31T08:25:23.229 [INFO]                                                           
             
2017-05-31T08:25:23.229 [INFO] ------------------------------------------------------------------------
2017-05-31T08:25:23.229 [INFO] Skipping Apache Beam :: Parent
2017-05-31T08:25:23.229 [INFO] This project has been banned from the build due to previous
failures.
2017-05-31T08:25:23.229 [INFO] ------------------------------------------------------------------------
[JENKINS] Archiving disabled
[JENKINS] Archiving disabled
[JENKINS] Archiving disabled
[JENKINS] Archiving disabled
[JENKINS] Archiving disabled
[JENKINS] Archiving disabled
[JENKINS] Archiving disabled
[JENKINS] Archiving disabled
[JENKINS] Archiving disabled
[JENKINS] Archiving disabled
[JENKINS] Archiving disabled
[JENKINS] Archiving disabled
[JENKINS] Archiving disabled
[JENKINS] Archiving disabled
[JENKINS] Archiving disabled
[JENKINS] Archiving disabled
[JENKINS] Archiving disabled
[JENKINS] Archiving disabled
[JENKINS] Archiving disabled
[JENKINS] Archiving disabled
[JENKINS] Archiving disabled
[JENKINS] Archiving disabled
[JENKINS] Archiving disabled
[JENKINS] Archiving disabled
[JENKINS] Archiving disabled
[JENKINS] Archiving disabled
[JENKINS] Archiving disabled
[JENKINS] Archiving disabled
[JENKINS] Archiving disabled
[JENKINS] Archiving disabled
[JENKINS] Archiving disabled
[JENKINS] Archiving disabled
[JENKINS] Archiving disabled
[JENKINS] Archiving disabled
[JENKINS] Archiving disabled
[JENKINS] Archiving disabled
[JENKINS] Archiving disabled
[JENKINS] Archiving disabled
[JENKINS] Archiving disabled
[JENKINS] Archiving disabled
[JENKINS] Archiving disabled
[JENKINS] Archiving disabled
[JENKINS] Archiving disabled
[JENKINS] Archiving disabled
[JENKINS] Archiving disabled
[JENKINS] Archiving disabled
2017-05-31T08:25:46.971 [INFO] ------------------------------------------------------------------------
2017-05-31T08:25:46.972 [INFO] Reactor Summary:
2017-05-31T08:25:46.972 [INFO] 
2017-05-31T08:25:46.972 [INFO] Apache Beam :: Parent .............................. SUCCESS
[ 25.497 s]
2017-05-31T08:25:46.972 [INFO] Apache Beam :: SDKs :: Java :: Build Tools ......... SUCCESS
[ 15.881 s]
2017-05-31T08:25:46.972 [INFO] Apache Beam :: SDKs ................................ SUCCESS
[  7.205 s]
2017-05-31T08:25:46.972 [INFO] Apache Beam :: SDKs :: Common ...................... SUCCESS
[  2.217 s]
2017-05-31T08:25:46.972 [INFO] Apache Beam :: SDKs :: Common :: Fn API ............ SUCCESS
[ 24.430 s]
2017-05-31T08:25:46.972 [INFO] Apache Beam :: SDKs :: Common :: Runner API ........ SUCCESS
[ 17.645 s]
2017-05-31T08:25:46.972 [INFO] Apache Beam :: SDKs :: Java ........................ SUCCESS
[  2.221 s]
2017-05-31T08:25:46.972 [INFO] Apache Beam :: SDKs :: Java :: Core ................ SUCCESS
[03:05 min]
2017-05-31T08:25:46.972 [INFO] Apache Beam :: SDKs :: Java :: IO .................. SUCCESS
[  2.295 s]
2017-05-31T08:25:46.972 [INFO] Apache Beam :: SDKs :: Java :: IO :: Common ........ SUCCESS
[  5.174 s]
2017-05-31T08:25:46.972 [INFO] Apache Beam :: Runners ............................. SUCCESS
[  2.040 s]
2017-05-31T08:25:46.972 [INFO] Apache Beam :: Runners :: Core Construction Java ... SUCCESS
[ 36.091 s]
2017-05-31T08:25:46.972 [INFO] Apache Beam :: Runners :: Core Java ................ SUCCESS
[ 55.375 s]
2017-05-31T08:25:46.972 [INFO] Apache Beam :: Runners :: Direct Java .............. SUCCESS
[03:11 min]
2017-05-31T08:25:46.972 [INFO] Apache Beam :: SDKs :: Java :: IO :: Elasticsearch . SUCCESS
[ 42.112 s]
2017-05-31T08:25:46.972 [INFO] Apache Beam :: SDKs :: Java :: Extensions .......... SUCCESS
[  3.723 s]
2017-05-31T08:25:46.972 [INFO] Apache Beam :: SDKs :: Java :: Extensions :: Google Cloud Platform
Core SUCCESS [ 45.416 s]
2017-05-31T08:25:46.972 [INFO] Apache Beam :: SDKs :: Java :: Extensions :: Protobuf SUCCESS
[ 20.271 s]
2017-05-31T08:25:46.972 [INFO] Apache Beam :: SDKs :: Java :: IO :: Google Cloud Platform
SUCCESS [01:15 min]
2017-05-31T08:25:46.972 [INFO] Apache Beam :: SDKs :: Java :: IO :: Hadoop Common . SUCCESS
[ 20.217 s]
2017-05-31T08:25:46.972 [INFO] Apache Beam :: SDKs :: Java :: IO :: Hadoop File System SUCCESS
[ 31.994 s]
2017-05-31T08:25:46.972 [INFO] Apache Beam :: SDKs :: Java :: IO :: Hadoop ........ SUCCESS
[  5.771 s]
2017-05-31T08:25:46.972 [INFO] Apache Beam :: SDKs :: Java :: IO :: Hadoop :: input-format
SUCCESS [ 21.450 s]
2017-05-31T08:25:46.972 [INFO] Apache Beam :: Runners :: Google Cloud Dataflow .... SUCCESS
[05:42 min]
2017-05-31T08:25:46.972 [INFO] Apache Beam :: SDKs :: Java :: IO :: Hadoop :: jdk1.8-tests
SUCCESS [01:31 min]
2017-05-31T08:25:46.972 [INFO] Apache Beam :: SDKs :: Java :: IO :: HBase ......... SUCCESS
[01:15 min]
2017-05-31T08:25:46.972 [INFO] Apache Beam :: SDKs :: Java :: IO :: JDBC .......... SUCCESS
[ 31.246 s]
2017-05-31T08:25:46.972 [INFO] Apache Beam :: SDKs :: Java :: IO :: JMS ........... SUCCESS
[ 24.985 s]
2017-05-31T08:25:46.972 [INFO] Apache Beam :: SDKs :: Java :: IO :: Kafka ......... SUCCESS
[ 31.163 s]
2017-05-31T08:25:46.972 [INFO] Apache Beam :: SDKs :: Java :: IO :: Kinesis ....... SUCCESS
[ 29.268 s]
2017-05-31T08:25:46.972 [INFO] Apache Beam :: SDKs :: Java :: IO :: MongoDB ....... SUCCESS
[ 42.685 s]
2017-05-31T08:25:46.973 [INFO] Apache Beam :: SDKs :: Java :: IO :: MQTT .......... SUCCESS
[ 24.959 s]
2017-05-31T08:25:46.973 [INFO] Apache Beam :: SDKs :: Java :: IO :: XML ........... SUCCESS
[ 30.033 s]
2017-05-31T08:25:46.973 [INFO] Apache Beam :: SDKs :: Java :: Maven Archetypes .... SUCCESS
[  2.063 s]
2017-05-31T08:25:46.973 [INFO] Apache Beam :: SDKs :: Java :: Maven Archetypes :: Starter
SUCCESS [ 14.342 s]
2017-05-31T08:25:46.973 [INFO] Apache Beam :: Examples ............................ SUCCESS
[  3.539 s]
2017-05-31T08:25:46.973 [INFO] Apache Beam :: Examples :: Java .................... SUCCESS
[08:58 min]
2017-05-31T08:25:46.973 [INFO] Apache Beam :: SDKs :: Java :: Maven Archetypes :: Examples
SUCCESS [ 34.719 s]
2017-05-31T08:25:46.973 [INFO] Apache Beam :: Examples :: Java 8 .................. SUCCESS
[ 26.074 s]
2017-05-31T08:25:46.973 [INFO] Apache Beam :: SDKs :: Java :: Maven Archetypes :: Examples
- Java 8 SUCCESS [ 27.459 s]
2017-05-31T08:25:46.973 [INFO] Apache Beam :: SDKs :: Java :: Extensions :: Jackson SUCCESS
[ 15.081 s]
2017-05-31T08:25:46.973 [INFO] Apache Beam :: SDKs :: Java :: Extensions :: Join library SUCCESS
[ 16.833 s]
2017-05-31T08:25:46.973 [INFO] Apache Beam :: SDKs :: Java :: Extensions :: Sorter  SUCCESS
[ 29.120 s]
2017-05-31T08:25:46.973 [INFO] Apache Beam :: SDKs :: Java :: Harness ............. SUCCESS
[ 33.002 s]
2017-05-31T08:25:46.973 [INFO] Apache Beam :: SDKs :: Java :: Java 8 Tests ........ SUCCESS
[  9.766 s]
2017-05-31T08:25:46.973 [INFO] Apache Beam :: SDKs :: Python ...................... SUCCESS
[23:58 min]
2017-05-31T08:25:46.973 [INFO] Apache Beam :: Runners :: Flink .................... FAILURE
[ 25.635 s]
2017-05-31T08:25:46.973 [INFO] Apache Beam :: Runners :: Spark .................... SKIPPED
2017-05-31T08:25:46.973 [INFO] Apache Beam :: Runners :: Apex ..................... SKIPPED
2017-05-31T08:25:46.973 [INFO] Apache Beam :: SDKs :: Java :: Aggregated Javadoc .. SKIPPED
2017-05-31T08:25:46.973 [INFO] ------------------------------------------------------------------------
2017-05-31T08:25:46.973 [INFO] BUILD FAILURE
2017-05-31T08:25:46.973 [INFO] ------------------------------------------------------------------------
2017-05-31T08:25:46.973 [INFO] Total time: 01:04 h
2017-05-31T08:25:46.973 [INFO] Finished at: 2017-05-31T08:25:46+00:00
2017-05-31T08:25:47.593 [INFO] Final Memory: 273M/1704M
2017-05-31T08:25:47.594 [INFO] ------------------------------------------------------------------------
Waiting for Jenkins to finish collecting data
2017-05-31T08:26:20.728 [ERROR] Failed to execute goal org.codehaus.mojo:findbugs-maven-plugin:3.0.4:check
(default) on project beam-runners-flink_2.10: failed with 2 bugs and 0 errors -> [Help
1]
org.apache.maven.lifecycle.LifecycleExecutionException: Failed to execute goal org.codehaus.mojo:findbugs-maven-plugin:3.0.4:check
(default) on project beam-runners-flink_2.10: failed with 2 bugs and 0 errors 
	at org.apache.maven.lifecycle.internal.MojoExecutor.execute(MojoExecutor.java:216)
	at org.apache.maven.lifecycle.internal.MojoExecutor.execute(MojoExecutor.java:153)
	at org.apache.maven.lifecycle.internal.MojoExecutor.execute(MojoExecutor.java:145)
	at org.apache.maven.lifecycle.internal.LifecycleModuleBuilder.buildProject(LifecycleModuleBuilder.java:116)
	at org.apache.maven.lifecycle.internal.LifecycleModuleBuilder.buildProject(LifecycleModuleBuilder.java:80)
	at org.apache.maven.lifecycle.internal.builder.singlethreaded.SingleThreadedBuilder.build(SingleThreadedBuilder.java:51)
	at org.apache.maven.lifecycle.internal.LifecycleStarter.execute(LifecycleStarter.java:128)
	at org.apache.maven.DefaultMaven.doExecute(DefaultMaven.java:307)
	at org.apache.maven.DefaultMaven.doExecute(DefaultMaven.java:193)
	at org.apache.maven.DefaultMaven.execute(DefaultMaven.java:106)
	at org.jvnet.hudson.maven3.launcher.Maven33Launcher.main(Maven33Launcher.java:129)
	at sun.reflect.NativeMethodAccessorImpl.invoke0(Native Method)
	at sun.reflect.NativeMethodAccessorImpl.invoke(NativeMethodAccessorImpl.java:62)
	at sun.reflect.DelegatingMethodAccessorImpl.invoke(DelegatingMethodAccessorImpl.java:43)
	at java.lang.reflect.Method.invoke(Method.java:498)
	at org.codehaus.plexus.classworlds.launcher.Launcher.launchStandard(Launcher.java:330)
	at org.codehaus.plexus.classworlds.launcher.Launcher.launch(Launcher.java:238)
	at jenkins.maven3.agent.Maven33Main.launch(Maven33Main.java:176)
	at sun.reflect.NativeMethodAccessorImpl.invoke0(Native Method)
	at sun.reflect.NativeMethodAccessorImpl.invoke(NativeMethodAccessorImpl.java:62)
	at sun.reflect.DelegatingMethodAccessorImpl.invoke(DelegatingMethodAccessorImpl.java:43)
	at java.lang.reflect.Method.invoke(Method.java:498)
	at hudson.maven.Maven3Builder.call(Maven3Builder.java:139)
	at hudson.maven.Maven3Builder.call(Maven3Builder.java:70)
	at hudson.remoting.UserRequest.perform(UserRequest.java:153)
	at hudson.remoting.UserRequest.perform(UserRequest.java:50)
	at hudson.remoting.Request$2.run(Request.java:336)
	at hudson.remoting.InterceptingExecutorService$1.call(InterceptingExecutorService.java:68)
	at java.util.concurrent.FutureTask.run(FutureTask.java:266)
	at java.util.concurrent.ThreadPoolExecutor.runWorker(ThreadPoolExecutor.java:1142)
	at java.util.concurrent.ThreadPoolExecutor$Worker.run(ThreadPoolExecutor.java:617)
	at java.lang.Thread.run(Thread.java:745)
Caused by: org.apache.maven.plugin.MojoExecutionException: failed with 2 bugs and 0 errors

	at sun.reflect.NativeConstructorAccessorImpl.newInstance0(Native Method)
	at sun.reflect.NativeConstructorAccessorImpl.newInstance(NativeConstructorAccessorImpl.java:62)
	at sun.reflect.DelegatingConstructorAccessorImpl.newInstance(DelegatingConstructorAccessorImpl.java:45)
	at java.lang.reflect.Constructor.newInstance(Constructor.java:423)
	at org.codehaus.groovy.reflection.CachedConstructor.invoke(CachedConstructor.java:83)
	at org.codehaus.groovy.reflection.CachedConstructor.doConstructorInvoke(CachedConstructor.java:77)
	at org.codehaus.groovy.runtime.callsite.ConstructorSite$ConstructorSiteNoUnwrap.callConstructor(ConstructorSite.java:84)
	at org.codehaus.groovy.runtime.callsite.CallSiteArray.defaultCallConstructor(CallSiteArray.java:60)
	at org.codehaus.groovy.runtime.callsite.AbstractCallSite.callConstructor(AbstractCallSite.java:235)
	at org.codehaus.groovy.runtime.callsite.AbstractCallSite.callConstructor(AbstractCallSite.java:247)
	at org.codehaus.mojo.findbugs.FindbugsViolationCheckMojo.execute(FindbugsViolationCheckMojo.groovy:529)
	at org.apache.maven.plugin.DefaultBuildPluginManager.executeMojo(DefaultBuildPluginManager.java:134)
	at org.apache.maven.lifecycle.internal.MojoExecutor.execute(MojoExecutor.java:208)
	... 31 more
2017-05-31T08:26:20.729 [ERROR] 
2017-05-31T08:26:20.729 [ERROR] Re-run Maven using the -X switch to enable full debug logging.
2017-05-31T08:26:20.729 [ERROR] 
2017-05-31T08:26:20.729 [ERROR] For more information about the errors and possible solutions,
please read the following articles:
2017-05-31T08:26:20.729 [ERROR] [Help 1] http://cwiki.apache.org/confluence/display/MAVEN/MojoExecutionException
2017-05-31T08:26:20.730 [ERROR] 
2017-05-31T08:26:20.730 [ERROR] After correcting the problems, you can resume the build with
the command
2017-05-31T08:26:20.730 [ERROR]   mvn <goals> -rf :beam-runners-flink_2.10
channel stopped
Not sending mail to unregistered user kirpichov@google.com
Not sending mail to unregistered user aljoscha.krettek@gmail.com

Mime
View raw message