beam-commits mailing list archives

Site index · List index
Message view « Date » · « Thread »
Top « Date » · « Thread »
From Apache Jenkins Server <jenk...@builds.apache.org>
Subject Build failed in Jenkins: beam_PostCommit_Java_ValidatesRunner_Apex #1587
Date Sun, 28 May 2017 12:02:41 GMT
See <https://builds.apache.org/job/beam_PostCommit_Java_ValidatesRunner_Apex/1587/display/redirect>

------------------------------------------
[...truncated 277.35 KB...]
2017-05-28T12:02:20.567 [INFO] skip non existing resourceDirectory <https://builds.apache.org/job/beam_PostCommit_Java_ValidatesRunner_Apex/ws/sdks/common/fn-api/target/original_sources_to_package>
2017-05-28T12:02:20.567 [INFO] Copying 1 resource
2017-05-28T12:02:20.568 [INFO] Copying 1 resource
2017-05-28T12:02:20.569 [INFO] Copying 3 resources
2017-05-28T12:02:20.619 [INFO] 
2017-05-28T12:02:20.619 [INFO] --- maven-compiler-plugin:3.6.1:compile (default-compile) @
beam-sdks-common-fn-api ---
2017-05-28T12:02:20.625 [INFO] Changes detected - recompiling the module!
2017-05-28T12:02:20.626 [INFO] Compiling 5 source files to <https://builds.apache.org/job/beam_PostCommit_Java_ValidatesRunner_Apex/ws/sdks/common/fn-api/target/classes>
2017-05-28T12:02:23.208 [WARNING] bootstrap class path not set in conjunction with -source
1.7
2017-05-28T12:02:23.258 [INFO] 
2017-05-28T12:02:23.258 [INFO] --- maven-resources-plugin:3.0.2:testResources (default-testResources)
@ beam-sdks-common-fn-api ---
2017-05-28T12:02:23.261 [INFO] Using 'UTF-8' encoding to copy filtered resources.
2017-05-28T12:02:23.261 [INFO] Copying 1 resource
2017-05-28T12:02:23.262 [INFO] Copying 3 resources
2017-05-28T12:02:23.348 [INFO] 
2017-05-28T12:02:23.348 [INFO] --- maven-compiler-plugin:3.6.1:testCompile (default-testCompile)
@ beam-sdks-common-fn-api ---
2017-05-28T12:02:23.353 [INFO] No sources to compile
2017-05-28T12:02:23.402 [INFO] 
2017-05-28T12:02:23.402 [INFO] --- maven-checkstyle-plugin:2.17:check (default) @ beam-sdks-common-fn-api
---
2017-05-28T12:02:23.452 [INFO] 
2017-05-28T12:02:23.452 [INFO] >>> findbugs-maven-plugin:3.0.4:check (default) >
:findbugs @ beam-sdks-common-fn-api >>>
2017-05-28T12:02:23.455 [INFO] 
2017-05-28T12:02:23.456 [INFO] --- findbugs-maven-plugin:3.0.4:findbugs (findbugs) @ beam-sdks-common-fn-api
---
2017-05-28T12:02:23.460 [INFO] Downloading: https://repo.maven.apache.org/maven2/com/google/code/findbugs/findbugs/3.0.1/findbugs-3.0.1.pom
2017-05-28T12:02:23.488 [INFO] Downloaded: https://repo.maven.apache.org/maven2/com/google/code/findbugs/findbugs/3.0.1/findbugs-3.0.1.pom
(11 KB at 375.5 KB/sec)
2017-05-28T12:02:23.491 [INFO] Downloading: https://repo.maven.apache.org/maven2/net/jcip/jcip-annotations/1.0/jcip-annotations-1.0.pom
2017-05-28T12:02:23.517 [INFO] Downloaded: https://repo.maven.apache.org/maven2/net/jcip/jcip-annotations/1.0/jcip-annotations-1.0.pom
(491 B at 18.4 KB/sec)
2017-05-28T12:02:23.519 [INFO] Downloading: https://repo.maven.apache.org/maven2/com/google/code/findbugs/bcel-findbugs/6.0/bcel-findbugs-6.0.pom
2017-05-28T12:02:23.545 [INFO] Downloaded: https://repo.maven.apache.org/maven2/com/google/code/findbugs/bcel-findbugs/6.0/bcel-findbugs-6.0.pom
(4 KB at 144.6 KB/sec)
2017-05-28T12:02:23.547 [INFO] Downloading: https://repo.maven.apache.org/maven2/com/google/code/findbugs/jFormatString/2.0.1/jFormatString-2.0.1.pom
2017-05-28T12:02:23.573 [INFO] Downloaded: https://repo.maven.apache.org/maven2/com/google/code/findbugs/jFormatString/2.0.1/jFormatString-2.0.1.pom
(950 B at 35.7 KB/sec)
2017-05-28T12:02:23.576 [INFO] Downloading: https://repo.maven.apache.org/maven2/dom4j/dom4j/1.6.1/dom4j-1.6.1.pom
2017-05-28T12:02:23.603 [INFO] Downloaded: https://repo.maven.apache.org/maven2/dom4j/dom4j/1.6.1/dom4j-1.6.1.pom
(7 KB at 244.7 KB/sec)
2017-05-28T12:02:23.604 [INFO] Downloading: https://repo.maven.apache.org/maven2/org/ow2/asm/asm-debug-all/5.0.2/asm-debug-all-5.0.2.pom
2017-05-28T12:02:23.631 [INFO] Downloaded: https://repo.maven.apache.org/maven2/org/ow2/asm/asm-debug-all/5.0.2/asm-debug-all-5.0.2.pom
(2 KB at 71.7 KB/sec)
2017-05-28T12:02:23.633 [INFO] Downloading: https://repo.maven.apache.org/maven2/org/ow2/asm/asm-commons/5.0.2/asm-commons-5.0.2.pom
2017-05-28T12:02:23.658 [INFO] Downloaded: https://repo.maven.apache.org/maven2/org/ow2/asm/asm-commons/5.0.2/asm-commons-5.0.2.pom
(3 KB at 81.8 KB/sec)
2017-05-28T12:02:23.660 [INFO] Downloading: https://repo.maven.apache.org/maven2/org/ow2/asm/asm-tree/5.0.2/asm-tree-5.0.2.pom
2017-05-28T12:02:23.687 [INFO] Downloaded: https://repo.maven.apache.org/maven2/org/ow2/asm/asm-tree/5.0.2/asm-tree-5.0.2.pom
(3 KB at 75.3 KB/sec)
2017-05-28T12:02:23.689 [INFO] Downloading: https://repo.maven.apache.org/maven2/jaxen/jaxen/1.1.6/jaxen-1.1.6.pom
2017-05-28T12:02:23.716 [INFO] Downloaded: https://repo.maven.apache.org/maven2/jaxen/jaxen/1.1.6/jaxen-1.1.6.pom
(14 KB at 492.0 KB/sec)
2017-05-28T12:02:23.718 [INFO] Downloading: https://repo.maven.apache.org/maven2/org/apache/ant/ant/1.9.4/ant-1.9.4.pom
2017-05-28T12:02:23.746 [INFO] Downloaded: https://repo.maven.apache.org/maven2/org/apache/ant/ant/1.9.4/ant-1.9.4.pom
(10 KB at 335.7 KB/sec)
2017-05-28T12:02:23.749 [INFO] Downloading: https://repo.maven.apache.org/maven2/org/apache/ant/ant-parent/1.9.4/ant-parent-1.9.4.pom
2017-05-28T12:02:23.776 [INFO] Downloaded: https://repo.maven.apache.org/maven2/org/apache/ant/ant-parent/1.9.4/ant-parent-1.9.4.pom
(6 KB at 202.7 KB/sec)
2017-05-28T12:02:23.779 [INFO] Downloading: https://repo.maven.apache.org/maven2/org/apache/ant/ant-launcher/1.9.4/ant-launcher-1.9.4.pom
2017-05-28T12:02:23.805 [INFO] Downloaded: https://repo.maven.apache.org/maven2/org/apache/ant/ant-launcher/1.9.4/ant-launcher-1.9.4.pom
(3 KB at 87.7 KB/sec)
2017-05-28T12:02:23.808 [INFO] Downloading: https://repo.maven.apache.org/maven2/org/codehaus/groovy/groovy/2.4.7/groovy-2.4.7.pom
2017-05-28T12:02:23.838 [INFO] Downloaded: https://repo.maven.apache.org/maven2/org/codehaus/groovy/groovy/2.4.7/groovy-2.4.7.pom
(17 KB at 550.3 KB/sec)
2017-05-28T12:02:23.841 [INFO] Downloading: https://repo.maven.apache.org/maven2/org/codehaus/groovy/groovy-ant/2.4.7/groovy-ant-2.4.7.pom
2017-05-28T12:02:23.870 [INFO] Downloaded: https://repo.maven.apache.org/maven2/org/codehaus/groovy/groovy-ant/2.4.7/groovy-ant-2.4.7.pom
(17 KB at 556.5 KB/sec)
2017-05-28T12:02:23.873 [INFO] Downloading: https://repo.maven.apache.org/maven2/org/apache/ant/ant-antlr/1.9.4/ant-antlr-1.9.4.pom
2017-05-28T12:02:23.899 [INFO] Downloaded: https://repo.maven.apache.org/maven2/org/apache/ant/ant-antlr/1.9.4/ant-antlr-1.9.4.pom
(4 KB at 115.5 KB/sec)
2017-05-28T12:02:23.901 [INFO] Downloading: https://repo.maven.apache.org/maven2/org/codehaus/groovy/groovy-groovydoc/2.4.7/groovy-groovydoc-2.4.7.pom
2017-05-28T12:02:23.928 [INFO] Downloaded: https://repo.maven.apache.org/maven2/org/codehaus/groovy/groovy-groovydoc/2.4.7/groovy-groovydoc-2.4.7.pom
(16 KB at 566.9 KB/sec)
2017-05-28T12:02:23.930 [INFO] Downloading: https://repo.maven.apache.org/maven2/org/codehaus/groovy/groovy-templates/2.4.7/groovy-templates-2.4.7.pom
2017-05-28T12:02:23.959 [INFO] Downloaded: https://repo.maven.apache.org/maven2/org/codehaus/groovy/groovy-templates/2.4.7/groovy-templates-2.4.7.pom
(16 KB at 546.6 KB/sec)
2017-05-28T12:02:23.962 [INFO] Downloading: https://repo.maven.apache.org/maven2/org/codehaus/groovy/groovy-xml/2.4.7/groovy-xml-2.4.7.pom
2017-05-28T12:02:23.989 [INFO] Downloaded: https://repo.maven.apache.org/maven2/org/codehaus/groovy/groovy-xml/2.4.7/groovy-xml-2.4.7.pom
(16 KB at 560.0 KB/sec)
2017-05-28T12:02:23.991 [INFO] Downloading: https://repo.maven.apache.org/maven2/org/apache/ant/ant-junit/1.9.4/ant-junit-1.9.4.pom
2017-05-28T12:02:24.017 [INFO] Downloaded: https://repo.maven.apache.org/maven2/org/apache/ant/ant-junit/1.9.4/ant-junit-1.9.4.pom
(4 KB at 152.2 KB/sec)
2017-05-28T12:02:24.019 [INFO] Downloading: https://repo.maven.apache.org/maven2/org/apache/maven/reporting/maven-reporting-impl/2.1/maven-reporting-impl-2.1.pom
2017-05-28T12:02:24.046 [INFO] Downloaded: https://repo.maven.apache.org/maven2/org/apache/maven/reporting/maven-reporting-impl/2.1/maven-reporting-impl-2.1.pom
(5 KB at 163.6 KB/sec)
2017-05-28T12:02:24.050 [INFO] Downloading: https://repo.maven.apache.org/maven2/org/apache/maven/maven-project/2.0.10/maven-project-2.0.10.pom
2017-05-28T12:02:24.076 [INFO] Downloaded: https://repo.maven.apache.org/maven2/org/apache/maven/maven-project/2.0.10/maven-project-2.0.10.pom
(3 KB at 111.2 KB/sec)
2017-05-28T12:02:24.078 [INFO] Downloading: https://repo.maven.apache.org/maven2/org/apache/maven/maven/2.0.10/maven-2.0.10.pom
2017-05-28T12:02:24.107 [INFO] Downloaded: https://repo.maven.apache.org/maven2/org/apache/maven/maven/2.0.10/maven-2.0.10.pom
(24 KB at 817.7 KB/sec)
2017-05-28T12:02:24.112 [INFO] Downloading: https://repo.maven.apache.org/maven2/org/apache/maven/maven-settings/2.0.10/maven-settings-2.0.10.pom
2017-05-28T12:02:24.138 [INFO] Downloaded: https://repo.maven.apache.org/maven2/org/apache/maven/maven-settings/2.0.10/maven-settings-2.0.10.pom
(3 KB at 87.4 KB/sec)
2017-05-28T12:02:24.141 [INFO] Downloading: https://repo.maven.apache.org/maven2/org/apache/maven/maven-model/2.0.10/maven-model-2.0.10.pom
2017-05-28T12:02:24.167 [INFO] Downloaded: https://repo.maven.apache.org/maven2/org/apache/maven/maven-model/2.0.10/maven-model-2.0.10.pom
(4 KB at 125.3 KB/sec)
2017-05-28T12:02:24.169 [INFO] Downloading: https://repo.maven.apache.org/maven2/org/codehaus/plexus/plexus-interpolation/1.1/plexus-interpolation-1.1.pom
2017-05-28T12:02:24.194 [INFO] Downloaded: https://repo.maven.apache.org/maven2/org/codehaus/plexus/plexus-interpolation/1.1/plexus-interpolation-1.1.pom
(2 KB at 56.1 KB/sec)
2017-05-28T12:02:24.196 [INFO] Downloading: https://repo.maven.apache.org/maven2/org/apache/maven/maven-profile/2.0.10/maven-profile-2.0.10.pom
2017-05-28T12:02:24.222 [INFO] Downloaded: https://repo.maven.apache.org/maven2/org/apache/maven/maven-profile/2.0.10/maven-profile-2.0.10.pom
(3 KB at 78.7 KB/sec)
2017-05-28T12:02:24.227 [INFO] Downloading: https://repo.maven.apache.org/maven2/org/apache/maven/maven-artifact-manager/2.0.10/maven-artifact-manager-2.0.10.pom
2017-05-28T12:02:24.253 [INFO] Downloaded: https://repo.maven.apache.org/maven2/org/apache/maven/maven-artifact-manager/2.0.10/maven-artifact-manager-2.0.10.pom
(3 KB at 97.7 KB/sec)
2017-05-28T12:02:24.257 [INFO] Downloading: https://repo.maven.apache.org/maven2/org/apache/maven/maven-repository-metadata/2.0.10/maven-repository-metadata-2.0.10.pom
2017-05-28T12:02:24.284 [INFO] Downloaded: https://repo.maven.apache.org/maven2/org/apache/maven/maven-repository-metadata/2.0.10/maven-repository-metadata-2.0.10.pom
(3 KB at 83.7 KB/sec)
2017-05-28T12:02:24.288 [INFO] Downloading: https://repo.maven.apache.org/maven2/org/apache/maven/maven-artifact/2.0.10/maven-artifact-2.0.10.pom
2017-05-28T12:02:24.315 [INFO] Downloaded: https://repo.maven.apache.org/maven2/org/apache/maven/maven-artifact/2.0.10/maven-artifact-2.0.10.pom
(2 KB at 58.6 KB/sec)
2017-05-28T12:02:24.318 [INFO] Downloading: https://repo.maven.apache.org/maven2/org/apache/maven/maven-plugin-registry/2.0.10/maven-plugin-registry-2.0.10.pom
2017-05-28T12:02:24.345 [INFO] Downloaded: https://repo.maven.apache.org/maven2/org/apache/maven/maven-plugin-registry/2.0.10/maven-plugin-registry-2.0.10.pom
(2 KB at 72.9 KB/sec)
2017-05-28T12:02:24.349 [INFO] Downloading: https://repo.maven.apache.org/maven2/org/apache/maven/doxia/doxia-sink-api/1.1.2/doxia-sink-api-1.1.2.pom
2017-05-28T12:02:24.373 [INFO] Downloaded: https://repo.maven.apache.org/maven2/org/apache/maven/doxia/doxia-sink-api/1.1.2/doxia-sink-api-1.1.2.pom
(2 KB at 64.1 KB/sec)
2017-05-28T12:02:24.375 [INFO] Downloading: https://repo.maven.apache.org/maven2/org/apache/maven/doxia/doxia/1.1.2/doxia-1.1.2.pom
2017-05-28T12:02:24.403 [INFO] Downloaded: https://repo.maven.apache.org/maven2/org/apache/maven/doxia/doxia/1.1.2/doxia-1.1.2.pom
(18 KB at 633.2 KB/sec)
2017-05-28T12:02:24.408 [INFO] Downloading: https://repo.maven.apache.org/maven2/org/apache/maven/doxia/doxia-logging-api/1.1.2/doxia-logging-api-1.1.2.pom
2017-05-28T12:02:24.433 [INFO] Downloaded: https://repo.maven.apache.org/maven2/org/apache/maven/doxia/doxia-logging-api/1.1.2/doxia-logging-api-1.1.2.pom
(2 KB at 59.3 KB/sec)
2017-05-28T12:02:24.436 [INFO] Downloading: https://repo.maven.apache.org/maven2/org/apache/maven/doxia/doxia-core/1.1.2/doxia-core-1.1.2.pom
2017-05-28T12:02:24.462 [INFO] Downloaded: https://repo.maven.apache.org/maven2/org/apache/maven/doxia/doxia-core/1.1.2/doxia-core-1.1.2.pom
(4 KB at 139.7 KB/sec)
2017-05-28T12:02:24.465 [INFO] Downloading: https://repo.maven.apache.org/maven2/org/codehaus/plexus/plexus-utils/1.5.12/plexus-utils-1.5.12.pom
2017-05-28T12:02:24.492 [INFO] Downloaded: https://repo.maven.apache.org/maven2/org/codehaus/plexus/plexus-utils/1.5.12/plexus-utils-1.5.12.pom
(6 KB at 203.8 KB/sec)
2017-05-28T12:02:24.495 [INFO] Downloading: https://repo.maven.apache.org/maven2/xerces/xercesImpl/2.8.1/xercesImpl-2.8.1.pom
2017-05-28T12:02:24.521 [INFO] Downloaded: https://repo.maven.apache.org/maven2/xerces/xercesImpl/2.8.1/xercesImpl-2.8.1.pom
(3 KB at 82.9 KB/sec)
2017-05-28T12:02:24.523 [INFO] Downloading: https://repo.maven.apache.org/maven2/xml-apis/xml-apis/1.3.03/xml-apis-1.3.03.pom
2017-05-28T12:02:24.551 [INFO] Downloaded: https://repo.maven.apache.org/maven2/xml-apis/xml-apis/1.3.03/xml-apis-1.3.03.pom
(738 B at 24.9 KB/sec)
2017-05-28T12:02:24.553 [INFO] Downloading: https://repo.maven.apache.org/maven2/org/apache/apache/1/apache-1.pom
2017-05-28T12:02:24.579 [INFO] Downloaded: https://repo.maven.apache.org/maven2/org/apache/apache/1/apache-1.pom
(4 KB at 128.1 KB/sec)
2017-05-28T12:02:24.581 [INFO] Downloading: https://repo.maven.apache.org/maven2/commons-httpclient/commons-httpclient/3.1/commons-httpclient-3.1.pom
2017-05-28T12:02:24.608 [INFO] Downloaded: https://repo.maven.apache.org/maven2/commons-httpclient/commons-httpclient/3.1/commons-httpclient-3.1.pom
(8 KB at 280.8 KB/sec)
2017-05-28T12:02:24.610 [INFO] Downloading: https://repo.maven.apache.org/maven2/commons-codec/commons-codec/1.2/commons-codec-1.2.pom
2017-05-28T12:02:24.636 [INFO] Downloaded: https://repo.maven.apache.org/maven2/commons-codec/commons-codec/1.2/commons-codec-1.2.pom
(4 KB at 143.7 KB/sec)
2017-05-28T12:02:24.639 [INFO] Downloading: https://repo.maven.apache.org/maven2/org/apache/maven/doxia/doxia-site-renderer/1.1.2/doxia-site-renderer-1.1.2.pom
2017-05-28T12:02:24.666 [INFO] Downloaded: https://repo.maven.apache.org/maven2/org/apache/maven/doxia/doxia-site-renderer/1.1.2/doxia-site-renderer-1.1.2.pom
(6 KB at 221.4 KB/sec)
2017-05-28T12:02:24.667 [INFO] Downloading: https://repo.maven.apache.org/maven2/org/apache/maven/doxia/doxia-sitetools/1.1.2/doxia-sitetools-1.1.2.pom
2017-05-28T12:02:24.695 [INFO] Downloaded: https://repo.maven.apache.org/maven2/org/apache/maven/doxia/doxia-sitetools/1.1.2/doxia-sitetools-1.1.2.pom
(15 KB at 533.1 KB/sec)
2017-05-28T12:02:24.698 [INFO] Downloading: https://repo.maven.apache.org/maven2/org/apache/maven/doxia/doxia-decoration-model/1.1.2/doxia-decoration-model-1.1.2.pom
2017-05-28T12:02:24.723 [INFO] Downloaded: https://repo.maven.apache.org/maven2/org/apache/maven/doxia/doxia-decoration-model/1.1.2/doxia-decoration-model-1.1.2.pom
(3 KB at 111.7 KB/sec)
2017-05-28T12:02:24.726 [INFO] Downloading: https://repo.maven.apache.org/maven2/org/apache/maven/doxia/doxia-module-xhtml/1.1.2/doxia-module-xhtml-1.1.2.pom
2017-05-28T12:02:24.752 [INFO] Downloaded: https://repo.maven.apache.org/maven2/org/apache/maven/doxia/doxia-module-xhtml/1.1.2/doxia-module-xhtml-1.1.2.pom
(2 KB at 60.2 KB/sec)
2017-05-28T12:02:24.754 [INFO] Downloading: https://repo.maven.apache.org/maven2/org/apache/maven/doxia/doxia-modules/1.1.2/doxia-modules-1.1.2.pom
2017-05-28T12:02:24.780 [INFO] Downloaded: https://repo.maven.apache.org/maven2/org/apache/maven/doxia/doxia-modules/1.1.2/doxia-modules-1.1.2.pom
(3 KB at 91.5 KB/sec)
2017-05-28T12:02:24.782 [INFO] Downloading: https://repo.maven.apache.org/maven2/org/apache/maven/doxia/doxia-module-fml/1.1.2/doxia-module-fml-1.1.2.pom
2017-05-28T12:02:24.808 [INFO] Downloaded: https://repo.maven.apache.org/maven2/org/apache/maven/doxia/doxia-module-fml/1.1.2/doxia-module-fml-1.1.2.pom
(6 KB at 206.4 KB/sec)
2017-05-28T12:02:24.811 [INFO] Downloading: https://repo.maven.apache.org/maven2/commons-validator/commons-validator/1.2.0/commons-validator-1.2.0.pom
2017-05-28T12:02:24.837 [INFO] Downloaded: https://repo.maven.apache.org/maven2/commons-validator/commons-validator/1.2.0/commons-validator-1.2.0.pom
(9 KB at 354.8 KB/sec)
2017-05-28T12:02:24.839 [INFO] Downloading: https://repo.maven.apache.org/maven2/xml-apis/xml-apis/2.0.2/xml-apis-2.0.2.pom
2017-05-28T12:02:24.863 [INFO] Downloaded: https://repo.maven.apache.org/maven2/xml-apis/xml-apis/2.0.2/xml-apis-2.0.2.pom
(346 B at 14.1 KB/sec)
2017-05-28T12:02:24.869 [INFO] Downloading: https://repo.maven.apache.org/maven2/org/apache/maven/maven-plugin-api/2.0/maven-plugin-api-2.0.pom
2017-05-28T12:02:24.894 [INFO] Downloaded: https://repo.maven.apache.org/maven2/org/apache/maven/maven-plugin-api/2.0/maven-plugin-api-2.0.pom
(601 B at 23.5 KB/sec)
2017-05-28T12:02:24.895 [INFO] Downloading: https://repo.maven.apache.org/maven2/org/apache/maven/maven/2.0/maven-2.0.pom
2017-05-28T12:02:24.920 [INFO] Downloaded: https://repo.maven.apache.org/maven2/org/apache/maven/maven/2.0/maven-2.0.pom
(9 KB at 342.5 KB/sec)
2017-05-28T12:02:24.924 [INFO] Downloading: https://repo.maven.apache.org/maven2/org/apache/maven/shared/maven-doxia-tools/1.2.1/maven-doxia-tools-1.2.1.pom
2017-05-28T12:02:24.950 [INFO] Downloaded: https://repo.maven.apache.org/maven2/org/apache/maven/shared/maven-doxia-tools/1.2.1/maven-doxia-tools-1.2.1.pom
(7 KB at 237.0 KB/sec)
2017-05-28T12:02:24.954 [INFO] Downloading: https://repo.maven.apache.org/maven2/org/apache/maven/doxia/doxia-logging-api/1.1.3/doxia-logging-api-1.1.3.pom
2017-05-28T12:02:24.981 [INFO] Downloaded: https://repo.maven.apache.org/maven2/org/apache/maven/doxia/doxia-logging-api/1.1.3/doxia-logging-api-1.1.3.pom
(2 KB at 55.1 KB/sec)
2017-05-28T12:02:24.982 [INFO] Downloading: https://repo.maven.apache.org/maven2/org/apache/maven/doxia/doxia/1.1.3/doxia-1.1.3.pom
2017-05-28T12:02:25.010 [INFO] Downloaded: https://repo.maven.apache.org/maven2/org/apache/maven/doxia/doxia/1.1.3/doxia-1.1.3.pom
(19 KB at 648.9 KB/sec)
2017-05-28T12:02:25.013 [INFO] Downloading: https://repo.maven.apache.org/maven2/org/apache/maven/doxia/doxia-decoration-model/1.1.3/doxia-decoration-model-1.1.3.pom
2017-05-28T12:02:25.039 [INFO] Downloaded: https://repo.maven.apache.org/maven2/org/apache/maven/doxia/doxia-decoration-model/1.1.3/doxia-decoration-model-1.1.3.pom
(3 KB at 111.7 KB/sec)
2017-05-28T12:02:25.041 [INFO] Downloading: https://repo.maven.apache.org/maven2/org/apache/maven/doxia/doxia-sitetools/1.1.3/doxia-sitetools-1.1.3.pom
2017-05-28T12:02:25.069 [INFO] Downloaded: https://repo.maven.apache.org/maven2/org/apache/maven/doxia/doxia-sitetools/1.1.3/doxia-sitetools-1.1.3.pom
(16 KB at 549.0 KB/sec)
2017-05-28T12:02:25.080 [INFO] Downloading: https://repo.maven.apache.org/maven2/com/google/code/findbugs/findbugs/3.0.1/findbugs-3.0.1.jar
2017-05-28T12:02:25.080 [INFO] Downloading: https://repo.maven.apache.org/maven2/net/jcip/jcip-annotations/1.0/jcip-annotations-1.0.jar
2017-05-28T12:02:25.081 [INFO] Downloading: https://repo.maven.apache.org/maven2/com/google/code/findbugs/bcel-findbugs/6.0/bcel-findbugs-6.0.jar
2017-05-28T12:02:25.081 [INFO] Downloading: https://repo.maven.apache.org/maven2/com/google/code/findbugs/jFormatString/2.0.1/jFormatString-2.0.1.jar
2017-05-28T12:02:25.082 [INFO] Downloading: https://repo.maven.apache.org/maven2/dom4j/dom4j/1.6.1/dom4j-1.6.1.jar
2017-05-28T12:02:25.110 [INFO] Downloaded: https://repo.maven.apache.org/maven2/net/jcip/jcip-annotations/1.0/jcip-annotations-1.0.jar
(3 KB at 71.0 KB/sec)
2017-05-28T12:02:25.110 [INFO] Downloading: https://repo.maven.apache.org/maven2/xml-apis/xml-apis/1.0.b2/xml-apis-1.0.b2.jar
2017-05-28T12:02:25.111 [INFO] Downloaded: https://repo.maven.apache.org/maven2/com/google/code/findbugs/jFormatString/2.0.1/jFormatString-2.0.1.jar
(27 KB at 859.1 KB/sec)
2017-05-28T12:02:25.111 [INFO] Downloading: https://repo.maven.apache.org/maven2/org/ow2/asm/asm-debug-all/5.0.2/asm-debug-all-5.0.2.jar
2017-05-28T12:02:25.160 [INFO] Downloaded: https://repo.maven.apache.org/maven2/xml-apis/xml-apis/1.0.b2/xml-apis-1.0.b2.jar
(107 KB at 1351.3 KB/sec)
2017-05-28T12:02:25.160 [INFO] Downloading: https://repo.maven.apache.org/maven2/org/ow2/asm/asm-commons/5.0.2/asm-commons-5.0.2.jar
2017-05-28T12:02:25.168 [INFO] Downloaded: https://repo.maven.apache.org/maven2/dom4j/dom4j/1.6.1/dom4j-1.6.1.jar
(307 KB at 3564.4 KB/sec)
2017-05-28T12:02:25.168 [INFO] Downloading: https://repo.maven.apache.org/maven2/org/ow2/asm/asm-tree/5.0.2/asm-tree-5.0.2.jar
2017-05-28T12:02:25.185 [INFO] Downloaded: https://repo.maven.apache.org/maven2/com/google/code/findbugs/bcel-findbugs/6.0/bcel-findbugs-6.0.jar
(599 KB at 5695.5 KB/sec)
2017-05-28T12:02:25.185 [INFO] Downloading: https://repo.maven.apache.org/maven2/jaxen/jaxen/1.1.6/jaxen-1.1.6.jar
2017-05-28T12:02:25.190 [INFO] Downloaded: https://repo.maven.apache.org/maven2/org/ow2/asm/asm-commons/5.0.2/asm-commons-5.0.2.jar
(41 KB at 373.8 KB/sec)
2017-05-28T12:02:25.190 [INFO] Downloading: https://repo.maven.apache.org/maven2/org/apache/ant/ant/1.9.4/ant-1.9.4.jar
2017-05-28T12:02:25.196 [INFO] Downloaded: https://repo.maven.apache.org/maven2/org/ow2/asm/asm-tree/5.0.2/asm-tree-5.0.2.jar
(29 KB at 246.6 KB/sec)
2017-05-28T12:02:25.197 [INFO] Downloading: https://repo.maven.apache.org/maven2/org/apache/ant/ant-launcher/1.9.4/ant-launcher-1.9.4.jar
2017-05-28T12:02:25.200 [INFO] Downloaded: https://repo.maven.apache.org/maven2/org/ow2/asm/asm-debug-all/5.0.2/asm-debug-all-5.0.2.jar
(372 KB at 3121.0 KB/sec)
2017-05-28T12:02:25.200 [INFO] Downloading: https://repo.maven.apache.org/maven2/org/codehaus/groovy/groovy/2.4.7/groovy-2.4.7.jar
2017-05-28T12:02:25.224 [INFO] Downloaded: https://repo.maven.apache.org/maven2/org/apache/ant/ant-launcher/1.9.4/ant-launcher-1.9.4.jar
(18 KB at 125.5 KB/sec)
2017-05-28T12:02:25.225 [INFO] Downloading: https://repo.maven.apache.org/maven2/org/codehaus/groovy/groovy-ant/2.4.7/groovy-ant-2.4.7.jar
2017-05-28T12:02:25.263 [INFO] Downloaded: https://repo.maven.apache.org/maven2/org/codehaus/groovy/groovy-ant/2.4.7/groovy-ant-2.4.7.jar
(69 KB at 373.9 KB/sec)
2017-05-28T12:02:25.263 [INFO] Downloading: https://repo.maven.apache.org/maven2/org/apache/ant/ant-antlr/1.9.4/ant-antlr-1.9.4.jar
2017-05-28T12:02:25.264 [INFO] Downloaded: https://repo.maven.apache.org/maven2/jaxen/jaxen/1.1.6/jaxen-1.1.6.jar
(227 KB at 1237.4 KB/sec)
2017-05-28T12:02:25.264 [INFO] Downloading: https://repo.maven.apache.org/maven2/org/codehaus/groovy/groovy-groovydoc/2.4.7/groovy-groovydoc-2.4.7.jar
2017-05-28T12:02:25.311 [INFO] Downloaded: https://repo.maven.apache.org/maven2/org/apache/ant/ant-antlr/1.9.4/ant-antlr-1.9.4.jar
(12 KB at 49.3 KB/sec)
2017-05-28T12:02:25.311 [INFO] Downloading: https://repo.maven.apache.org/maven2/org/codehaus/groovy/groovy-templates/2.4.7/groovy-templates-2.4.7.jar
2017-05-28T12:02:25.319 [INFO] Downloaded: https://repo.maven.apache.org/maven2/org/codehaus/groovy/groovy-groovydoc/2.4.7/groovy-groovydoc-2.4.7.jar
(133 KB at 554.7 KB/sec)
2017-05-28T12:02:25.319 [INFO] Downloading: https://repo.maven.apache.org/maven2/org/apache/ant/ant-junit/1.9.4/ant-junit-1.9.4.jar
2017-05-28T12:02:25.363 [INFO] Downloaded: https://repo.maven.apache.org/maven2/org/codehaus/groovy/groovy-templates/2.4.7/groovy-templates-2.4.7.jar
(96 KB at 338.9 KB/sec)
2017-05-28T12:02:25.364 [INFO] Downloading: https://repo.maven.apache.org/maven2/org/codehaus/groovy/groovy-xml/2.4.7/groovy-xml-2.4.7.jar
2017-05-28T12:02:25.370 [INFO] Downloaded: https://repo.maven.apache.org/maven2/org/apache/ant/ant-junit/1.9.4/ant-junit-1.9.4.jar
(116 KB at 399.4 KB/sec)
2017-05-28T12:02:25.370 [INFO] Downloading: https://repo.maven.apache.org/maven2/org/apache/maven/reporting/maven-reporting-impl/2.1/maven-reporting-impl-2.1.jar
2017-05-28T12:02:25.413 [INFO] Downloaded: https://repo.maven.apache.org/maven2/org/apache/maven/reporting/maven-reporting-impl/2.1/maven-reporting-impl-2.1.jar
(17 KB at 48.9 KB/sec)
2017-05-28T12:02:25.414 [INFO] Downloading: https://repo.maven.apache.org/maven2/org/apache/maven/maven-project/2.0.10/maven-project-2.0.10.jar
2017-05-28T12:02:25.421 [INFO] Downloaded: https://repo.maven.apache.org/maven2/org/codehaus/groovy/groovy-xml/2.4.7/groovy-xml-2.4.7.jar
(211 KB at 620.7 KB/sec)
2017-05-28T12:02:25.422 [INFO] Downloading: https://repo.maven.apache.org/maven2/org/apache/maven/maven-settings/2.0.10/maven-settings-2.0.10.jar
2017-05-28T12:02:25.461 [INFO] Downloaded: https://repo.maven.apache.org/maven2/org/apache/maven/maven-settings/2.0.10/maven-settings-2.0.10.jar
(50 KB at 131.4 KB/sec)
2017-05-28T12:02:25.462 [INFO] Downloading: https://repo.maven.apache.org/maven2/org/apache/maven/maven-profile/2.0.10/maven-profile-2.0.10.jar
2017-05-28T12:02:25.466 [INFO] Downloaded: https://repo.maven.apache.org/maven2/org/apache/maven/maven-project/2.0.10/maven-project-2.0.10.jar
(121 KB at 313.3 KB/sec)
2017-05-28T12:02:25.466 [INFO] Downloading: https://repo.maven.apache.org/maven2/org/apache/maven/maven-plugin-registry/2.0.10/maven-plugin-registry-2.0.10.jar
2017-05-28T12:02:25.471 [INFO] Downloaded: https://repo.maven.apache.org/maven2/org/apache/ant/ant/1.9.4/ant-1.9.4.jar
(1972 KB at 5056.3 KB/sec)
2017-05-28T12:02:25.471 [INFO] Downloading: https://repo.maven.apache.org/maven2/org/codehaus/plexus/plexus-interpolation/1.1/plexus-interpolation-1.1.jar
2017-05-28T12:02:25.492 [INFO] Downloaded: https://repo.maven.apache.org/maven2/org/apache/maven/maven-profile/2.0.10/maven-profile-2.0.10.jar
(37 KB at 87.9 KB/sec)
2017-05-28T12:02:25.492 [INFO] Downloading: https://repo.maven.apache.org/maven2/commons-validator/commons-validator/1.2.0/commons-validator-1.2.0.jar
2017-05-28T12:02:25.498 [INFO] Downloaded: https://repo.maven.apache.org/maven2/org/apache/maven/maven-plugin-registry/2.0.10/maven-plugin-registry-2.0.10.jar
(30 KB at 71.3 KB/sec)
2017-05-28T12:02:25.498 [INFO] Downloading: https://repo.maven.apache.org/maven2/org/apache/maven/maven-plugin-api/2.0/maven-plugin-api-2.0.jar
2017-05-28T12:02:25.501 [INFO] Downloaded: https://repo.maven.apache.org/maven2/org/codehaus/plexus/plexus-interpolation/1.1/plexus-interpolation-1.1.jar
(35 KB at 82.7 KB/sec)
2017-05-28T12:02:25.501 [INFO] Downloading: https://repo.maven.apache.org/maven2/org/apache/maven/doxia/doxia-core/1.4/doxia-core-1.4.jar
2017-05-28T12:02:25.527 [INFO] Downloaded: https://repo.maven.apache.org/maven2/org/apache/maven/maven-plugin-api/2.0/maven-plugin-api-2.0.jar
(10 KB at 22.2 KB/sec)
2017-05-28T12:02:25.527 [INFO] Downloading: https://repo.maven.apache.org/maven2/org/apache/maven/shared/maven-doxia-tools/1.2.1/maven-doxia-tools-1.2.1.jar
2017-05-28T12:02:25.528 [INFO] Downloaded: https://repo.maven.apache.org/maven2/commons-validator/commons-validator/1.2.0/commons-validator-1.2.0.jar
(89 KB at 199.5 KB/sec)
2017-05-28T12:02:25.528 [INFO] Downloading: https://repo.maven.apache.org/maven2/org/apache/maven/maven-artifact-manager/2.0.6/maven-artifact-manager-2.0.6.jar
2017-05-28T12:02:25.572 [INFO] Downloaded: https://repo.maven.apache.org/maven2/org/apache/maven/shared/maven-doxia-tools/1.2.1/maven-doxia-tools-1.2.1.jar
(43 KB at 86.1 KB/sec)
2017-05-28T12:02:25.572 [INFO] Downloading: https://repo.maven.apache.org/maven2/org/apache/maven/maven-repository-metadata/2.0.6/maven-repository-metadata-2.0.6.jar
2017-05-28T12:02:25.573 [INFO] Downloaded: https://repo.maven.apache.org/maven2/org/apache/maven/doxia/doxia-core/1.4/doxia-core-1.4.jar
(162 KB at 328.0 KB/sec)
2017-05-28T12:02:25.573 [INFO] Downloading: https://repo.maven.apache.org/maven2/org/apache/maven/maven-model/2.0.6/maven-model-2.0.6.jar
2017-05-28T12:02:25.574 [INFO] Downloaded: https://repo.maven.apache.org/maven2/org/apache/maven/maven-artifact-manager/2.0.6/maven-artifact-manager-2.0.6.jar
(56 KB at 112.2 KB/sec)
2017-05-28T12:02:25.574 [INFO] Downloading: https://repo.maven.apache.org/maven2/org/codehaus/plexus/plexus-utils/1.5.6/plexus-utils-1.5.6.jar
2017-05-28T12:02:25.607 [INFO] Downloaded: https://repo.maven.apache.org/maven2/org/apache/maven/maven-repository-metadata/2.0.6/maven-repository-metadata-2.0.6.jar
(24 KB at 45.5 KB/sec)
2017-05-28T12:02:25.632 [INFO] Downloaded: https://repo.maven.apache.org/maven2/org/apache/maven/maven-model/2.0.6/maven-model-2.0.6.jar
(85 KB at 153.4 KB/sec)
2017-05-28T12:02:25.646 [INFO] Downloaded: https://repo.maven.apache.org/maven2/com/google/code/findbugs/findbugs/3.0.1/findbugs-3.0.1.jar
(3711 KB at 6544.3 KB/sec)
2017-05-28T12:02:25.654 [INFO] Downloaded: https://repo.maven.apache.org/maven2/org/codehaus/plexus/plexus-utils/1.5.6/plexus-utils-1.5.6.jar
(245 KB at 427.8 KB/sec)
[WARNING] Failed to getClass for org.codehaus.mojo.findbugs.FindBugsMojo
[WARNING] Failed to getClass for org.codehaus.mojo.findbugs.FindbugsViolationCheckMojo
[WARNING] Failed to getClass for org.codehaus.mojo.findbugs.FindbugsViolationCheckMojo
[JENKINS] Archiving disabled
[JENKINS] Archiving disabled
[JENKINS] Archiving disabled
[JENKINS] Archiving disabled
[JENKINS] Archiving disabled
[JENKINS] Archiving disabled
[JENKINS] Archiving disabled
[JENKINS] Archiving disabled
[JENKINS] Archiving disabled
[JENKINS] Archiving disabled
[JENKINS] Archiving disabled
[JENKINS] Archiving disabled
[JENKINS] Archiving disabled
2017-05-28T12:02:28.809 [INFO] ------------------------------------------------------------------------
2017-05-28T12:02:28.809 [INFO] Reactor Summary:
2017-05-28T12:02:28.809 [INFO] 
2017-05-28T12:02:28.809 [INFO] Apache Beam :: Parent .............................. SUCCESS
[ 22.677 s]
2017-05-28T12:02:28.809 [INFO] Apache Beam :: SDKs :: Java :: Build Tools ......... SUCCESS
[  9.263 s]
2017-05-28T12:02:28.809 [INFO] Apache Beam :: SDKs ................................ SUCCESS
[  2.200 s]
2017-05-28T12:02:28.809 [INFO] Apache Beam :: SDKs :: Common ...................... SUCCESS
[  1.236 s]
2017-05-28T12:02:28.809 [INFO] Apache Beam :: SDKs :: Common :: Fn API ............ FAILURE
[  8.519 s]
2017-05-28T12:02:28.809 [INFO] Apache Beam :: SDKs :: Common :: Runner API ........ SKIPPED
2017-05-28T12:02:28.809 [INFO] Apache Beam :: SDKs :: Java ........................ SKIPPED
2017-05-28T12:02:28.809 [INFO] Apache Beam :: SDKs :: Java :: Core ................ SKIPPED
2017-05-28T12:02:28.809 [INFO] Apache Beam :: Runners ............................. SKIPPED
2017-05-28T12:02:28.809 [INFO] Apache Beam :: Runners :: Core Construction Java ... SKIPPED
2017-05-28T12:02:28.809 [INFO] Apache Beam :: Runners :: Core Java ................ SKIPPED
2017-05-28T12:02:28.809 [INFO] Apache Beam :: Runners :: Apex ..................... SKIPPED
2017-05-28T12:02:28.809 [INFO] ------------------------------------------------------------------------
2017-05-28T12:02:28.809 [INFO] BUILD FAILURE
2017-05-28T12:02:28.809 [INFO] ------------------------------------------------------------------------
2017-05-28T12:02:28.810 [INFO] Total time: 01:07 min
2017-05-28T12:02:28.810 [INFO] Finished at: 2017-05-28T12:02:28+00:00
2017-05-28T12:02:29.253 [INFO] Final Memory: 68M/826M
2017-05-28T12:02:29.253 [INFO] ------------------------------------------------------------------------
2017-05-28T12:02:29.253 [WARNING] The requested profile "validates-runner-tests" could not
be activated because it does not exist.
Waiting for Jenkins to finish collecting data
2017-05-28T12:02:30.271 [ERROR] Failed to execute goal org.codehaus.mojo:findbugs-maven-plugin:3.0.4:findbugs
(findbugs) on project beam-sdks-common-fn-api: Execution findbugs of goal org.codehaus.mojo:findbugs-maven-plugin:3.0.4:findbugs
failed: Plugin org.codehaus.mojo:findbugs-maven-plugin:3.0.4 or one of its dependencies could
not be resolved: Could not transfer artifact org.codehaus.groovy:groovy:jar:2.4.7 from/to
central (https://repo.maven.apache.org/maven2): GET request of: org/codehaus/groovy/groovy/2.4.7/groovy-2.4.7.jar
from central failed: Connection reset -> [Help 1]
2017-05-28T12:02:30.271 [ERROR] 
2017-05-28T12:02:30.272 [ERROR] To see the full stack trace of the errors, re-run Maven with
the -e switch.
2017-05-28T12:02:30.272 [ERROR] Re-run Maven using the -X switch to enable full debug logging.
2017-05-28T12:02:30.272 [ERROR] 
2017-05-28T12:02:30.272 [ERROR] For more information about the errors and possible solutions,
please read the following articles:
2017-05-28T12:02:30.272 [ERROR] [Help 1] http://cwiki.apache.org/confluence/display/MAVEN/PluginResolutionException
2017-05-28T12:02:30.273 [ERROR] 
2017-05-28T12:02:30.273 [ERROR] After correcting the problems, you can resume the build with
the command
2017-05-28T12:02:30.273 [ERROR]   mvn <goals> -rf :beam-sdks-common-fn-api
channel stopped

Mime
View raw message